{"text_format":"1","workbook":"xlsx","n_sheets":6,"sheets":["VENTE","ACHAT","RECAP","CA","XML","X"],"not_rendered":{"charts":0,"images":0,"macros":1,"external_links":1,"defined_names":52,"comments":3,"pivot_tables":1},"unopened":[],"bounds":{"document_bytes":16777216,"sheet_cells":100000,"rows_first":2000,"rows_last":500,"rows_between":2000,"halvings":0,"cell_chars":16384,"cell_head_chars":4096},"cells_cut":0,"cells_raw":0,"read":"whole","date_system":"1900"}

{"sheet":"VENTE","index":0,"n_rows":900,"n_cols":11,"rows_kept":900,"cut":false,"hidden":false,"merged":[[0,0,0,10],[1,2,1,4],[1,5,1,6]]}
["TABLEAU DES VENTES"]
[null,null,"ANNEE DE DECLARATION",null,null,"2016-01-01"]
["Date","N°Fact","Raison Social","Montant Ht","Tx %","Tva","Montant TTC","Mode Reg","Date Reg","Mois Decl","Mode paiement"]
["2015-05-27",150219,"CLIENT 031",1515.83,0.2,303.17,1819,"CHQ 2748357","2016-01-20","2016-01-01",{"$f":"IF(COUNTIF(H4,\"*EF*\"),5,IF(COUNTIF(H4,\"*ES*\"),1,IF(COUNTIF(H4,\"*CH*\"),2,IF(COUNTIF(H4,\"*PR*\"),3,IF(COUNTIF(H4,\"*CO*\"),6,IF(COUNTIF(H4,\"*VI*\"),4,7))))))","v":2}]
["2015-05-30",150188,"CLIENT 031",8658.5,0.2,1731.7,10390.200000000001,"CHQ 2748357","2016-01-20","2016-01-01",2]
["2015-07-06",150227,"CLIENT 031",3587.5,0.2,717.5,4305,"CHQ 2748357","2016-01-20","2016-01-01",2]
["2015-08-30",150269,"CLIENT 031",625,0.2,125,750,"CHQ 2748357","2016-01-20","2016-01-01",2]
["2015-09-30",150295,"CLIENT 031",2322.5,0.2,464.5,2787,"CHQ 2748357","2016-01-20","2016-01-01",2]
["2015-09-30",150296,"CLIENT 011",7466.67,0.2,1493.33,8960,"EFFET","2016-01-04","2016-01-01",5]
["2015-09-30",150297,"CLIENT 011",6520.42,0.2,1304.08,7824.5,"EFFET","2016-01-04","2016-01-01",5]
["2015-11-30",150324,"CLIENT 014",2150.83,0.2,430.17,2581,"CHQ ","2016-01-08","2016-01-01",2]
["2015-11-30",150347,"CLIENT 031",8311.67,0.2,1662.33,9974,"CHQ 2748357","2016-01-20","2016-01-01",2]
["2016-01-05",160001,"CLIENT 002",291.67,"20%",58.33,350,"ESPECES","2016-01-05","2016-01-01",1]
["2016-01-06",160002,"CLIENT 002",291.67,"20%",58.33,350,"ESPECES","2016-01-06","2016-01-01",1]
["2016-01-06",160003,"CLIENT 002",855,"20%",171,1026,"ESPECES","2016-01-06","2016-01-01",1]
["2016-01-06",160004,"CLIENT 002",2497.83,"20%",499.57,2997.4,"ESPECES","2016-01-06","2016-01-01",1]
["2016-01-08",160005,"CLIENT 002",4020,"20%",804,4824,"ESPECES","2016-01-08","2016-01-01",1]
["2016-01-09",160006,"CLIENT 002",1826.67,"20%",365.33,2192,"ESPECES","2016-01-09","2016-01-01",1]
["2016-01-10",160007,"CLIENT 002",1094.17,"20%",218.83,1313,"ESPECES","2016-01-10","2016-01-01",1]
["2016-01-11",160008,"CLIENT 002",833.33,"20%",166.67,1000,"ESPECES","2016-01-11","2016-01-01",1]
["2016-01-12",160009,"CLIENT 071",1898.33,"20%",379.67,2278,"ESPECES","2016-01-12","2016-01-01",1]
["2016-01-12",160010,"CLIENT 002",116.67,"20%",23.33,140,"ESPECES","2016-01-12","2016-01-01",1]
["2016-01-12",160011,"CLIENT 002",241.67,"20%",48.33,290,"ESPECES","2016-01-12","2016-01-01",1]
["2016-01-12",160012,"CLIENT 036",6118.33,"20%",1223.67,7342,"CHQ  5307210","2016-01-12","2016-01-01",2]
["2016-01-13",160013,"CLIENT 002",41.67,"20%",8.33,50,"ESPECES","2016-01-13","2016-01-01",1]
["2016-01-13",160014,"CLIENT 002",375,"20%",75,450,"ESPECES","2016-01-13","2016-01-01",1]
["2016-01-14",160015,"CLIENT 004",359.58,"20%",71.92,431.5,"ESPECES","2016-01-14","2016-01-01",1]
["2016-01-14",160016,"CLIENT 002",213.33,"20%",42.67,256,"ESPECES","2016-01-14","2016-01-01",1]
["2016-01-25",160017,"CLIENT 009",617.91999999999996,"20%",123.58,741.5,"ESPECES","2016-01-25","2016-01-01",1]
["2016-01-26",160018,"CLIENT 002",266.67,"20%",53.33,320,"ESPECES","2016-01-26","2016-01-01",1]
["2016-01-29",160019,"CLIENT 007",537.25,"20%",107.45,644.70000000000005,"ESPECES","2016-01-29","2016-01-01",1]
["2016-01-30",160020,"CLIENT 014",166.67,"20%",33.33,200,"ESPECES","2016-01-30","2016-01-01",1]
["2016-01-30",160026,"CLIENT 007",537.25,"20%",107.45,644.70000000000005,"ESPECES","2016-01-30","2016-01-01",1]
["2015-10-30",150323,"CLIENT 011",4106.67,0.2,821.33,4928,"EFFET","2016-02-03","2016-02-01",5]
["2015-12-16",150365,"CLIENT 013",2240,0.2,448,2688,"CHQ ","2016-02-06","2016-02-01",2]
["2016-02-01",160031,"CLIENT 004",200,"20%",40,240,"ESPECES","2016-02-01","2016-02-01",1]
["2016-02-01",160032,"CLIENT 005",242.67,"20%",48.53,291.2,"ESPECES","2016-02-01","2016-02-01",1]
["2016-02-01",160033,"CLIENT 002",531,"20%",106.2,637.20000000000005,"ESPECES","2016-02-01","2016-02-01",1]
["2016-02-01",160034,"CLIENT 002",516.66999999999996,"20%",103.33,620,"ESPECES","2016-02-01","2016-02-01",1]
["2016-02-01",160035,"CLIENT 024",175,"20%",35,210,"ESPECES","2016-02-01","2016-02-01",1]
["2016-02-01",160036,"CLIENT 002",162.5,"20%",32.5,195,"ESPECES","2016-02-01","2016-02-01",1]
["2016-02-03",160037,"CLIENT 002",102.92,"20%",20.58,123.5,"ESPECES","2016-02-03","2016-02-01",1]
["2016-02-03",160038,"CLIENT 037",570.83000000000004,"20%",114.17,685,"ESPECES","2016-02-03","2016-02-01",1]
["2016-02-03",160039,"CLIENT 007",145.83000000000001,"20%",29.17,175,"ESPECES","2016-02-03","2016-02-01",1]
["2016-02-03",160040,"CLIENT 002",300,"20%",60,360,"ESPECES","2016-02-03","2016-02-01",1]
["2016-02-03",160041,"CLIENT 002",112.5,"20%",22.5,135,"ESPECES","2016-02-03","2016-02-01",1]
["2016-02-03",160042,"CLIENT 002",7237.5,"20%",1447.5,8685,"ESPECES","2016-02-03","2016-02-01",1]
["2016-02-03",160043,"CLIENT 002",6562.5,"20%",1312.5,7875,"ESPECES","2016-02-03","2016-02-01",1]
["2016-02-03",160044,"CLIENT 002",376.67,"20%",75.33,452,"ESPECES","2016-02-03","2016-02-01",1]
["2016-02-05",160045,"CLIENT 043",316.67,"20%",63.33,380,"ESPECES","2016-02-05","2016-02-01",1]
["2016-02-05",160046,"CLIENT 002",597.66999999999996,"20%",119.53,717.2,"ESPECES","2016-02-05","2016-02-01",1]
["2016-02-06",160047,"CLIENT 002",883.83,"20%",176.77,1060.5999999999999,"ESPECES","2016-02-06","2016-02-01",1]
["2016-02-06",160048,"CLIENT 002",1159.17,"20%",231.83,1391,"ESPECES","2016-02-06","2016-02-01",1]
["2016-02-08",160049,"CLIENT 002",2005,"20%",401,2406,"ESPECES","2016-02-08","2016-02-01",1]
["2016-02-10",160050,"CLIENT 002",180.83,"20%",36.17,217,"ESPECES","2016-02-10","2016-02-01",1]
["2016-02-11",160051,"CLIENT 045",9250,"20%",1850,11100,"CHQ  8881358 BMCI","2016-02-11","2016-02-01",2]
["2016-02-15",160052,"CLIENT 002",782.5,"20%",156.5,939,"ESPECES","2016-02-15","2016-02-01",1]
["2016-02-15",160053,"CLIENT 002",47.92,"20%",9.58,57.5,"ESPECES","2016-02-15","2016-02-01",1]
["2016-02-16",160054,"CLIENT 002",208.33,"20%",41.67,250,"ESPECES","2016-02-16","2016-02-01",1]
["2016-02-17",160055,"CLIENT 002",104.17,"20%",20.83,125,"ESPECES","2016-02-17","2016-02-01",1]
["2016-02-19",160056,"CLIENT 002",297.5,"20%",59.5,357,"ESPECES","2016-02-19","2016-02-01",1]
["2016-02-20",160057,"CLIENT 002",248.33,"20%",49.67,298,"ESPECES","2016-02-20","2016-02-01",1]
["2016-02-24",160058,"CLIENT 002",1276.25,"20%",255.25,1531.5,"ESPECES","2016-02-24","2016-02-01",1]
["2016-02-25",160059,"CLIENT 002",418.92,"20%",83.78,502.7,"ESPECES","2016-02-25","2016-02-01",1]
["2016-02-27",160060,"CLIENT 065",694.17,"20%",138.83000000000001,833,"ESPECES","2016-02-27","2016-02-01",1]
["2016-02-27",160061,"CLIENT 002",373.33,"20%",74.67,448,"ESPECES","2016-02-27","2016-02-01",1]
["2016-02-29",160062,"CLIENT 013",660,"20%",132,792,"ESPECES","2016-02-29","2016-02-01",1]
["2016-02-29",160063,"CLIENT 002",295,"20%",59,354,"ESPECES","2016-02-29","2016-02-01",{"$f":"IF(COUNTIF(H68,\"*EF*\"),5,IF(COUNTIF(H68,\"*ES*\"),1,IF(COUNTIF(H68,\"*CH*\"),2,IF(COUNTIF(H68,\"*PR*\"),3,IF(COUNTIF(H68,\"*CO*\"),6,IF(COUNTIF(H68,\"*VI*\"),4,7))))))","v":1}]
["2016-02-29",160065,"CLIENT 014",473.33,"20%",94.67,568,"ESPECES","2016-02-29","2016-02-01",1]
["2016-02-29",160068,"CLIENT 014",145.83000000000001,"20%",29.17,175,"ESPECES","2016-02-29","2016-02-01",1]
["2016-02-29",160071,"CLIENT 033",4333.33,"20%",866.67,5200,"ESPECES","2016-02-29","2016-02-01",1]
["2016-02-29",160072,"CLIENT 002",3970.83,"20%",794.17,4765,"ESPECES","2016-02-29","2016-02-01",1]
["2016-02-29",160073,"CLIENT 002",1916.67,"20%",383.33,2300,"ESPECES","2016-02-29","2016-02-01",1]
["2015-11-30",150345,"CLIENT 014",958.33,0.2,191.67,1150,"CHQ 8266","2016-03-10","2016-03-01",2]
["2015-11-30",150352,"CLIENT 011",5368.33,0.2,1073.67,6442,"EFFET","2016-03-06","2016-03-01",5]
["2015-11-30",150353,"CLIENT 011",462.5,0.2,92.5,555,"EFFET","2016-03-06","2016-03-01",5]
["2015-12-31",150383,"CLIENT 069",5835,0.2,1167,7002,"CHQ 2615","2016-03-04","2016-03-01",2]
["2015-12-31",150384,"CLIENT 069",3183.33,0.2,636.66999999999996,3820,"CHQ 2615","2016-03-04","2016-03-01",2]
["2015-12-31",150385,"CLIENT 069",3766.67,0.2,753.33,4520,"CHQ 2615","2016-03-04","2016-03-01",2]
["2016-01-30",160022,"CLIENT 012",2162.33,"20%",432.47,2594.8000000000002,"CHQ 67925","2016-03-10","2016-03-01",2]
["2016-01-30",160027,"CLIENT 012",1212.08,"20%",242.42,1454.5,"CHQ 67925","2016-03-10","2016-03-01",2]
["2016-02-29",160064,"CLIENT 012",1897.5,"20%",379.5,2277,"CHQ 67925","2016-03-10","2016-03-01",2]
["2016-03-01",160074,"CLIENT 002",500,"20%",100,600,"ESPECES","2016-03-01","2016-03-01",1]
["2016-03-02",160075,"CLIENT 002",616.66999999999996,"20%",123.33,740,"ESPECES","2016-03-02","2016-03-01",1]
["2016-03-02",160076,"CLIENT 002",175,"20%",35,210,"ESPECES","2016-03-02","2016-03-01",1]
["2016-03-03",160077,"CLIENT 002",103.33,"20%",20.67,124,"ESPECES","2016-03-03","2016-03-01",1]
["2016-03-03",160078,"CLIENT 022",150,"20%",30,180,"ESPECES","2016-03-03","2016-03-01",1]
["2016-03-03",160079,"CLIENT 076",24695,"20%",4939,29634,"CHQ  3686591","2016-03-03","2016-03-01",2]
["2016-03-03",160080,"CLIENT 076",8638.33,"20%",1727.67,10366,"CHQ  3686591","2016-03-03","2016-03-01",2]
["2016-03-04",160081,"CLIENT 061",291.67,"20%",58.33,350,"ESPECES","2016-03-04","2016-03-01",1]
["2016-03-04",160082,"CLIENT 001",944.67,"20%",188.93,1133.5999999999999,"ESPECES","2016-03-04","2016-03-01",1]
["2016-03-04",160083,"CLIENT 002",226.67,"20%",45.33,272,"ESPECES","2016-03-04","2016-03-01",1]
["2016-03-06",160084,"CLIENT 002",330,"20%",66,396,"ESPECES","2016-03-06","2016-03-01",1]
["2016-03-07",160085,"CLIENT 003",0,"20%",0,0,"ESPECES","2016-03-07","2016-03-01",1]
["2016-03-07",160086,"CLIENT 002",364.17,"20%",72.83,437,"ESPECES","2016-03-07","2016-03-01",1]
["2016-03-08",160087,"CLIENT 002",291.67,"20%",58.33,350,"ESPECES","2016-03-08","2016-03-01",1]
["2016-03-08",160088,"CLIENT 002",425,"20%",85,510,"ESPECES","2016-03-08","2016-03-01",1]
["2016-03-10",160089,"CLIENT 002",200,"20%",40,240,"ESPECES","2016-03-10","2016-03-01",1]
["2016-03-10",160090,"CLIENT 002",141.66999999999999,"20%",28.33,170,"ESPECES","2016-03-10","2016-03-01",1]
["2016-03-11",160091,"CLIENT 004",58.33,"20%",11.67,70,"ESPECES","2016-03-11","2016-03-01",1]
["2016-03-12",160092,"CLIENT 002",257.5,"20%",51.5,309,"ESPECES","2016-03-12","2016-03-01",1]
["2016-03-12",160093,"CLIENT 005",1236.17,"20%",247.23,1483.4,"ESPECES","2016-03-12","2016-03-01",1]
["2016-03-12",160094,"CLIENT 002",216.67,"20%",43.33,260,"ESPECES","2016-03-12","2016-03-01",1]
["2016-03-15",160095,"CLIENT 002",414.58,"20%",82.92,497.5,"ESPECES","2016-03-15","2016-03-01",1]
["2016-03-16",160096,"CLIENT 002",281.67,"20%",56.33,338,"ESPECES","2016-03-16","2016-03-01",1]
["2016-03-17",160097,"CLIENT 002",537.5,"20%",107.5,645,"ESPECES","2016-03-17","2016-03-01",1]
["2016-03-17",160098,"CLIENT 006",442.5,"20%",88.5,531,"ESPECES","2016-03-17","2016-03-01",1]
["2016-03-18",160099,"CLIENT 007",166.67,"20%",33.33,200,"ESPECES","2016-03-18","2016-03-01",1]
["2016-03-19",160100,"CLIENT 002",835.42,"20%",167.08,1002.5,"ESPECES","2016-03-19","2016-03-01",1]
["2016-03-21",160101,"CLIENT 005",533.33000000000004,"20%",106.67,640,"ESPECES","2016-03-21","2016-03-01",1]
["2016-03-22",160102,"CLIENT 002",358.33,"20%",71.67,430,"ESPECES","2016-03-22","2016-03-01",1]
["2016-03-24",160103,"CLIENT 002",297.92,"20%",59.58,357.5,"ESPECES","2016-03-24","2016-03-01",1]
["2016-03-25",160104,"CLIENT 002",1833.33,"20%",366.67,2200,"ESPECES","2016-03-25","2016-03-01",1]
["2016-03-26",160105,"CLIENT 008",1716.67,"20%",343.33,2060,"ESPECES","2016-03-26","2016-03-01",1]
["2016-03-26",160106,"CLIENT 002",262.5,"20%",52.5,315,"ESPECES","2016-03-26","2016-03-01",1]
["2016-03-28",160107,"CLIENT 002",565,"20%",113,678,"ESPECES","2016-03-28","2016-03-01",1]
["2016-03-28",160108,"CLIENT 002",173.83,"20%",34.770000000000003,208.6,"ESPECES","2016-03-28","2016-03-01",1]
["2016-03-28",160109,"CLIENT 002",518.66999999999996,"20%",103.73,622.4,"ESPECES","2016-03-28","2016-03-01",1]
["2016-03-29",160110,"CLIENT 002",456.67,"20%",91.33,548,"ESPECES","2016-03-29","2016-03-01",1]
["2016-03-30",160111,"CLIENT 009",402.5,"20%",80.5,483,"ESPECES","2016-03-30","2016-03-01",1]
["2016-03-31",160112,"CLIENT 002",687.5,"20%",137.5,825,"ESPECES","2016-03-31","2016-03-01",1]
["2015-11-30",150346,"CLIENT 010",954.17,0.2,190.83,1145,"CHQ 9915261","2016-04-22","2016-04-01",2]
["2015-11-30",150348,"CLIENT 010",2975,0.2,595,3570,"CHQ 9915261","2016-04-22","2016-04-01",2]
["2015-11-30",150354,"CLIENT 010",187.5,0.2,37.5,225,"CHQ 9915261","2016-04-22","2016-04-01",2]
["2015-12-31",150382,"CLIENT 011",3252.5,0.2,650.5,3903,"CHQ 9701508","2016-04-01","2016-04-01",2]
["2015-12-31",150387,"CLIENT 010",1583.33,0.2,316.67,1900,"CHQ 9915261","2016-04-22","2016-04-01",2]
["2016-01-30",160021,"CLIENT 006",775,"20%",155,930,"CHQ 333252","2016-04-20","2016-04-01",2]
["2016-01-30",160023,"CLIENT 012",7873.42,"20%",1574.68,9448.1,"CHQ ","2016-04-05","2016-04-01",2]
["2016-01-30",160024,"CLIENT 010",650.83000000000004,"20%",130.16999999999999,781,"CHQ 9915261","2016-04-22","2016-04-01",2]
["2016-01-30",160025,"CLIENT 006",220.83,"20%",44.17,265,"CHQ 333252","2016-04-20","2016-04-01",2]
["2016-02-29",160067,"CLIENT 013",840.83,"20%",168.17,1009,"CHQ 780197","2016-04-01","2016-04-01",2]
["2016-03-04",160128,"CLIENT 002",585,"20%",117,702,"ESPECES","2016-03-04","2016-04-01",{"$f":"IF(COUNTIF(H132,\"*EF*\"),5,IF(COUNTIF(H132,\"*ES*\"),1,IF(COUNTIF(H132,\"*CH*\"),2,IF(COUNTIF(H132,\"*PR*\"),3,IF(COUNTIF(H132,\"*CO*\"),6,IF(COUNTIF(H132,\"*VI*\"),4,7))))))","v":1}]
["2016-03-31",160114,"CLIENT 006",1066.67,"20%",213.33,1280,"CHQ 333252","2016-04-20","2016-04-01",2]
["2016-03-31",160115,"CLIENT 014",1978.33,"20%",395.67,2374,"CHQ 5703745","2016-04-20","2016-04-01",2]
["2016-03-31",160116,"CLIENT 015",3625,"20%",725,4350,"CHQ 962155","2016-04-22","2016-04-01",2]
["2016-03-31",160117,"CLIENT 013",3390,"20%",678,4068,"CHQ 408561","2016-04-22","2016-04-01",2]
["2016-03-31",160121,"CLIENT 013",555.83000000000004,"20%",111.17,667,"CHQ 780197","2016-04-01","2016-04-01",2]
["2016-04-01",160124,"CLIENT 016",1416.67,"20%",283.33,1700,"ESPECES","2016-04-01","2016-04-01",1]
["2016-04-01",160125,"CLIENT 002",788.75,"20%",157.75,946.5,"ESPECES","2016-04-01","2016-04-01",1]
["2016-04-01",160127,"CLIENT 017",12500,"20%",2500,15000,"CHQ ","2016-04-02","2016-04-01",2]
["2016-04-05",160129,"CLIENT 002",524.16999999999996,"20%",104.83,629,"ESPECES","2016-04-05","2016-04-01",1]
["2016-04-12",160130,"CLIENT 002",180,"20%",36,216,"ESPECES","2016-04-12","2016-04-01",1]
["2016-04-14",160131,"CLIENT 018",1758.33,"20%",351.67,2110,"ESPECES","2016-04-14","2016-04-01",1]
["2016-04-14",160132,"CLIENT 002",994.17,"20%",198.83,1193,"ESPECES","2016-04-14","2016-04-01",1]
["2016-04-14",160133,"CLIENT 019",20833.330000000002,"20%",4166.67,25000,"CHQ ","2016-04-14","2016-04-01",2]
["2016-04-14",160134,"CLIENT 020",366.67,"20%",73.33,440,"ESPECES","2016-04-04","2016-04-01",1]
["2016-04-18",160135,"CLIENT 002",300,"20%",60,360,"ESPECES","2016-04-18","2016-04-01",1]
["2016-04-19",160136,"CLIENT 002",475.83,"20%",95.17,571,"ESPECES","2016-04-19","2016-04-01",1]
["2016-04-20",160137,"CLIENT 002",291.67,"20%",58.33,350,"ESPECES","2016-04-20","2016-04-01",1]
["2016-04-22",160138,"CLIENT 021",200,"20%",40,240,"ESPECES","2016-04-22","2016-04-01",1]
["2016-04-26",160139,"CLIENT 002",533.33000000000004,"20%",106.67,640,"ESPECES","2016-04-26","2016-04-01",1]
["2016-04-26",160140,"CLIENT 002",229.17,"20%",45.83,275,"ESPECES","2016-04-26","2016-04-01",1]
["2016-04-26",160141,"CLIENT 007",225,"20%",45,270,"ESPECES","2016-04-26","2016-04-01",1]
["2016-04-28",160142,"CLIENT 022",400,"20%",80,480,"ESPECES","2016-04-28","2016-04-01",1]
["2016-04-29",160143,"CLIENT 002",308.33,"20%",61.67,370,"ESPECES","2016-04-29","2016-04-01",1]
["2016-04-29",160149,"CLIENT 003",0,"20%",0,0,null,"2016-04-29","2016-04-01",7]
["2016-04-29",160150,"CLIENT 014",75,"20%",15,90,"ESPECES","2016-04-29","2016-04-01",1]
["2016-03-31",160113,"CLIENT 012",2263.5,"20%",452.7,2716.2,"CHQ ","2016-05-01","2016-05-01",2]
["2016-03-31",160118,"CLIENT 015",3390,"20%",678,4068,"CHQ ","2016-05-01","2016-05-01",2]
["2016-03-31",160122,"CLIENT 015",3912.5,"20%",782.5,4695,"CHQ ","2016-05-01","2016-05-01",2]
["2016-03-31",160122,"CLIENT 015",4845.83,"20%",969.17,5815,"ESPECES","2016-03-31","2016-05-01",1]
["2016-04-01",160126,"CLIENT 023",1267.08,"20%",253.42,1520.5,"CHQ  7237 BP ","2016-05-01","2016-05-01",2]
["2016-05-02",160153,"CLIENT 002",537.5,"20%",107.5,645,"ESPECES","2016-05-02","2016-05-01",1]
["2016-05-03",160154,"CLIENT 024",438.33,"20%",87.67,526,"CHQ ","2016-05-01","2016-05-01",2]
["2016-05-07",160155,"CLIENT 023",112.5,"20%",22.5,135,"ESPECES","2016-05-07","2016-05-01",1]
["2016-05-09",160156,"CLIENT 018",66.67,"20%",13.33,80,"ESPECES","2016-05-09","2016-05-01",1]
["2016-05-09",160157,"CLIENT 002",645.83000000000004,"20%",129.16999999999999,775,"ESPECES","2016-05-09","2016-05-01",1]
["2016-05-11",160158,"CLIENT 002",291.67,"20%",58.33,350,"ESPECES","2016-05-11","2016-05-01",1]
["2016-05-12",160159,"CLIENT 025",32.5,"20%",6.5,39,"ESPECES","2016-05-12","2016-05-01",1]
["2016-05-12",160160,"CLIENT 002",250,"20%",50,300,"ESPECES","2016-05-12","2016-05-01",1]
["2016-05-13",160161,"CLIENT 026",600,"20%",120,720,"ESPECES","2016-05-13","2016-05-01",1]
["2016-05-16",160162,"CLIENT 002",333.33,"20%",66.67,400,"ESPECES","2016-05-16","2016-05-01",1]
["2016-05-16",160164,"CLIENT 027",54.17,"20%",10.83,65,"ESPECES","2016-05-16","2016-05-01",1]
["2016-05-16",160165,"CLIENT 028",1416.67,"20%",283.33,1700,"ESPECES","2016-05-16","2016-05-01",1]
["2016-05-17",160163,"CLIENT 002",333.33,"20%",66.67,400,"ESPECES","2016-05-17","2016-05-01",1]
["2016-05-18",160166,"CLIENT 002",541.66999999999996,"20%",108.33,650,"ESPECES","2016-05-18","2016-05-01",1]
["2016-05-18",160167,"CLIENT 028",107.5,"20%",21.5,129,"ESPECES","2016-05-18","2016-05-01",1]
["2016-05-18",160168,"CLIENT 002",200,"20%",40,240,"ESPECES","2016-05-18","2016-05-01",1]
["2016-05-19",160169,"CLIENT 023",116.67,"20%",23.33,140,"ESPECES","2016-05-19","2016-05-01",1]
["2016-05-19",160170,"CLIENT 002",233.33,"20%",46.67,280,"ESPECES","2016-05-19","2016-05-01",1]
["2016-05-19",160171,"CLIENT 002",153.66999999999999,"20%",30.73,184.4,"ESPECES","2016-05-19","2016-05-01",1]
["2016-05-19",160173,"CLIENT 027",50,"20%",10,60,"ESPECES","2016-05-19","2016-05-01",1]
["2016-05-19",160174,"CLIENT 002",100,"20%",20,120,"ESPECES","2016-05-19","2016-05-01",1]
["2016-05-20",160175,"CLIENT 018",100,"20%",20,120,"ESPECES","2016-05-20","2016-05-01",1]
["2016-05-21",160176,"CLIENT 029",116.67,"20%",23.33,140,"ESPECES","2016-05-21","2016-05-01",1]
["2016-05-23",160177,"CLIENT 002",146.66999999999999,"20%",29.33,176,"ESPECES","2016-05-23","2016-05-01",1]
["2016-05-24",160178,"CLIENT 002",379.17,"20%",75.83,455,"ESPECES","2016-05-24","2016-05-01",1]
["2016-05-26",160179,"CLIENT 002",528.33000000000004,"20%",105.67,634,"ESPECES","2016-05-26","2016-05-01",1]
["2016-05-28",160180,"CLIENT 007",293.33,"20%",58.67,352,"ESPECES","2016-05-28","2016-05-01",1]
["2016-05-31",160187,"CLIENT 030",4312.08,"20%",862.42,5174.5,"CHQ ","2016-05-01","2016-05-01",2]
["2016-05-31",160188,"CLIENT 030",1939.17,"20%",387.83,2327,"CHQ ","2016-05-01","2016-05-01",2]
["2016-05-31",160189,"CLIENT 002",160.83000000000001,"20%",32.17,193,"ESPECES","2016-05-31","2016-05-01",1]
["2016-03-31",160122,"CLIENT 015",7500,"20%",1500,9000,"CHQ ","2016-06-01","2016-06-01",2]
["2016-03-31",160123,"CLIENT 031",1190.83,"20%",238.17,1429,"CHQ ","2016-06-01","2016-06-01",2]
["2016-04-29",160145,"CLIENT 012",5072.5,"20%",1014.5,6087,"CHQ ","2016-07-01","2016-06-01",2]
["2016-04-29",160148,"CLIENT 031",166.67,"20%",33.33,200,"ESPECES","2016-04-29","2016-06-01",{"$f":"IF(COUNTIF(H196,\"*EF*\"),5,IF(COUNTIF(H196,\"*ES*\"),1,IF(COUNTIF(H196,\"*CH*\"),2,IF(COUNTIF(H196,\"*PR*\"),3,IF(COUNTIF(H196,\"*CO*\"),6,IF(COUNTIF(H196,\"*VI*\"),4,7))))))","v":1}]
["2016-05-31",160181,"CLIENT 006",3475,"20%",695,4170,"CHQ ","2016-07-01","2016-06-01",2]
["2016-06-01",160190,"CLIENT 032",533.33000000000004,"20%",106.67,640,"ESPECES","2016-06-01","2016-06-01",1]
["2016-06-01",160191,"CLIENT 018",50,"20%",10,60,"ESPECES","2016-06-01","2016-06-01",1]
["2016-06-01",160192,"CLIENT 008",383.33,"20%",76.67,460,"ESPECES","2016-06-01","2016-06-01",1]
["2016-06-01",160193,"CLIENT 033",1250,"20%",250,1500,"ESPECES","2016-06-01","2016-06-01",1]
["2016-06-02",160194,"CLIENT 034",2350.83,"20%",470.17,2821,"ESPECES","2016-06-02","2016-06-01",1]
["2016-06-02",160195,"CLIENT 008",1656.67,"20%",331.33,1988,"ESPECES","2016-06-02","2016-06-01",1]
["2016-06-03",160196,"CLIENT 008",456.67,"20%",91.33,548,"ESPECES","2016-06-03","2016-06-01",1]
["2016-06-03",160197,"CLIENT 035",138.33000000000001,"20%",27.67,166,"ESPECES","2016-06-03","2016-06-01",1]
["2016-06-09",160198,"CLIENT 015",604.16999999999996,"20%",120.83,725,"ESPECES","2016-06-09","2016-06-01",1]
["2016-06-09",160199,"CLIENT 002",87.5,"20%",17.5,105,"ESPECES","2016-06-09","2016-06-01",1]
["2016-06-10",160200,"CLIENT 002",245.83,"20%",49.17,295,"ESPECES","2016-06-10","2016-06-01",1]
["2016-06-14",160201,"CLIENT 015",175,"20%",35,210,"ESPECES","2016-06-14","2016-06-01",1]
["2016-06-20",160202,"CLIENT 002",100,"20%",20,120,"ESPECES","2016-06-20","2016-06-01",1]
["2016-06-22",160203,"CLIENT 027",120.42,"20%",24.08,144.5,"ESPECES","2016-06-22","2016-06-01",1]
["2016-06-22",160204,"CLIENT 015",387.5,"20%",77.5,465,"ESPECES","2016-06-22","2016-06-01",1]
["2016-06-24",160205,"CLIENT 015",525,"20%",105,630,"ESPECES","2016-06-24","2016-06-01",1]
["2016-06-30",160206,"CLIENT 007",166.67,"20%",33.33,200,"ESPECES","2016-06-30","2016-06-01",1]
["2016-06-30",160211,"CLIENT 036",1666.67,"20%",333.33,2000,"CHQ ","2016-06-01","2016-06-01",2]
["2016-06-30",160212,"CLIENT 037",3333.33,"20%",666.67,4000,"CHQ 9713 ATW","2016-07-01","2016-06-01",2]
["2016-06-30",160213,"CLIENT 002",6585,"20%",1317,7902,"ESPECES","2016-06-30","2016-06-01",1]
["2016-06-30",160214,"CLIENT 002",6255.83,"20%",1251.17,7507,"ESPECES","2016-06-30","2016-06-01",1]
["2016-01-30",160028,"CLIENT 011",7050,"20%",1410,8460,"EFFET","2016-07-04","2016-07-01",5]
["2016-01-30",160029,"CLIENT 011",3045,"20%",609,3654,"EFFET","2016-07-04","2016-07-01",5]
["2016-01-30",160030,"CLIENT 011",1315,"20%",263,1578,"EFFET","2016-07-04","2016-07-01",5]
["2016-02-29",160066,"CLIENT 010",9645.83,"20%",1929.17,11575,"CHQ ","2016-07-29","2016-07-01",2]
["2016-02-29",160069,"CLIENT 011",8258.75,"20%",1651.75,9910.5,"EFFET","2016-07-04","2016-07-01",5]
["2016-02-29",160070,"CLIENT 011",1560,"20%",312,1872,"EFFET","2016-07-04","2016-07-01",5]
["2016-04-29",160144,"CLIENT 012",2563.33,"20%",512.66999999999996,3076,"CHQ ","2016-07-22","2016-07-01",2]
["2016-04-29",160146,"CLIENT 012",352.92,"20%",70.58,423.5,"CHQ ","2016-07-22","2016-07-01",2]
["2016-04-29",160147,"CLIENT 010",2503.33,"20%",500.67,3004,"CHQ ","2016-07-29","2016-07-01",2]
["2016-05-31",160184,"CLIENT 010",2054.17,"20%",410.83,2465,"CHQ ","2016-07-29","2016-07-01",2]
["2016-06-30",160207,"CLIENT 010",879.17,"20%",175.83,1055,"CHQ ","2016-06-30","2016-07-01",2]
["2016-07-01",160215,"CLIENT 019",33333.33,"20%",6666.67,40000,"CHQ ","2016-07-29","2016-07-01",2]
["2016-07-04",160216,"CLIENT 002",3235,"20%",647,3882,"ESPECES","2016-07-04","2016-07-01",1]
["2016-07-12",160217,"CLIENT 038",270.83,"20%",54.17,325,"ESPECES","2016-07-12","2016-07-01",1]
["2016-07-12",160218,"CLIENT 002",50,"20%",10,60,"ESPECES","2016-07-12","2016-07-01",1]
["2016-07-13",160219,"CLIENT 002",605.83000000000004,"20%",121.17,727,"ESPECES","2016-07-13","2016-07-01",1]
["2016-07-15",160220,"CLIENT 034",94.75,"20%",18.95,113.7,"ESPECES","2016-07-15","2016-07-01",1]
["2016-07-16",160221,"CLIENT 002",741.67,"20%",148.33000000000001,890,"ESPECES","2016-07-16","2016-07-01",1]
["2016-07-28",160222,"CLIENT 039",183.33,"20%",36.67,220,"ESPECES","2016-07-28","2016-07-01",1]
["2016-07-28",160223,"CLIENT 007",383.33,"20%",76.67,460,"ESPECES","2016-07-28","2016-07-01",1]
["2016-03-31",160119,"CLIENT 011",7922.5,"20%",1584.5,9507,"EFFET","2016-08-01","2016-08-01",5]
["2016-03-31",160120,"CLIENT 011",525,"20%",105,630,"EFFET","2016-08-01","2016-08-01",5]
["2016-04-29",160151,"CLIENT 011",3995.83,"20%",799.17,4795,"EFFET","2016-08-01","2016-08-01",5]
["2016-04-29",160152,"CLIENT 011",8901.67,"20%",1780.33,10682,"EFFET","2016-08-01","2016-08-01",5]
["2016-05-31",160182,"CLIENT 012",3914.17,"20%",782.83,4697,"CHQ","2016-08-01","2016-08-01",2]
["2016-05-31",160183,"CLIENT 012",1454.17,"20%",290.83,1745,"CHQ","2016-08-01","2016-08-01",2]
["2016-08-02",160229,"CLIENT 040",687.5,"20%",137.5,825,"CHQ  9238 BP","2016-08-11","2016-08-01",2]
["2016-08-05",160230,"CLIENT 014",27.92,"20%",5.58,33.5,"ESPECES","2016-08-05","2016-08-01",1]
["2016-08-05",160231,"CLIENT 002",312.5,"20%",62.5,375,"ESPECES","2016-08-05","2016-08-01",1]
["2016-08-10",160232,"CLIENT 002",2873.33,"20%",574.66999999999996,3448,"CHQ 7484 ","2016-08-12","2016-08-01",2]
["2016-08-12",160233,"CLIENT 008",325,"20%",65,390,"ESPECES","2016-08-12","2016-08-01",1]
["2016-08-15",160234,"CLIENT 041",1419.17,"20%",283.83,1703,"ESPECES","2016-08-15","2016-08-01",1]
["2016-08-19",160235,"CLIENT 042",3214.42,"20%",642.88,3857.3,"ESPECES","2016-08-19","2016-08-01",1]
["2016-08-20",160236,"CLIENT 002",1683.33,"20%",336.67,2020,"ESPECES","2016-08-20","2016-08-01",1]
["2016-08-20",160237,"CLIENT 002",241.67,"20%",48.33,290,"ESPECES","2016-08-20","2016-08-01",1]
["2016-08-25",160238,"CLIENT 028",2812.08,"20%",562.41999999999996,3374.5,"ESPECES","2016-08-25","2016-08-01",1]
["2016-08-26",160239,"CLIENT 002",291.67,"20%",58.33,350,"ESPECES","2016-08-26","2016-08-01",1]
["2016-08-26",160240,"CLIENT 002",350,"20%",70,420,"ESPECES","2016-08-26","2016-08-01",1]
["2016-08-26",160241,"CLIENT 043",295,"20%",59,354,"ESPECES","2016-08-26","2016-08-01",1]
["2016-08-29",160242,"CLIENT 002",510.83,"20%",102.17,613,"ESPECES","2016-08-29","2016-08-01",1]
["2016-08-31",160243,"CLIENT 002",100,"20%",20,120,"ESPECES","2016-08-31","2016-08-01",1]
["2016-08-31",160244,"CLIENT 007",402.5,"20%",80.5,483,"ESPECES","2016-08-31","2016-08-01",{"$f":"IF(COUNTIF(H260,\"*EF*\"),5,IF(COUNTIF(H260,\"*ES*\"),1,IF(COUNTIF(H260,\"*CH*\"),2,IF(COUNTIF(H260,\"*PR*\"),3,IF(COUNTIF(H260,\"*CO*\"),6,IF(COUNTIF(H260,\"*VI*\"),4,7))))))","v":1}]
["2016-08-31",160249,"CLIENT 044",774.17,"20%",154.83000000000001,929,"ESPECES","2016-08-11","2016-08-01",1]
["2016-08-31",160250,"CLIENT 045",1575,"20%",315,1890,"CHQ","2016-08-25","2016-08-01",2]
["2016-05-31",160185,"CLIENT 011",1914.92,"20%",382.98,2297.9,"EFFET","2016-05-31","2016-09-01",5]
["2016-05-31",160186,"CLIENT 011",2050,"20%",410,2460,"EFFET","2016-05-31","2016-09-01",5]
["2016-09-06",160251,"CLIENT 046",275,"20%",55,330,"ESPECES","2016-09-06","2016-09-01",1]
["2016-09-08",160252,"CLIENT 025",116.67,"20%",23.33,140,"ESPECES","2016-09-08","2016-09-01",1]
["2016-09-08",160253,"CLIENT 002",1246.67,"20%",249.33,1496,"ESPECES","2016-09-08","2016-09-01",1]
["2016-09-10",160254,"CLIENT 008",1133.33,"20%",226.67,1360,"ESPECES","2016-09-10","2016-09-01",1]
["2016-09-10",160255,"CLIENT 008",17324.97,"20%",3464.99,20789.96,"CHQ UE","2016-09-10","2016-09-01",2]
["2016-09-17",160256,"CLIENT 002",281.67,"20%",56.33,338,"ESPECES","2016-09-17","2016-09-01",1]
["2016-09-17",160257,"CLIENT 002",127.5,"20%",25.5,153,"ESPECES","2016-09-17","2016-09-01",1]
["2016-09-30",160261,"CLIENT 007",102.33,"20%",20.47,122.8,"ESPECES","2016-09-30","2016-09-01",1]
["2016-09-30",160262,"CLIENT 002",7641.67,"20%",1528.33,9170,"ESPECES","2016-09-30","2016-09-01",1]
["2016-09-30",160263,"CLIENT 002",7608.33,"20%",1521.67,9130,"ESPECES","2016-09-30","2016-09-01",1]
["2016-05-19",160172,"CLIENT 047",591.66999999999996,"20%",118.33,710,"CHQ ","2016-10-01","2016-10-01",2]
["2016-06-30",160209,"CLIENT 011",1965.42,"20%",393.08,2358.5,"EFFET","2016-10-01","2016-10-01",5]
["2016-06-30",160210,"CLIENT 011",1541.67,"20%",308.33,1850,"EFFET","2016-10-01","2016-10-01",5]
["2016-10-01",160264,"CLIENT 013",5491.92,"20%",1098.3800000000001,6590.3,"CHQ ","2016-10-01","2016-10-01",2]
["2016-10-01",160265,"CLIENT 048",1210.83,"20%",242.17,1453,"CHQ ","2016-10-01","2016-10-01",2]
["2016-10-11",160266,"CLIENT 002",1640.63,"20%",328.13,1968.75,"ESPECES","2016-10-11","2016-10-01",1]
["2016-10-11",160267,"CLIENT 049",79.17,"20%",15.83,95,"ESPECES","2016-10-11","2016-10-01",1]
["2016-10-11",160268,"CLIENT 014",10,"20%",2,12,"ESPECES","2016-10-11","2016-10-01",1]
["2016-10-12",160269,"CLIENT 002",273.75,"20%",54.75,328.5,"ESPECES","2016-10-12","2016-10-01",1]
["2016-10-14",160270,"CLIENT 042",1770.83,"20%",354.17,2125,"ESPECES","2016-10-14","2016-10-01",1]
["2016-10-15",160271,"CLIENT 002",1277.5,"20%",255.5,1533,"ESPECES","2016-10-15","2016-10-01",1]
["2016-10-15",160272,"CLIENT 042",606.79999999999995,"20%",121.36,728.16,"ESPECES","2016-10-15","2016-10-01",1]
["2016-10-18",160273,"CLIENT 002",1608.75,"20%",321.75,1930.5,"ESPECES","2016-10-18","2016-10-01",1]
["2016-10-18",160274,"CLIENT 050",1358.33,"20%",271.67,1630,"ESPECES","2016-10-18","2016-10-01",1]
["2016-10-20",160275,"CLIENT 051",333.33,"20%",66.67,400,"ESPECES","2016-10-20","2016-10-01",1]
["2016-10-20",160276,"CLIENT 002",1300,"20%",260,1560,"ESPECES","2016-10-20","2016-10-01",1]
["2016-10-20",160277,"CLIENT 002",841.67,"20%",168.33,1010,"ESPECES","2016-10-20","2016-10-01",1]
["2016-10-24",160278,"CLIENT 002",957.92,"20%",191.58,1149.5,"ESPECES","2016-10-24","2016-10-01",1]
["2016-10-26",160279,"CLIENT 002",158.33000000000001,"20%",31.67,190,"ESPECES","2016-10-26","2016-10-01",1]
["2016-10-27",160280,"CLIENT 002",2616.67,"20%",523.33000000000004,3140,"ESPECES","2016-10-27","2016-10-01",1]
["2016-10-31",160281,"CLIENT 002",2495,"20%",499,2994,"ESPECES","2016-10-31","2016-10-01",1]
["2016-10-31",160282,"CLIENT 002",583.33000000000004,"20%",116.67,700,"ESPECES","2016-10-31","2016-10-01",1]
["2016-10-31",160284,"CLIENT 003",0,"20%",0,0,"","2016-10-31","2016-10-01",7]
["2016-08-31",160245,"CLIENT 047",1883.33,"20%",376.67,2260,"CHQ 0479375","2016-11-11","2016-11-01",2]
["2016-11-01",160289,"CLIENT 013",5886.17,"20%",1177.23,7063.4,"CHQ 408590","2016-11-22","2016-11-01",2]
["2016-11-01",160290,"CLIENT 052",8333.33,"20%",1666.67,10000,"CHQ 1848 ","2016-01-02","2016-11-01",2]
["2016-11-02",160291,"CLIENT 053",3283.33,"20%",656.67,3940,"CHQ 583646","2016-11-22","2016-11-01",2]
["2016-11-02",160292,"CLIENT 054",2853.17,"20%",570.63,3423.8,"ESPECES","2016-11-02","2016-11-01",1]
["2016-11-05",160293,"CLIENT 002",2175,"20%",435,2610,"ESPECES","2016-11-05","2016-11-01",1]
["2016-11-05",160294,"CLIENT 014",104.17,"20%",20.83,125,"ESPECES","2016-11-05","2016-11-01",1]
["2016-11-07",160295,"CLIENT 051",29.17,"20%",5.83,35,"ESPECES","2016-11-07","2016-11-01",1]
["2016-11-08",160296,"CLIENT 002",918.33,"20%",183.67,1102,"ESPECES","2016-11-08","2016-11-01",1]
["2016-11-11",160297,"CLIENT 002",1965.83,"20%",393.17,2359,"ESPECES","2016-11-11","2016-11-01",1]
["2016-11-15",160298,"CLIENT 055",156.66999999999999,"20%",31.33,188,"ESPECES","2016-11-15","2016-11-01",1]
["2016-11-18",160299,"CLIENT 056",973.33,"20%",194.67,1168,"ESPECES","2016-11-18","2016-11-01",1]
["2016-11-19",160300,"CLIENT 002",487.5,"20%",97.5,585,"ESPECES","2016-11-19","2016-11-01",1]
["2016-11-19",160301,"CLIENT 057",178.33,"20%",35.67,214,"ESPECES","2016-11-19","2016-11-01",1]
["2016-11-20",160302,"CLIENT 002",3179.17,"20%",635.83000000000004,3815,"ESPECES","2016-11-20","2016-11-01",1]
["2016-11-25",160303,"CLIENT 008",1980,"20%",396,2376,"ESPECES","2016-11-25","2016-11-01",1]
["2016-07-30",160226,"CLIENT 011",1329.17,"20%",265.83,1595,"EFFET","2016-12-03","2016-12-01",5]
["2016-07-30",160227,"CLIENT 011",8050.42,"20%",1610.08,9660.5,"EFFET","2016-12-03","2016-12-01",5]
["2016-07-30",160228,"CLIENT 011",1720.83,"20%",344.17,2065,"EFFET","2016-12-03","2016-12-01",5]
["2016-08-31",160247,"CLIENT 011",5033.33,"20%",1006.67,6040,"EFFET","2016-12-03","2016-12-01",5]
["2016-09-30",160260,"CLIENT 006",55,"20%",11,66,"ESPECES","2016-12-31","2016-12-01",1]
["2016-11-30",160304,"CLIENT 058",230.83,"20%",46.17,277,"ESPECES","2016-12-02","2016-12-01",1]
["2016-12-01",160309,"CLIENT 059",8125,"20%",1625,9750,"ESPECES","2016-12-01","2016-12-01",1]
["2016-12-01",160310,"CLIENT 059",8250,"20%",1650,9900,"ESPECES","2016-12-01","2016-12-01",1]
["2016-12-01",160311,"CLIENT 059",4525.83,"20%",905.17,5431,"ESPECES","2016-12-01","2016-12-01",1]
["2016-12-05",160312,"CLIENT 013",3229.17,"20%",645.83000000000004,3875,"CHQ ","2016-12-09","2016-12-01",2]
["2016-12-05",160313,"CLIENT 008",4541.67,"20%",908.33,5450,"EFFET","2016-12-09","2016-12-01",{"$f":"IF(COUNTIF(H324,\"*EF*\"),5,IF(COUNTIF(H324,\"*ES*\"),1,IF(COUNTIF(H324,\"*CH*\"),2,IF(COUNTIF(H324,\"*PR*\"),3,IF(COUNTIF(H324,\"*CO*\"),6,IF(COUNTIF(H324,\"*VI*\"),4,7))))))","v":5}]
["2016-12-10",160314,"CLIENT 008",17897.5,"20%",3579.5,21477,"EFFET","2016-12-14","2016-12-01",5]
["2016-12-17",160315,"CLIENT 060",1051,"20%",210.2,1261.2,"ESPECES","2016-12-17","2016-12-01",1]
["2016-12-22",160316,"CLIENT 002",623.33000000000004,"20%",124.67,748,"ESPECES","2016-12-22","2016-12-01",1]
["2016-12-22",160317,"CLIENT 002",157.5,"20%",31.5,189,"ESPECES","2016-12-22","2016-12-01",1]
["2016-12-23",160318,"CLIENT 002",1270,"20%",254,1524,"ESPECES","2016-12-23","2016-12-01",1]
["2016-12-24",160319,"CLIENT 002",365.83,"20%",73.17,439,"ESPECES","2016-12-24","2016-12-01",1]
["2016-12-31",160320,"CLIENT 007",1049.23,"20%",209.85,1259.07,"ESPECES","2016-12-31","2016-12-01",1]
["2016-12-31",160321,"CLIENT 061",1629.17,"20%",325.83,1955,"ESPECES","2016-12-31","2016-12-01",1]
["2016-12-31",160322,"CLIENT 002",655,"20%",131,786,"ESPECES","2016-12-31","2016-12-01",1]
["2016-12-31",160326,"CLIENT 002",2866.67,"20%",573.33000000000004,3440,"ESPECES","2016-12-31","2016-12-01",1]
["2016-09-30",160259,"CLIENT 011",1638.33,"20%",327.67,1966,"EFFET 4459521","2017-01-09","2017-01-01",5]
["2017-01-04","001/2017","CLIENT 062",300,0.2,60,360,"ESPECES","2017-01-04","2017-01-01",1]
["2017-01-05","002/2017","CLIENT 063",794.17,0.2,158.83000000000001,953,"ESPECES","2017-01-05","2017-01-01",1]
["2017-01-06","003/2017","CLIENT 064",7933.33,0.2,1586.67,9520,"ESPECES","2017-01-06","2017-01-01",1]
["2017-01-06","004/2017","CLIENT 064",8056.67,0.2,1611.33,9668,"ESPECES","2017-01-06","2017-01-01",1]
["2017-01-06","005/2017","CLIENT 064",4843.33,0.2,968.67,5812,"ESPECES","2017-01-06","2017-01-01",1]
["2017-01-06","006/2017","CLIENT 065",231.25,0.2,46.25,277.5,"ESPECES","2017-01-06","2017-01-01",1]
["2017-01-10","007/2017","CLIENT 064",4816.67,0.2,963.33,5780,"ESPECES","2017-01-10","2017-01-01",1]
["2017-01-11","008/2017","CLIENT 066",343.67,0.2,68.73,412.4,"ESPECES","2017-01-11","2017-01-01",1]
["2017-01-11","009/2017","CLIENT 002",451.25,0.2,90.25,541.5,"ESPECES","2017-01-11","2017-01-01",1]
["2017-01-11","010/2017","CLIENT 067",1850,0.2,370,2220,"ESPECES","2017-01-11","2017-01-01",1]
["2017-01-13","011/2017","CLIENT 002",230,0.2,46,276,"ESPECES","2017-01-13","2017-01-01",1]
["2017-01-23","012/2017","CLIENT 068",1420.83,0.2,284.17,1705,"ESPECES","2017-01-23","2017-01-01",1]
["2017-01-23","013/2017","CLIENT 063",320.83,0.2,64.17,385,"ESPECES","2017-01-23","2017-01-01",1]
["2017-01-26","014/2017","CLIENT 069",366.67,0.2,73.33,440,"ESPECES","2017-01-26","2017-01-01",1]
["2017-01-27","015/2017","CLIENT 063",360.42,0.2,72.08,432.5,"ESPECES","2017-01-27","2017-01-01",1]
["2017-01-27","016/2017","CLIENT 070",2498.58,0.2,499.72,2998.3,"CHQ  5273853","2017-01-25","2017-01-01",2]
["2017-01-27","017/2017","CLIENT 071",4169.17,0.2,833.83,5003,"ESPECES","2017-01-27","2017-01-01",1]
["2017-01-28","019/2017","CLIENT 002",110,0.2,22,132,"ESPECES","2017-01-28","2017-01-01",1]
["2017-01-28","020/2017","CLIENT 007",262.5,0.2,52.5,315,"ESPECES","2017-01-28","2017-01-01",1]
["2017-01-30","021/2017","CLIENT 039",808.33,0.2,161.66999999999999,970,"ESPECES","2017-01-30","2017-01-01",1]
["2017-01-31","022/2017","CLIENT 058",2000,0.2,400,2400,"ESPECES","2017-01-31","2017-01-01",1]
["2016-07-28",160224,"CLIENT 072",{"$f":"Tableau2[[#This Row],[Montant TTC]]/1.2","v":333.33},0.2,{"$f":"Tableau2[[#This Row],[Montant TTC]]-Tableau2[[#This Row],[Montant Ht]]","v":66.67},400,"CHQ 9915420","2017-02-06","2017-02-01",2]
["2016-08-31",160246,"CLIENT 012",{"$f":"Tableau2[[#This Row],[Montant TTC]]/1.2","v":11993.33},0.2,{"$f":"Tableau2[[#This Row],[Montant TTC]]-Tableau2[[#This Row],[Montant Ht]]","v":2398.67},14392,"CHQ 7367313","2017-02-13","2017-02-01",2]
["2016-08-31",160248,"CLIENT 072",{"$f":"Tableau2[[#This Row],[Montant TTC]]/1.2","v":493.75},0.2,{"$f":"Tableau2[[#This Row],[Montant TTC]]-Tableau2[[#This Row],[Montant Ht]]","v":98.75},592.5,"CHQ 9915420","2017-02-06","2017-02-01",2]
["2016-10-31",160285,"CLIENT 072",{"$f":"Tableau2[[#This Row],[Montant TTC]]/1.2","v":4913.75},0.2,{"$f":"Tableau2[[#This Row],[Montant TTC]]-Tableau2[[#This Row],[Montant Ht]]","v":982.75},5896.5,"CHQ 9915420","2017-02-06","2017-02-01",2]
["2016-10-31",160286,"CLIENT 011",{"$f":"Tableau2[[#This Row],[Montant TTC]]/1.2","v":3090},0.2,{"$f":"Tableau2[[#This Row],[Montant TTC]]-Tableau2[[#This Row],[Montant Ht]]","v":618},3708,"EFFET 4459542","2017-02-06","2017-02-01",5]
["2016-10-31",160287,"CLIENT 047",{"$f":"Tableau2[[#This Row],[Montant TTC]]/1.2","v":2348.75},0.2,{"$f":"Tableau2[[#This Row],[Montant TTC]]-Tableau2[[#This Row],[Montant Ht]]","v":469.75},2818.5,"CHQ 4970081","2017-02-27","2017-02-01",2]
["2016-10-31",160288,"CLIENT 073",{"$f":"Tableau2[[#This Row],[Montant TTC]]/1.2","v":2356.67},0.2,{"$f":"Tableau2[[#This Row],[Montant TTC]]-Tableau2[[#This Row],[Montant Ht]]","v":471.33},2828,"CHQ 8489569","2017-02-06","2017-02-01",2]
["2016-12-31",160323,"CLIENT 072",{"$f":"Tableau2[[#This Row],[Montant TTC]]/1.2","v":1591.67},0.2,{"$f":"Tableau2[[#This Row],[Montant TTC]]-Tableau2[[#This Row],[Montant Ht]]","v":318.33},1910,"CHQ 6924 CA","2017-02-27","2017-02-01",2]
["2017-02-01","026/2017","CLIENT 042",{"$f":"Tableau2[[#This Row],[Montant TTC]]/1.2","v":366.67},0.2,{"$f":"Tableau2[[#This Row],[Montant TTC]]-Tableau2[[#This Row],[Montant Ht]]","v":73.33},440,"ESPECES","2017-02-01","2017-02-01",1]
["2017-02-03","027/2017","CLIENT 002",{"$f":"Tableau2[[#This Row],[Montant TTC]]/1.2","v":23.33},0.2,{"$f":"Tableau2[[#This Row],[Montant TTC]]-Tableau2[[#This Row],[Montant Ht]]","v":4.67},28,"ESPECES","2017-02-03","2017-02-01",1]
["2017-02-03","028/2017","CLIENT 074",{"$f":"Tableau2[[#This Row],[Montant TTC]]/1.2","v":100},0.2,{"$f":"Tableau2[[#This Row],[Montant TTC]]-Tableau2[[#This Row],[Montant Ht]]","v":20},120,"ESPECES","2017-02-03","2017-02-01",1]
["2017-02-06","029/2017","CLIENT 075",{"$f":"Tableau2[[#This Row],[Montant TTC]]/1.2","v":283.17},0.2,{"$f":"Tableau2[[#This Row],[Montant TTC]]-Tableau2[[#This Row],[Montant Ht]]","v":56.63},339.8,"ESPECES","2017-02-06","2017-02-01",1]
["2017-02-08","030/2017","CLIENT 002",{"$f":"Tableau2[[#This Row],[Montant TTC]]/1.2","v":7629.17},0.2,{"$f":"Tableau2[[#This Row],[Montant TTC]]-Tableau2[[#This Row],[Montant Ht]]","v":1525.83},9155,"ESPECES","2017-02-08","2017-02-01",1]
["2017-02-09","031/2017","CLIENT 042",{"$f":"Tableau2[[#This Row],[Montant TTC]]/1.2","v":4208.08},0.2,{"$f":"Tableau2[[#This Row],[Montant TTC]]-Tableau2[[#This Row],[Montant Ht]]","v":841.62},5049.7,"ESPECES","2017-02-09","2017-02-01",1]
["2017-02-09","032/2017","CLIENT 074",{"$f":"Tableau2[[#This Row],[Montant TTC]]/1.2","v":175},0.2,{"$f":"Tableau2[[#This Row],[Montant TTC]]-Tableau2[[#This Row],[Montant Ht]]","v":35},210,"ESPECES","2017-02-09","2017-02-01",1]
["2017-02-14","033/2017","CLIENT 058",{"$f":"Tableau2[[#This Row],[Montant TTC]]/1.2","v":391.67},0.2,{"$f":"Tableau2[[#This Row],[Montant TTC]]-Tableau2[[#This Row],[Montant Ht]]","v":78.33},470,"ESPECES","2017-02-14","2017-02-01",1]
["2017-02-14","034/2017","CLIENT 042",{"$f":"Tableau2[[#This Row],[Montant TTC]]/1.2","v":2179.17},0.2,{"$f":"Tableau2[[#This Row],[Montant TTC]]-Tableau2[[#This Row],[Montant Ht]]","v":435.83},2615,"ESPECES","2017-02-14","2017-02-01",1]
["2017-02-14","035/2017","CLIENT 039",{"$f":"Tableau2[[#This Row],[Montant TTC]]/1.2","v":150},0.2,{"$f":"Tableau2[[#This Row],[Montant TTC]]-Tableau2[[#This Row],[Montant Ht]]","v":30},180,"ESPECES","2017-02-14","2017-02-01",1]
["2017-02-15","036/2017","CLIENT 076",{"$f":"Tableau2[[#This Row],[Montant TTC]]/1.2","v":474.17},0.2,{"$f":"Tableau2[[#This Row],[Montant TTC]]-Tableau2[[#This Row],[Montant Ht]]","v":94.83},569,"ESPECES","2017-02-15","2017-02-01",1]
["2017-02-15","037/2017","CLIENT 077",{"$f":"Tableau2[[#This Row],[Montant TTC]]/1.2","v":3870.25},0.2,{"$f":"Tableau2[[#This Row],[Montant TTC]]-Tableau2[[#This Row],[Montant Ht]]","v":774.05},4644.3,"ESPECES","2017-02-15","2017-02-01",1]
["2017-02-18","042/2017","CLIENT 077",{"$f":"Tableau2[[#This Row],[Montant TTC]]/1.2","v":2451.67},0.2,{"$f":"Tableau2[[#This Row],[Montant TTC]]-Tableau2[[#This Row],[Montant Ht]]","v":490.33},2942,"CHQ 1986149","2017-02-27","2017-02-01",2]
["2017-02-18","043/2017","CLIENT 007",{"$f":"Tableau2[[#This Row],[Montant TTC]]/1.2","v":122.5},0.2,{"$f":"Tableau2[[#This Row],[Montant TTC]]-Tableau2[[#This Row],[Montant Ht]]","v":24.5},147,"ESPECES","2017-02-18","2017-02-01",1]
["2017-02-22","044/2017","CLIENT 076",{"$f":"Tableau2[[#This Row],[Montant TTC]]/1.2","v":299.17},0.2,{"$f":"Tableau2[[#This Row],[Montant TTC]]-Tableau2[[#This Row],[Montant Ht]]","v":59.83},359,"ESPECES","2017-02-22","2017-02-01",1]
["2017-02-24","046/2017","CLIENT 078",{"$f":"Tableau2[[#This Row],[Montant TTC]]/1.2","v":68.33},0.2,{"$f":"Tableau2[[#This Row],[Montant TTC]]-Tableau2[[#This Row],[Montant Ht]]","v":13.67},82,"ESPECES","2017-02-24","2017-02-01",1]
["2017-02-28","048/2017","CLIENT 079",{"$f":"Tableau2[[#This Row],[Montant TTC]]/1.2","v":1934.17},0.2,{"$f":"Tableau2[[#This Row],[Montant TTC]]-Tableau2[[#This Row],[Montant Ht]]","v":386.83},2321,"ESPECES","2017-02-28","2017-02-01",1]
["2017-02-28","049/2017","CLIENT 080",{"$f":"Tableau2[[#This Row],[Montant TTC]]/1.2","v":4069.08},0.2,{"$f":"Tableau2[[#This Row],[Montant TTC]]-Tableau2[[#This Row],[Montant Ht]]","v":813.82},4882.8999999999996,"ESPECES","2017-02-28","2017-02-01",1]
["2017-02-28","050/2017","CLIENT 080",{"$f":"Tableau2[[#This Row],[Montant TTC]]/1.2","v":2744.17},0.2,{"$f":"Tableau2[[#This Row],[Montant TTC]]-Tableau2[[#This Row],[Montant Ht]]","v":548.83000000000004},3293,"ESPECES","2017-02-28","2017-02-01",1]
["2017-02-28","051/2017","CLIENT 080",{"$f":"Tableau2[[#This Row],[Montant TTC]]/1.2","v":3108.33},0.2,{"$f":"Tableau2[[#This Row],[Montant TTC]]-Tableau2[[#This Row],[Montant Ht]]","v":621.66999999999996},3730,"ESPECES","2017-02-28","2017-02-01",1]
["2017-02-28","052/2017","CLIENT 074",{"$f":"Tableau2[[#This Row],[Montant TTC]]/1.2","v":199},0.2,{"$f":"Tableau2[[#This Row],[Montant TTC]]-Tableau2[[#This Row],[Montant Ht]]","v":39.799999999999997},238.8,"ESPECES","2017-02-28","2017-02-01",1]
["2017-02-28","053/2017","CLIENT 081",{"$f":"Tableau2[[#This Row],[Montant TTC]]/1.2","v":195.83},0.2,{"$f":"Tableau2[[#This Row],[Montant TTC]]-Tableau2[[#This Row],[Montant Ht]]","v":39.17},235,"ESPECES","2017-02-28","2017-02-01",1]
["2017-02-28","058/2017","CLIENT 002",{"$f":"Tableau2[[#This Row],[Montant TTC]]/1.2","v":7444.58},0.2,{"$f":"Tableau2[[#This Row],[Montant TTC]]-Tableau2[[#This Row],[Montant Ht]]","v":1488.92},8933.5,"ESPECES","2017-02-28","2017-02-01",1]
["2016-06-30",160208,"CLIENT 012",{"$f":"G388/(1+E388)","v":6383.33},0.2,1276.67,7660,"CHQ7367314","2017-03-13","2017-03-01",{"$f":"IF(COUNTIF(H388,\"*EF*\"),5,IF(COUNTIF(H388,\"*ES*\"),1,IF(COUNTIF(H388,\"*CH*\"),2,IF(COUNTIF(H388,\"*PR*\"),3,IF(COUNTIF(H388,\"*CO*\"),6,IF(COUNTIF(H388,\"*VI*\"),4,7))))))","v":2}]
["2016-07-30",160225,"CLIENT 012",1560,0.2,312,1872,"CHQ7367314","2017-03-13","2017-03-01",2]
["2016-09-30",160258,"CLIENT 012",8225.83,0.2,1645.17,9871,"CHQ7367314","2017-03-13","2017-03-01",2]
["2016-10-31",160283,"CLIENT 012",1246.67,0.2,249.33,1496,"CHQ7367314","2017-03-13","2017-03-01",2]
["2016-11-30",160305,"CLIENT 012",2576.67,0.2,515.33000000000004,3092,"CHQ7367314","2017-03-13","2017-03-01",2]
["2016-11-30",160306,"CLIENT 011",1454.58,0.2,290.92,1745.5,"EFFET 4459187","2017-03-07","2017-03-01",5]
["2016-11-30",160307,"CLIENT 011",3927.5,0.2,785.5,4713,"EFFET 4459187","2017-03-07","2017-03-01",5]
["2016-11-30",160308,"CLIENT 011",414.5,0.2,82.9,497.4,"EFFET 4459187","2017-03-07","2017-03-01",5]
["2017-02-28","057/2017","CLIENT 082",1666.67,0.2,333.33,2000,"CHQ BMCI","2017-03-01","2017-03-01",2]
["2017-03-01","059/2017","CLIENT 083",299.17,0.2,59.83,359,"ESPECES","2017-03-01","2017-03-01",1]
["2017-03-02","060/2017","CLIENT 002",391.67,0.2,78.33,470,"ESPECES","2017-03-02","2017-03-01",1]
["2017-03-08","061/2017","CLIENT 083",587.5,0.2,117.5,705,"ESPECES","2017-03-08","2017-03-01",1]
["2017-03-08","062/2017","CLIENT 068",565,0.2,113,678,"ESPECES","2017-03-08","2017-03-01",1]
["2017-03-09","063/2017","CLIENT 084",657.25,0.2,131.44999999999999,788.7,"ESPECES","2017-03-09","2017-03-01",1]
["2017-03-28","065/2017","CLIENT 007",150,0.2,30,180,"ESPECES","2017-03-28","2017-03-01",1]
["2017-03-28","066/2017","CLIENT 014",261.67,0.2,52.33,314,"ESPECES","2017-03-28","2017-03-01",1]
["2017-03-28","067/2017","CLIENT 068",674.17,0.2,134.83000000000001,809,"ESPECES","2017-03-28","2017-03-01",1]
["2016-12-31",160324,"CLIENT 011",2278.33,0.2,{"$f":"Tableau2[[#This Row],[Montant TTC]]-Tableau2[[#This Row],[Montant Ht]]","v":455.67},2734,"EFFET ","2017-04-05","2017-04-01",5]
["2016-12-31",160325,"CLIENT 011",1460,0.2,{"$f":"Tableau2[[#This Row],[Montant TTC]]-Tableau2[[#This Row],[Montant Ht]]","v":292},1752,"EFFET ","2017-04-05","2017-04-01",5]
["2016-02-15","038/2017","CLIENT 014",2037.5,0.2,{"$f":"Tableau2[[#This Row],[Montant TTC]]-Tableau2[[#This Row],[Montant Ht]]","v":407.5},2445,"CHQ 9400897 BP","2017-04-13","2017-04-01",2]
["2017-02-15","039/2017","CLIENT 014",1482.5,0.2,{"$f":"Tableau2[[#This Row],[Montant TTC]]-Tableau2[[#This Row],[Montant Ht]]","v":296.5},1779,"CHQ 9400897 BP","2017-04-13","2017-04-01",2]
["2017-02-15","040/2017","CLIENT 014",433.33,0.2,{"$f":"Tableau2[[#This Row],[Montant TTC]]-Tableau2[[#This Row],[Montant Ht]]","v":86.67},520,"CHQ 9400897 BP","2017-04-13","2017-04-01",2]
["2017-02-16","041/2017","CLIENT 014",4975,0.2,{"$f":"Tableau2[[#This Row],[Montant TTC]]-Tableau2[[#This Row],[Montant Ht]]","v":995},5970,"CHQ 9400897 BP","2017-04-13","2017-04-01",2]
["2017-02-24","045/2017","CLIENT 014",1675.83,0.2,{"$f":"Tableau2[[#This Row],[Montant TTC]]-Tableau2[[#This Row],[Montant Ht]]","v":335.17},2011,"CHQ 9400897 BP","2017-04-13","2017-04-01",2]
["2017-03-10","064/2017","CLIENT 014",1216.67,0.2,{"$f":"Tableau2[[#This Row],[Montant TTC]]-Tableau2[[#This Row],[Montant Ht]]","v":243.33},1460,"CHQ 9400897 BP","2017-04-13","2017-04-01",2]
["2017-04-04","071/2017","CLIENT 007",166.67,0.2,{"$f":"Tableau2[[#This Row],[Montant TTC]]-Tableau2[[#This Row],[Montant Ht]]","v":33.33},200,"ESPECES","2017-04-04","2017-04-01",1]
["2017-04-04","072/2017","CLIENT 085",1207.5,0.2,{"$f":"Tableau2[[#This Row],[Montant TTC]]-Tableau2[[#This Row],[Montant Ht]]","v":241.5},1449,"ESPECES","2017-04-04","2017-04-01",1]
["2017-04-13","074/2017","CLIENT 086",124.17,0.2,{"$f":"Tableau2[[#This Row],[Montant TTC]]-Tableau2[[#This Row],[Montant Ht]]","v":24.83},149,"ESPECES","2017-04-13","2017-04-01",1]
["2017-04-15","075/2017","CLIENT 086",804.17,0.2,{"$f":"Tableau2[[#This Row],[Montant TTC]]-Tableau2[[#This Row],[Montant Ht]]","v":160.83000000000001},965,"ESPECES","2017-04-15","2017-04-01",1]
["2017-04-15","076/2017","CLIENT 086",116.67,0.2,{"$f":"Tableau2[[#This Row],[Montant TTC]]-Tableau2[[#This Row],[Montant Ht]]","v":23.33},140,"ESPECES","2017-04-15","2017-04-01",1]
["2017-04-15","077/2017","CLIENT 002",8216.67,0.2,{"$f":"Tableau2[[#This Row],[Montant TTC]]-Tableau2[[#This Row],[Montant Ht]]","v":1643.33},9860,"ESPECES","2017-04-15","2017-04-01",1]
["2017-04-26","078/2017","CLIENT 085",2061.67,0.2,{"$f":"Tableau2[[#This Row],[Montant TTC]]-Tableau2[[#This Row],[Montant Ht]]","v":412.33},2474,"ESPECES","2017-04-26","2017-04-01",1]
["2017-04-28","079/2017","CLIENT 002",{"$f":"G420/(1+E420)","v":4388.33},0.2,{"$f":"Tableau2[[#This Row],[Montant TTC]]-Tableau2[[#This Row],[Montant Ht]]","v":877.67},5266,"ESPECES","2017-04-28","2017-04-01",1]
[null,null,null,0,0.2,{"$f":"Tableau2[[#This Row],[Montant TTC]]-Tableau2[[#This Row],[Montant Ht]]","v":0},null,null,null,null,7]
[null,null,null,0,0.2,{"$f":"Tableau2[[#This Row],[Montant TTC]]-Tableau2[[#This Row],[Montant Ht]]","v":0},null,null,null,null,7]
[null,null,null,0,0.2,{"$f":"Tableau2[[#This Row],[Montant TTC]]-Tableau2[[#This Row],[Montant Ht]]","v":0},null,null,null,null,7]
[null,null,null,0,0.2,{"$f":"Tableau2[[#This Row],[Montant TTC]]-Tableau2[[#This Row],[Montant Ht]]","v":0},null,null,null,null,7]
[null,null,null,0,0.2,{"$f":"Tableau2[[#This Row],[Montant TTC]]-Tableau2[[#This Row],[Montant Ht]]","v":0},null,null,null,null,7]
[null,null,null,0,0.2,{"$f":"Tableau2[[#This Row],[Montant TTC]]-Tableau2[[#This Row],[Montant Ht]]","v":0},null,null,null,null,7]
[null,null,null,0,0.2,{"$f":"Tableau2[[#This Row],[Montant TTC]]-Tableau2[[#This Row],[Montant Ht]]","v":0},null,null,null,null,7]
[null,null,null,0,0.2,{"$f":"Tableau2[[#This Row],[Montant TTC]]-Tableau2[[#This Row],[Montant Ht]]","v":0},null,null,null,null,7]
[null,null,null,0,0.2,{"$f":"Tableau2[[#This Row],[Montant TTC]]-Tableau2[[#This Row],[Montant Ht]]","v":0},null,null,null,null,7]
[null,null,null,0,0.2,{"$f":"Tableau2[[#This Row],[Montant TTC]]-Tableau2[[#This Row],[Montant Ht]]","v":0},null,null,null,null,7]
[null,null,null,0,0.2,{"$f":"Tableau2[[#This Row],[Montant TTC]]-Tableau2[[#This Row],[Montant Ht]]","v":0},null,null,null,null,7]
[null,null,null,0,0.2,{"$f":"Tableau2[[#This Row],[Montant TTC]]-Tableau2[[#This Row],[Montant Ht]]","v":0},null,null,null,null,7]
[null,null,null,0,0.2,{"$f":"Tableau2[[#This Row],[Montant TTC]]-Tableau2[[#This Row],[Montant Ht]]","v":0},null,null,null,null,7]
[null,null,null,0,0.2,{"$f":"Tableau2[[#This Row],[Montant TTC]]-Tableau2[[#This Row],[Montant Ht]]","v":0},null,null,null,null,7]
[null,null,null,0,0.2,{"$f":"Tableau2[[#This Row],[Montant TTC]]-Tableau2[[#This Row],[Montant Ht]]","v":0},null,null,null,null,7]
[null,null,null,0,0.2,{"$f":"Tableau2[[#This Row],[Montant TTC]]-Tableau2[[#This Row],[Montant Ht]]","v":0},null,null,null,null,7]
[null,null,null,0,0.2,{"$f":"Tableau2[[#This Row],[Montant TTC]]-Tableau2[[#This Row],[Montant Ht]]","v":0},null,null,null,null,7]
[null,null,null,0,0.2,{"$f":"Tableau2[[#This Row],[Montant TTC]]-Tableau2[[#This Row],[Montant Ht]]","v":0},null,null,null,null,7]
[null,null,null,0,0.2,{"$f":"Tableau2[[#This Row],[Montant TTC]]-Tableau2[[#This Row],[Montant Ht]]","v":0},null,null,null,null,7]
[null,null,null,0,0.2,{"$f":"Tableau2[[#This Row],[Montant TTC]]-Tableau2[[#This Row],[Montant Ht]]","v":0},null,null,null,null,7]
[null,null,null,0,0.2,{"$f":"Tableau2[[#This Row],[Montant TTC]]-Tableau2[[#This Row],[Montant Ht]]","v":0},null,null,null,null,7]
[null,null,null,0,0.2,{"$f":"Tableau2[[#This Row],[Montant TTC]]-Tableau2[[#This Row],[Montant Ht]]","v":0},null,null,null,null,7]
[null,null,null,0,0.2,{"$f":"Tableau2[[#This Row],[Montant TTC]]-Tableau2[[#This Row],[Montant Ht]]","v":0},null,null,null,null,7]
[null,null,null,0,0.2,{"$f":"Tableau2[[#This Row],[Montant TTC]]-Tableau2[[#This Row],[Montant Ht]]","v":0},null,null,null,null,7]
[null,null,null,0,0.2,{"$f":"Tableau2[[#This Row],[Montant TTC]]-Tableau2[[#This Row],[Montant Ht]]","v":0},null,null,null,null,7]
[null,null,null,0,0.2,{"$f":"Tableau2[[#This Row],[Montant TTC]]-Tableau2[[#This Row],[Montant Ht]]","v":0},null,null,null,null,7]
[null,null,null,0,0.2,{"$f":"Tableau2[[#This Row],[Montant TTC]]-Tableau2[[#This Row],[Montant Ht]]","v":0},null,null,null,null,7]
[null,null,null,0,0.2,{"$f":"Tableau2[[#This Row],[Montant TTC]]-Tableau2[[#This Row],[Montant Ht]]","v":0},null,null,null,null,7]
[null,null,null,0,0.2,{"$f":"Tableau2[[#This Row],[Montant TTC]]-Tableau2[[#This Row],[Montant Ht]]","v":0},null,null,null,null,7]
[null,null,null,0,0.2,{"$f":"Tableau2[[#This Row],[Montant TTC]]-Tableau2[[#This Row],[Montant Ht]]","v":0},null,null,null,null,7]
[null,null,null,0,0.2,{"$f":"Tableau2[[#This Row],[Montant TTC]]-Tableau2[[#This Row],[Montant Ht]]","v":0},null,null,null,null,7]
[null,null,null,{"$f":"G452/(1+E452)","v":0},0.2,{"$f":"Tableau2[[#This Row],[Montant TTC]]-Tableau2[[#This Row],[Montant Ht]]","v":0},null,null,null,null,{"$f":"IF(COUNTIF(H452,\"*EF*\"),5,IF(COUNTIF(H452,\"*ES*\"),1,IF(COUNTIF(H452,\"*CH*\"),2,IF(COUNTIF(H452,\"*PR*\"),3,IF(COUNTIF(H452,\"*CO*\"),6,IF(COUNTIF(H452,\"*VI*\"),4,7))))))","v":7}]
[null,null,null,0,0.2,{"$f":"Tableau2[[#This Row],[Montant TTC]]-Tableau2[[#This Row],[Montant Ht]]","v":0},null,null,null,null,7]
[null,null,null,0,0.2,{"$f":"Tableau2[[#This Row],[Montant TTC]]-Tableau2[[#This Row],[Montant Ht]]","v":0},null,null,null,null,7]
[null,null,null,0,0.2,{"$f":"Tableau2[[#This Row],[Montant TTC]]-Tableau2[[#This Row],[Montant Ht]]","v":0},null,null,null,null,7]
[null,null,null,0,0.2,{"$f":"Tableau2[[#This Row],[Montant TTC]]-Tableau2[[#This Row],[Montant Ht]]","v":0},null,null,null,null,7]
[null,null,null,0,0.2,{"$f":"Tableau2[[#This Row],[Montant TTC]]-Tableau2[[#This Row],[Montant Ht]]","v":0},null,null,null,null,7]
[null,null,null,0,0.2,{"$f":"Tableau2[[#This Row],[Montant TTC]]-Tableau2[[#This Row],[Montant Ht]]","v":0},null,null,null,null,7]
[null,null,null,0,0.2,{"$f":"Tableau2[[#This Row],[Montant TTC]]-Tableau2[[#This Row],[Montant Ht]]","v":0},null,null,null,null,7]
[null,null,null,0,0.2,{"$f":"Tableau2[[#This Row],[Montant TTC]]-Tableau2[[#This Row],[Montant Ht]]","v":0},null,null,null,null,7]
[null,null,null,0,0.2,{"$f":"Tableau2[[#This Row],[Montant TTC]]-Tableau2[[#This Row],[Montant Ht]]","v":0},null,null,null,null,7]
[null,null,null,0,0.2,{"$f":"Tableau2[[#This Row],[Montant TTC]]-Tableau2[[#This Row],[Montant Ht]]","v":0},null,null,null,null,7]
[null,null,null,0,0.2,{"$f":"Tableau2[[#This Row],[Montant TTC]]-Tableau2[[#This Row],[Montant Ht]]","v":0},null,null,null,null,7]
[null,null,null,0,0.2,{"$f":"Tableau2[[#This Row],[Montant TTC]]-Tableau2[[#This Row],[Montant Ht]]","v":0},null,null,null,null,7]
[null,null,null,0,0.2,{"$f":"Tableau2[[#This Row],[Montant TTC]]-Tableau2[[#This Row],[Montant Ht]]","v":0},null,null,null,null,7]
[null,null,null,0,0.2,{"$f":"Tableau2[[#This Row],[Montant TTC]]-Tableau2[[#This Row],[Montant Ht]]","v":0},null,null,null,null,7]
[null,null,null,0,0.2,{"$f":"Tableau2[[#This Row],[Montant TTC]]-Tableau2[[#This Row],[Montant Ht]]","v":0},null,null,null,null,7]
[null,null,null,0,0.2,{"$f":"Tableau2[[#This Row],[Montant TTC]]-Tableau2[[#This Row],[Montant Ht]]","v":0},null,null,null,null,7]
[null,null,null,0,0.2,{"$f":"Tableau2[[#This Row],[Montant TTC]]-Tableau2[[#This Row],[Montant Ht]]","v":0},null,null,null,null,7]
[null,null,null,0,0.2,{"$f":"Tableau2[[#This Row],[Montant TTC]]-Tableau2[[#This Row],[Montant Ht]]","v":0},null,null,null,null,7]
[null,null,null,0,0.2,{"$f":"Tableau2[[#This Row],[Montant TTC]]-Tableau2[[#This Row],[Montant Ht]]","v":0},null,null,null,null,7]
[null,null,null,0,0.2,{"$f":"Tableau2[[#This Row],[Montant TTC]]-Tableau2[[#This Row],[Montant Ht]]","v":0},null,null,null,null,7]
[null,null,null,0,0.2,{"$f":"Tableau2[[#This Row],[Montant TTC]]-Tableau2[[#This Row],[Montant Ht]]","v":0},null,null,null,null,7]
[null,null,null,0,0.2,{"$f":"Tableau2[[#This Row],[Montant TTC]]-Tableau2[[#This Row],[Montant Ht]]","v":0},null,null,null,null,7]
[null,null,null,null,null,null,null,null,null,null,{"$f":"IF(COUNTIF(G475,\"*EF*\"),5,IF(COUNTIF(G475,\"*ES*\"),1,IF(COUNTIF(G475,\"*CH*\"),2,IF(COUNTIF(G475,\"*PR*\"),3,IF(COUNTIF(G475,\"*CO*\"),6,IF(COUNTIF(G475,\"*VI*\"),4,7))))))","v":7}]
[null,null,null,null,null,null,null,null,null,null,7]
[null,null,null,null,null,null,null,null,null,null,7]
[null,null,null,null,null,null,null,null,null,null,7]
[null,null,null,null,null,null,null,null,null,null,7]
[null,null,null,null,null,null,null,null,null,null,7]
[null,null,null,null,null,null,null,null,null,null,7]
[null,null,null,null,null,null,null,null,null,null,7]
[null,null,null,null,null,null,null,null,null,null,7]
[null,null,null,null,null,null,null,null,null,null,7]
[null,null,null,null,null,null,null,null,null,null,7]
[null,null,null,null,null,null,null,null,null,null,7]
[null,null,null,null,null,null,null,null,null,null,7]
[null,null,null,null,null,null,null,null,null,null,7]
[null,null,null,null,null,null,null,null,null,null,7]
[null,null,null,null,null,null,null,null,null,null,{"$f":"IF(COUNTIF(G490,\"*EF*\"),5,IF(COUNTIF(G490,\"*ES*\"),1,IF(COUNTIF(G490,\"*CH*\"),2,IF(COUNTIF(G490,\"*PR*\"),3,IF(COUNTIF(G490,\"*CO*\"),6,IF(COUNTIF(G490,\"*VI*\"),4,7))))))","v":7}]
[null,null,null,null,null,null,null,null,null,null,7]
[null,null,null,null,null,null,null,null,null,null,7]
[null,null,null,null,null,null,null,null,null,null,7]
[null,null,null,null,null,null,null,null,null,null,7]
[null,null,null,null,null,null,null,null,null,null,7]
[null,null,null,null,null,null,null,null,null,null,7]
[null,null,null,null,null,null,null,null,null,null,7]
[null,null,null,null,null,null,null,null,null,null,7]
[null,null,null,null,null,null,null,null,null,null,7]
[null,null,null,null,null,null,null,null,null,null,7]
[null,null,null,null,null,null,null,null,null,null,7]
[null,null,null,null,null,null,null,null,null,null,7]
[null,null,null,null,null,null,null,null,null,null,7]
[null,null,null,null,null,null,null,null,null,null,7]
[null,null,null,null,null,null,null,null,null,null,7]
[null,null,null,null,null,null,null,null,null,null,7]
[null,null,null,null,null,null,null,null,null,null,7]
[null,null,null,null,null,null,null,null,null,null,7]
[null,null,null,null,null,null,null,null,null,null,7]
[null,null,null,null,null,null,null,null,null,null,7]
[null,null,null,null,null,null,null,null,null,null,7]
[null,null,null,null,null,null,null,null,null,null,7]
[null,null,null,null,null,null,null,null,null,null,7]
[null,null,null,null,null,null,null,null,null,null,7]
[null,null,null,null,null,null,null,null,null,null,7]
[null,null,null,null,null,null,null,null,null,null,7]
[null,null,null,null,null,null,null,null,null,null,7]
[null,null,null,null,null,null,null,null,null,null,7]
[null,null,null,null,null,null,null,null,null,null,7]
[null,null,null,null,null,null,null,null,null,null,7]
[null,null,null,null,null,null,null,null,null,null,7]
[null,null,null,null,null,null,null,null,null,null,7]
[null,null,null,null,null,null,null,null,null,null,7]
[null,null,null,null,null,null,null,null,null,null,7]
[null,null,null,null,null,null,null,null,null,null,7]
[null,null,null,null,null,null,null,null,null,null,7]
[null,null,null,null,null,null,null,null,null,null,7]
[null,null,null,null,null,null,null,null,null,null,7]
[null,null,null,null,null,null,null,null,null,null,7]
[null,null,null,null,null,null,null,null,null,null,7]
[null,null,null,null,null,null,null,null,null,null,7]
[null,null,null,null,null,null,null,null,null,null,7]
[null,null,null,null,null,null,null,null,null,null,7]
[null,null,null,null,null,null,null,null,null,null,7]
[null,null,null,null,null,null,null,null,null,null,7]
[null,null,null,null,null,null,null,null,null,null,7]
[null,null,null,null,null,null,null,null,null,null,7]
[null,null,null,null,null,null,null,null,null,null,7]
[null,null,null,null,null,null,null,null,null,null,7]
[null,null,null,null,null,null,null,null,null,null,7]
[null,null,null,null,null,null,null,null,null,null,7]
[null,null,null,null,null,null,null,null,null,null,7]
[null,null,null,null,null,null,null,null,null,null,7]
[null,null,null,null,null,null,null,null,null,null,7]
[null,null,null,null,null,null,null,null,null,null,7]
[null,null,null,null,null,null,null,null,null,null,7]
[null,null,null,null,null,null,null,null,null,null,7]
[null,null,null,null,null,null,null,null,null,null,7]
[null,null,null,null,null,null,null,null,null,null,7]
[null,null,null,null,null,null,null,null,null,null,7]
[null,null,null,null,null,null,null,null,null,null,7]
[null,null,null,null,null,null,null,null,null,null,7]
[null,null,null,null,null,null,null,null,null,null,7]
[null,null,null,null,null,null,null,null,null,null,{"$f":"IF(COUNTIF(G554,\"*EF*\"),5,IF(COUNTIF(G554,\"*ES*\"),1,IF(COUNTIF(G554,\"*CH*\"),2,IF(COUNTIF(G554,\"*PR*\"),3,IF(COUNTIF(G554,\"*CO*\"),6,IF(COUNTIF(G554,\"*VI*\"),4,7))))))","v":7}]
[null,null,null,null,null,null,null,null,null,null,7]
[null,null,null,null,null,null,null,null,null,null,7]
[null,null,null,null,null,null,null,null,null,null,7]
[null,null,null,null,null,null,null,null,null,null,7]
[null,null,null,null,null,null,null,null,null,null,7]
[null,null,null,null,null,null,null,null,null,null,7]
[null,null,null,null,null,null,null,null,null,null,7]
[null,null,null,null,null,null,null,null,null,null,7]
[null,null,null,null,null,null,null,null,null,null,7]
[null,null,null,null,null,null,null,null,null,null,7]
[null,null,null,null,null,null,null,null,null,null,7]
[null,null,null,null,null,null,null,null,null,null,7]
[null,null,null,null,null,null,null,null,null,null,7]
[null,null,null,null,null,null,null,null,null,null,7]
[null,null,null,null,null,null,null,null,null,null,7]
[null,null,null,null,null,null,null,null,null,null,7]
[null,null,null,null,null,null,null,null,null,null,7]
[null,null,null,null,null,null,null,null,null,null,7]
[null,null,null,null,null,null,null,null,null,null,7]
[null,null,null,null,null,null,null,null,null,null,7]
[null,null,null,null,null,null,null,null,null,null,7]
[null,null,null,null,null,null,null,null,null,null,7]
[null,null,null,null,null,null,null,null,null,null,7]
[null,null,null,null,null,null,null,null,null,null,7]
[null,null,null,null,null,null,null,null,null,null,7]
[null,null,null,null,null,null,null,null,null,null,7]
[null,null,null,null,null,null,null,null,null,null,7]
[null,null,null,null,null,null,null,null,null,null,7]
[null,null,null,null,null,null,null,null,null,null,7]
[null,null,null,null,null,null,null,null,null,null,7]
[null,null,null,null,null,null,null,null,null,null,7]
[null,null,null,null,null,null,null,null,null,null,7]
[null,null,null,null,null,null,null,null,null,null,7]
[null,null,null,null,null,null,null,null,null,null,7]
[null,null,null,null,null,null,null,null,null,null,7]
[null,null,null,null,null,null,null,null,null,null,7]
[null,null,null,null,null,null,null,null,null,null,7]
[null,null,null,null,null,null,null,null,null,null,7]
[null,null,null,null,null,null,null,null,null,null,7]
[null,null,null,null,null,null,null,null,null,null,7]
[null,null,null,null,null,null,null,null,null,null,7]
[null,null,null,null,null,null,null,null,null,null,7]
[null,null,null,null,null,null,null,null,null,null,7]
[null,null,null,null,null,null,null,null,null,null,7]
[null,null,null,null,null,null,null,null,null,null,7]
[null,null,null,null,null,null,null,null,null,null,7]
[null,null,null,null,null,null,null,null,null,null,7]
[null,null,null,null,null,null,null,null,null,null,7]
[null,null,null,null,null,null,null,null,null,null,7]
[null,null,null,null,null,null,null,null,null,null,7]
[null,null,null,null,null,null,null,null,null,null,7]
[null,null,null,null,null,null,null,null,null,null,7]
[null,null,null,null,null,null,null,null,null,null,7]
[null,null,null,null,null,null,null,null,null,null,7]
[null,null,null,null,null,null,null,null,null,null,7]
[null,null,null,null,null,null,null,null,null,null,7]
[null,null,null,null,null,null,null,null,null,null,7]
[null,null,null,null,null,null,null,null,null,null,7]
[null,null,null,null,null,null,null,null,null,null,7]
[null,null,null,null,null,null,null,null,null,null,7]
[null,null,null,null,null,null,null,null,null,null,7]
[null,null,null,null,null,null,null,null,null,null,7]
[null,null,null,null,null,null,null,null,null,null,7]
[null,null,null,null,null,null,null,null,null,null,{"$f":"IF(COUNTIF(G618,\"*EF*\"),5,IF(COUNTIF(G618,\"*ES*\"),1,IF(COUNTIF(G618,\"*CH*\"),2,IF(COUNTIF(G618,\"*PR*\"),3,IF(COUNTIF(G618,\"*CO*\"),6,IF(COUNTIF(G618,\"*VI*\"),4,7))))))","v":7}]
[null,null,null,null,null,null,null,null,null,null,7]
[null,null,null,null,null,null,null,null,null,null,7]
[null,null,null,null,null,null,null,null,null,null,7]
[null,null,null,null,null,null,null,null,null,null,7]
[null,null,null,null,null,null,null,null,null,null,7]
[null,null,null,null,null,null,null,null,null,null,7]
[null,null,null,null,null,null,null,null,null,null,7]
[null,null,null,null,null,null,null,null,null,null,7]
[null,null,null,null,null,null,null,null,null,null,7]
[null,null,null,null,null,null,null,null,null,null,7]
[null,null,null,null,null,null,null,null,null,null,7]
[null,null,null,null,null,null,null,null,null,null,7]
[null,null,null,null,null,null,null,null,null,null,7]
[null,null,null,null,null,null,null,null,null,null,7]
[null,null,null,null,null,null,null,null,null,null,7]
[null,null,null,null,null,null,null,null,null,null,7]
[null,null,null,null,null,null,null,null,null,null,7]
[null,null,null,null,null,null,null,null,null,null,7]
[null,null,null,null,null,null,null,null,null,null,7]
[null,null,null,null,null,null,null,null,null,null,7]
[null,null,null,null,null,null,null,null,null,null,7]
[null,null,null,null,null,null,null,null,null,null,7]
[null,null,null,null,null,null,null,null,null,null,7]
[null,null,null,null,null,null,null,null,null,null,7]
[null,null,null,null,null,null,null,null,null,null,7]
[null,null,null,null,null,null,null,null,null,null,7]
[null,null,null,null,null,null,null,null,null,null,7]
[null,null,null,null,null,null,null,null,null,null,7]
[null,null,null,null,null,null,null,null,null,null,7]
[null,null,null,null,null,null,null,null,null,null,7]
[null,null,null,null,null,null,null,null,null,null,7]
[null,null,null,null,null,null,null,null,null,null,7]
[null,null,null,null,null,null,null,null,null,null,7]
[null,null,null,null,null,null,null,null,null,null,7]
[null,null,null,null,null,null,null,null,null,null,7]
[null,null,null,null,null,null,null,null,null,null,7]
[null,null,null,null,null,null,null,null,null,null,7]
[null,null,null,null,null,null,null,null,null,null,7]
[null,null,null,null,null,null,null,null,null,null,7]
[null,null,null,null,null,null,null,null,null,null,7]
[null,null,null,null,null,null,null,null,null,null,7]
[null,null,null,null,null,null,null,null,null,null,7]
[null,null,null,null,null,null,null,null,null,null,7]
[null,null,null,null,null,null,null,null,null,null,7]
[null,null,null,null,null,null,null,null,null,null,7]
[null,null,null,null,null,null,null,null,null,null,7]
[null,null,null,null,null,null,null,null,null,null,7]
[null,null,null,null,null,null,null,null,null,null,7]
[null,null,null,null,null,null,null,null,null,null,7]
[null,null,null,null,null,null,null,null,null,null,7]
[null,null,null,null,null,null,null,null,null,null,7]
[null,null,null,null,null,null,null,null,null,null,7]
[null,null,null,null,null,null,null,null,null,null,7]
[null,null,null,null,null,null,null,null,null,null,7]
[null,null,null,null,null,null,null,null,null,null,7]
[null,null,null,null,null,null,null,null,null,null,7]
[null,null,null,null,null,null,null,null,null,null,7]
[null,null,null,null,null,null,null,null,null,null,7]
[null,null,null,null,null,null,null,null,null,null,7]
[null,null,null,null,null,null,null,null,null,null,7]
[null,null,null,null,null,null,null,null,null,null,7]
[null,null,null,null,null,null,null,null,null,null,7]
[null,null,null,null,null,null,null,null,null,null,7]
[null,null,null,null,null,null,null,null,null,null,{"$f":"IF(COUNTIF(G682,\"*EF*\"),5,IF(COUNTIF(G682,\"*ES*\"),1,IF(COUNTIF(G682,\"*CH*\"),2,IF(COUNTIF(G682,\"*PR*\"),3,IF(COUNTIF(G682,\"*CO*\"),6,IF(COUNTIF(G682,\"*VI*\"),4,7))))))","v":7}]
[null,null,null,null,null,null,null,null,null,null,7]
[null,null,null,null,null,null,null,null,null,null,7]
[null,null,null,null,null,null,null,null,null,null,7]
[null,null,null,null,null,null,null,null,null,null,7]
[null,null,null,null,null,null,null,null,null,null,7]
[null,null,null,null,null,null,null,null,null,null,7]
[null,null,null,null,null,null,null,null,null,null,7]
[null,null,null,null,null,null,null,null,null,null,7]
[null,null,null,null,null,null,null,null,null,null,7]
[null,null,null,null,null,null,null,null,null,null,7]
[null,null,null,null,null,null,null,null,null,null,7]
[null,null,null,null,null,null,null,null,null,null,7]
[null,null,null,null,null,null,null,null,null,null,7]
[null,null,null,null,null,null,null,null,null,null,7]
[null,null,null,null,null,null,null,null,null,null,7]
[null,null,null,null,null,null,null,null,null,null,7]
[null,null,null,null,null,null,null,null,null,null,7]
[null,null,null,null,null,null,null,null,null,null,7]
[null,null,null,null,null,null,null,null,null,null,7]
[null,null,null,null,null,null,null,null,null,null,7]
[null,null,null,null,null,null,null,null,null,null,7]
[null,null,null,null,null,null,null,null,null,null,7]
[null,null,null,null,null,null,null,null,null,null,7]
[null,null,null,null,null,null,null,null,null,null,7]
[null,null,null,null,null,null,null,null,null,null,7]
[null,null,null,null,null,null,null,null,null,null,7]
[null,null,null,null,null,null,null,null,null,null,7]
[null,null,null,null,null,null,null,null,null,null,7]
[null,null,null,null,null,null,null,null,null,null,7]
[null,null,null,null,null,null,null,null,null,null,7]
[null,null,null,null,null,null,null,null,null,null,7]
[null,null,null,null,null,null,null,null,null,null,7]
[null,null,null,null,null,null,null,null,null,null,7]
[null,null,null,null,null,null,null,null,null,null,7]
[null,null,null,null,null,null,null,null,null,null,7]
[null,null,null,null,null,null,null,null,null,null,7]
[null,null,null,null,null,null,null,null,null,null,7]
[null,null,null,null,null,null,null,null,null,null,7]
[null,null,null,null,null,null,null,null,null,null,7]
[null,null,null,null,null,null,null,null,null,null,7]
[null,null,null,null,null,null,null,null,null,null,7]
[null,null,null,null,null,null,null,null,null,null,7]
[null,null,null,null,null,null,null,null,null,null,7]
[null,null,null,null,null,null,null,null,null,null,7]
[null,null,null,null,null,null,null,null,null,null,7]
[null,null,null,null,null,null,null,null,null,null,7]
[null,null,null,null,null,null,null,null,null,null,7]
[null,null,null,null,null,null,null,null,null,null,7]
[null,null,null,null,null,null,null,null,null,null,7]
[null,null,null,null,null,null,null,null,null,null,7]
[null,null,null,null,null,null,null,null,null,null,7]
[null,null,null,null,null,null,null,null,null,null,7]
[null,null,null,null,null,null,null,null,null,null,7]
[null,null,null,null,null,null,null,null,null,null,7]
[null,null,null,null,null,null,null,null,null,null,7]
[null,null,null,null,null,null,null,null,null,null,7]
[null,null,null,null,null,null,null,null,null,null,7]
[null,null,null,null,null,null,null,null,null,null,7]
[null,null,null,null,null,null,null,null,null,null,7]
[null,null,null,null,null,null,null,null,null,null,7]
[null,null,null,null,null,null,null,null,null,null,7]
[null,null,null,null,null,null,null,null,null,null,7]
[null,null,null,null,null,null,null,null,null,null,7]
[null,null,null,null,null,null,null,null,null,null,{"$f":"IF(COUNTIF(G746,\"*EF*\"),5,IF(COUNTIF(G746,\"*ES*\"),1,IF(COUNTIF(G746,\"*CH*\"),2,IF(COUNTIF(G746,\"*PR*\"),3,IF(COUNTIF(G746,\"*CO*\"),6,IF(COUNTIF(G746,\"*VI*\"),4,7))))))","v":7}]
[null,null,null,null,null,null,null,null,null,null,7]
[null,null,null,null,null,null,null,null,null,null,7]
[null,null,null,null,null,null,null,null,null,null,7]
[null,null,null,null,null,null,null,null,null,null,7]
[null,null,null,null,null,null,null,null,null,null,7]
[null,null,null,null,null,null,null,null,null,null,7]
[null,null,null,null,null,null,null,null,null,null,7]
[null,null,null,null,null,null,null,null,null,null,7]
[null,null,null,null,null,null,null,null,null,null,7]
[null,null,null,null,null,null,null,null,null,null,7]
[null,null,null,null,null,null,null,null,null,null,7]
[null,null,null,null,null,null,null,null,null,null,7]
[null,null,null,null,null,null,null,null,null,null,7]
[null,null,null,null,null,null,null,null,null,null,7]
[null,null,null,null,null,null,null,null,null,null,7]
[null,null,null,null,null,null,null,null,null,null,7]
[null,null,null,null,null,null,null,null,null,null,7]
[null,null,null,null,null,null,null,null,null,null,7]
[null,null,null,null,null,null,null,null,null,null,7]
[null,null,null,null,null,null,null,null,null,null,7]
[null,null,null,null,null,null,null,null,null,null,7]
[null,null,null,null,null,null,null,null,null,null,7]
[null,null,null,null,null,null,null,null,null,null,7]
[null,null,null,null,null,null,null,null,null,null,7]
[null,null,null,null,null,null,null,null,null,null,7]
[null,null,null,null,null,null,null,null,null,null,7]
[null,null,null,null,null,null,null,null,null,null,7]
[null,null,null,null,null,null,null,null,null,null,7]
[null,null,null,null,null,null,null,null,null,null,7]
[null,null,null,null,null,null,null,null,null,null,7]
[null,null,null,null,null,null,null,null,null,null,7]
[null,null,null,null,null,null,null,null,null,null,7]
[null,null,null,null,null,null,null,null,null,null,7]
[null,null,null,null,null,null,null,null,null,null,7]
[null,null,null,null,null,null,null,null,null,null,7]
[null,null,null,null,null,null,null,null,null,null,7]
[null,null,null,null,null,null,null,null,null,null,7]
[null,null,null,null,null,null,null,null,null,null,7]
[null,null,null,null,null,null,null,null,null,null,7]
[null,null,null,null,null,null,null,null,null,null,7]
[null,null,null,null,null,null,null,null,null,null,7]
[null,null,null,null,null,null,null,null,null,null,7]
[null,null,null,null,null,null,null,null,null,null,7]
[null,null,null,null,null,null,null,null,null,null,7]
[null,null,null,null,null,null,null,null,null,null,7]
[null,null,null,null,null,null,null,null,null,null,7]
[null,null,null,null,null,null,null,null,null,null,7]
[null,null,null,null,null,null,null,null,null,null,7]
[null,null,null,null,null,null,null,null,null,null,7]
[null,null,null,null,null,null,null,null,null,null,7]
[null,null,null,null,null,null,null,null,null,null,7]
[null,null,null,null,null,null,null,null,null,null,7]
[null,null,null,null,null,null,null,null,null,null,7]
[null,null,null,null,null,null,null,null,null,null,7]
[null,null,null,null,null,null,null,null,null,null,7]
[null,null,null,null,null,null,null,null,null,null,7]
[null,null,null,null,null,null,null,null,null,null,7]
[null,null,null,null,null,null,null,null,null,null,7]
[null,null,null,null,null,null,null,null,null,null,7]
[null,null,null,null,null,null,null,null,null,null,7]
[null,null,null,null,null,null,null,null,null,null,7]
[null,null,null,null,null,null,null,null,null,null,7]
[null,null,null,null,null,null,null,null,null,null,7]
[null,null,null,null,null,null,null,null,null,null,{"$f":"IF(COUNTIF(G810,\"*EF*\"),5,IF(COUNTIF(G810,\"*ES*\"),1,IF(COUNTIF(G810,\"*CH*\"),2,IF(COUNTIF(G810,\"*PR*\"),3,IF(COUNTIF(G810,\"*CO*\"),6,IF(COUNTIF(G810,\"*VI*\"),4,7))))))","v":7}]
[null,null,null,null,null,null,null,null,null,null,7]
[null,null,null,null,null,null,null,null,null,null,7]
[null,null,null,null,null,null,null,null,null,null,7]
[null,null,null,null,null,null,null,null,null,null,7]
[null,null,null,null,null,null,null,null,null,null,7]
[null,null,null,null,null,null,null,null,null,null,7]
[null,null,null,null,null,null,null,null,null,null,7]
[null,null,null,null,null,null,null,null,null,null,7]
[null,null,null,null,null,null,null,null,null,null,7]
[null,null,null,null,null,null,null,null,null,null,7]
[null,null,null,null,null,null,null,null,null,null,7]
[null,null,null,null,null,null,null,null,null,null,7]
[null,null,null,null,null,null,null,null,null,null,7]
[null,null,null,null,null,null,null,null,null,null,7]
[null,null,null,null,null,null,null,null,null,null,7]
[null,null,null,null,null,null,null,null,null,null,7]
[null,null,null,null,null,null,null,null,null,null,7]
[null,null,null,null,null,null,null,null,null,null,7]
[null,null,null,null,null,null,null,null,null,null,7]
[null,null,null,null,null,null,null,null,null,null,7]
[null,null,null,null,null,null,null,null,null,null,7]
[null,null,null,null,null,null,null,null,null,null,7]
[null,null,null,null,null,null,null,null,null,null,7]
[null,null,null,null,null,null,null,null,null,null,7]
[null,null,null,null,null,null,null,null,null,null,7]
[null,null,null,null,null,null,null,null,null,null,7]
[null,null,null,null,null,null,null,null,null,null,7]
[null,null,null,null,null,null,null,null,null,null,7]
[null,null,null,null,null,null,null,null,null,null,7]
[null,null,null,null,null,null,null,null,null,null,7]
[null,null,null,null,null,null,null,null,null,null,7]
[null,null,null,null,null,null,null,null,null,null,7]
[null,null,null,null,null,null,null,null,null,null,7]
[null,null,null,null,null,null,null,null,null,null,7]
[null,null,null,null,null,null,null,null,null,null,7]
[null,null,null,null,null,null,null,null,null,null,7]
[null,null,null,null,null,null,null,null,null,null,7]
[null,null,null,null,null,null,null,null,null,null,7]
[null,null,null,null,null,null,null,null,null,null,7]
[null,null,null,null,null,null,null,null,null,null,7]
[null,null,null,null,null,null,null,null,null,null,7]
[null,null,null,null,null,null,null,null,null,null,7]
[null,null,null,null,null,null,null,null,null,null,7]
[null,null,null,null,null,null,null,null,null,null,7]
[null,null,null,null,null,null,null,null,null,null,7]
[null,null,null,null,null,null,null,null,null,null,7]
[null,null,null,null,null,null,null,null,null,null,7]
[null,null,null,null,null,null,null,null,null,null,7]
[null,null,null,null,null,null,null,null,null,null,7]
[null,null,null,null,null,null,null,null,null,null,7]
[null,null,null,null,null,null,null,null,null,null,7]
[null,null,null,null,null,null,null,null,null,null,7]
[null,null,null,null,null,null,null,null,null,null,7]
[null,null,null,null,null,null,null,null,null,null,7]
[null,null,null,null,null,null,null,null,null,null,7]
[null,null,null,null,null,null,null,null,null,null,7]
[null,null,null,null,null,null,null,null,null,null,7]
[null,null,null,null,null,null,null,null,null,null,7]
[null,null,null,null,null,null,null,null,null,null,7]
[null,null,null,null,null,null,null,null,null,null,7]
[null,null,null,null,null,null,null,null,null,null,7]
[null,null,null,null,null,null,null,null,null,null,7]
[null,null,null,null,null,null,null,null,null,null,7]
[null,null,null,null,null,null,null,null,null,null,{"$f":"IF(COUNTIF(G874,\"*EF*\"),5,IF(COUNTIF(G874,\"*ES*\"),1,IF(COUNTIF(G874,\"*CH*\"),2,IF(COUNTIF(G874,\"*PR*\"),3,IF(COUNTIF(G874,\"*CO*\"),6,IF(COUNTIF(G874,\"*VI*\"),4,7))))))","v":7}]
[null,null,null,null,null,null,null,null,null,null,7]
[null,null,null,null,null,null,null,null,null,null,7]
[null,null,null,null,null,null,null,null,null,null,7]
[null,null,null,null,null,null,null,null,null,null,7]
[null,null,null,null,null,null,null,null,null,null,7]
[null,null,null,null,null,null,null,null,null,null,7]
[null,null,null,null,null,null,null,null,null,null,7]
[null,null,null,null,null,null,null,null,null,null,7]
[null,null,null,null,null,null,null,null,null,null,7]
[null,null,null,null,null,null,null,null,null,null,7]
[null,null,null,null,null,null,null,null,null,null,7]
[null,null,null,null,null,null,null,null,null,null,7]
[null,null,null,null,null,null,null,null,null,null,7]
[null,null,null,null,null,null,null,null,null,null,7]
[null,null,null,null,null,null,null,null,null,null,7]
[null,null,null,null,null,null,null,null,null,null,7]
[null,null,null,null,null,null,null,null,null,null,7]
[null,null,null,null,null,null,null,null,null,null,7]
[null,null,null,null,null,null,null,null,null,null,7]
[null,null,null,null,null,null,null,null,null,null,7]
[null,null,null,null,null,null,null,null,null,null,7]
[null,null,null,null,null,null,null,null,null,null,7]
[null,null,null,null,null,null,null,null,null,null,7]
[null,null,null,null,null,null,null,null,null,null,7]
[null,null,null,null,null,null,null,null,null,null,7]
[null,null,null,null,null,null,null,null,null,null,7]

{"sheet":"ACHAT","index":1,"n_rows":354,"n_cols":15,"rows_kept":354,"cut":false,"hidden":false,"merged":[[1,0,1,14]]}
[{"$f":"XML!XY1","v":"2016-04-01"}]
["TABLEAU DES DEDUCTIONS"]
[]
[null,"FACTURE N°","DESIGNATION","MONTANT HT","TVA","MONTANT TTC","IF","RAISON SOCIAL","ICE","TX %","MODE REG","DATE PAIEMENT","DATE FACTURE","Mois Décl","Mode paiement"]
[null,201403278,"MARCHANDISES",2250,450,2700,1008985,{"$f":"INDEX(X!$H$2:$J$1000,MATCH($G5,X!$H$2:$H$1000,0),2)","v":"FOURNISSEUR 0020"},{"$f":"INDEX(X!$H$2:$J$1000,MATCH($G5,X!$H$2:$H$1000,0),3)","v":"00191111004000074"},0.2,"EFFET T 04670220","2014-11-10","2014-11-30","2015-01-01",{"$f":"IF(COUNTIF(K5,\"*EF*\"),5,IF(COUNTIF(K5,\"*ES*\"),1,IF(COUNTIF(K5,\"*CH*\"),2,IF(COUNTIF(K5,\"*PR*\"),3,IF(COUNTIF(K5,\"*CO*\"),6,IF(COUNTIF(K5,\"*VI*\"),4,7))))))","v":5}]
[null,"15/1/0005","MARCHANDISES",2089.6799999999998,417.94,2507.62,1009741,{"$f":"INDEX(X!$H$2:$J$1000,MATCH($G6,X!$H$2:$H$1000,0),2)","v":"FOURNISSEUR 0032"},{"$f":"INDEX(X!$H$2:$J$1000,MATCH($G6,X!$H$2:$H$1000,0),3)","v":"00311111004000086"},0.2,"EFFET 04670240","2015-01-07","2015-01-31","2015-01-01",5]
[null,14102845,"MARCHANDISES",8250.83,1650.17,9901,1008922,{"$f":"INDEX(X!$H$2:$J$1000,MATCH($G7,X!$H$2:$H$1000,0),2)","v":"FOURNISSEUR 0019"},{"$f":"INDEX(X!$H$2:$J$1000,MATCH($G7,X!$H$2:$H$1000,0),3)","v":"00181111004000073"},0.2,"EFFET T 04670242","2015-01-30","2014-10-31","2015-01-01",5]
[null,14102846,"MARCHANDISES",11114.17,2222.83,13337,1008922,{"$f":"INDEX(X!$H$2:$J$1000,MATCH($G8,X!$H$2:$H$1000,0),2)","v":"FOURNISSEUR 0019"},{"$f":"INDEX(X!$H$2:$J$1000,MATCH($G8,X!$H$2:$H$1000,0),3)","v":"00181111004000073"},0.2,"EFFET T 04670242","2015-01-30","2014-10-31","2015-01-01",5]
[null,"15f0105","MARCHANDISES",2791.67,558.33000000000004,3350,1008922,{"$f":"INDEX(X!$H$2:$J$1000,MATCH($G9,X!$H$2:$H$1000,0),2)","v":"FOURNISSEUR 0019"},{"$f":"INDEX(X!$H$2:$J$1000,MATCH($G9,X!$H$2:$H$1000,0),3)","v":"00181111004000073"},0.2,"EFFET T 04670228","2015-01-30","2015-01-07","2015-01-01",5]
[null,50154,"MARCHANDISES",18513.330000000002,3702.67,22216,1008733,{"$f":"INDEX(X!$H$2:$J$1000,MATCH($G10,X!$H$2:$H$1000,0),2)","v":"FOURNISSEUR 0016"},{"$f":"INDEX(X!$H$2:$J$1000,MATCH($G10,X!$H$2:$H$1000,0),3)","v":"00151111004000070"},0.2,"EFFET T  4670226","2015-01-30","2015-01-21","2015-02-01",5]
[null,2015115,"MARCHANDISES",6450,1290,7740,1008796,{"$f":"INDEX(X!$H$2:$J$1000,MATCH($G11,X!$H$2:$H$1000,0),2)","v":"FOURNISSEUR 0017"},{"$f":"INDEX(X!$H$2:$J$1000,MATCH($G11,X!$H$2:$H$1000,0),3)","v":"00161111004000071"},0.2,"EFFET T 4670229","2015-02-10","2015-02-13","2015-02-01",5]
[null,14113132,"MARCHANDISES",3220,644,3864,1008922,{"$f":"INDEX(X!$H$2:$J$1000,MATCH($G12,X!$H$2:$H$1000,0),2)","v":"FOURNISSEUR 0019"},{"$f":"INDEX(X!$H$2:$J$1000,MATCH($G12,X!$H$2:$H$1000,0),3)","v":"00181111004000073"},0.2,"EFFET R4670232","2015-02-18","2014-11-30","2015-02-01",5]
[null,"15f0207","MARCHANDISES",3700,740,4440,1009552,{"$f":"INDEX(X!$H$2:$J$1000,MATCH($G13,X!$H$2:$H$1000,0),2)","v":"FOURNISSEUR 0029"},{"$f":"INDEX(X!$H$2:$J$1000,MATCH($G13,X!$H$2:$H$1000,0),3)","v":"00281111004000083"},0.2,"EFFET T  04670234","2015-03-02","2015-02-19","2015-03-01",5]
[null,"15/2/0011","MARCHANDISES",1208,241.6,1449.6,1009741,{"$f":"INDEX(X!$H$2:$J$1000,MATCH($G14,X!$H$2:$H$1000,0),2)","v":"FOURNISSEUR 0032"},{"$f":"INDEX(X!$H$2:$J$1000,MATCH($G14,X!$H$2:$H$1000,0),3)","v":"00311111004000086"},0.2,"EFFET T 04955008","2015-03-04","2015-02-28","2015-03-01",5]
[null,5202014,"MARCHANDISES",1385,277,1662,1009426,{"$f":"INDEX(X!$H$2:$J$1000,MATCH($G15,X!$H$2:$H$1000,0),2)","v":"FOURNISSEUR 0027"},{"$f":"INDEX(X!$H$2:$J$1000,MATCH($G15,X!$H$2:$H$1000,0),3)","v":"00261111004000081"},0.2,"EFFET T 04955002","2015-03-05","2014-10-31","2015-03-01",5]
[null,410113,"MARCHANDISES",8969.17,1793.83,10763,1009678,{"$f":"INDEX(X!$H$2:$J$1000,MATCH($G16,X!$H$2:$H$1000,0),2)","v":"FOURNISSEUR 0031"},{"$f":"INDEX(X!$H$2:$J$1000,MATCH($G16,X!$H$2:$H$1000,0),3)","v":"00301111004000085"},0.2,"EFFET T 04670236","2015-03-05","2014-10-31","2015-03-01",5]
[null,411153,"MARCHANDISES",5731.67,1146.33,6878,1009678,{"$f":"INDEX(X!$H$2:$J$1000,MATCH($G17,X!$H$2:$H$1000,0),2)","v":"FOURNISSEUR 0031"},{"$f":"INDEX(X!$H$2:$J$1000,MATCH($G17,X!$H$2:$H$1000,0),3)","v":"00301111004000085"},0.2,"EFFET T 04670236","2015-03-05","2014-11-29","2015-03-01",5]
[null,5672014,"MARCHANDISES",1334,266.8,1600.8,1009426,{"$f":"INDEX(X!$H$2:$J$1000,MATCH($G18,X!$H$2:$H$1000,0),2)","v":"FOURNISSEUR 0027"},{"$f":"INDEX(X!$H$2:$J$1000,MATCH($G18,X!$H$2:$H$1000,0),3)","v":"00261111004000081"},0.2,"EFFET T 04955002","2015-03-05","2014-11-30","2015-03-01",5]
[null,14113151,"MARCHANDISES",26705.83,5341.17,32047,1008922,{"$f":"INDEX(X!$H$2:$J$1000,MATCH($G19,X!$H$2:$H$1000,0),2)","v":"FOURNISSEUR 0019"},{"$f":"INDEX(X!$H$2:$J$1000,MATCH($G19,X!$H$2:$H$1000,0),3)","v":"00181111004000073"},0.2,"EFFET T 04955006","2015-03-05","2014-11-30","2015-03-01",5]
[null,14113152,"MARCHANDISES",16729.169999999998,3345.83,20075,1008922,{"$f":"INDEX(X!$H$2:$J$1000,MATCH($G20,X!$H$2:$H$1000,0),2)","v":"FOURNISSEUR 0019"},{"$f":"INDEX(X!$H$2:$J$1000,MATCH($G20,X!$H$2:$H$1000,0),3)","v":"00181111004000073"},0.2,"EFFET T 04955006","2015-03-05","2014-11-30","2015-03-01",5]
[null,41247,"MARCHANDISES",533.33000000000004,106.67,640,1009678,{"$f":"INDEX(X!$H$2:$J$1000,MATCH($G21,X!$H$2:$H$1000,0),2)","v":"FOURNISSEUR 0031"},{"$f":"INDEX(X!$H$2:$J$1000,MATCH($G21,X!$H$2:$H$1000,0),3)","v":"00301111004000085"},0.2,"EFFET T 04670236","2015-03-05","2014-12-31","2015-03-01",5]
[null,412119,"MARCHANDISES",5379.17,1075.83,6455,1009678,{"$f":"INDEX(X!$H$2:$J$1000,MATCH($G22,X!$H$2:$H$1000,0),2)","v":"FOURNISSEUR 0031"},{"$f":"INDEX(X!$H$2:$J$1000,MATCH($G22,X!$H$2:$H$1000,0),3)","v":"00301111004000085"},0.2,"EFFET T 04955004","2015-03-05","2014-12-31","2015-03-01",5]
[null,14123490,"MARCHANDISES",22058.33,4411.67,26470,1008922,{"$f":"INDEX(X!$H$2:$J$1000,MATCH($G23,X!$H$2:$H$1000,0),2)","v":"FOURNISSEUR 0019"},{"$f":"INDEX(X!$H$2:$J$1000,MATCH($G23,X!$H$2:$H$1000,0),3)","v":"00181111004000073"},0.2,"EFFET T  04955007","2015-03-05","2014-12-31","2015-03-01",5]
[null,14123577,"MARCHANDISES",562.5,112.5,675,1008922,{"$f":"INDEX(X!$H$2:$J$1000,MATCH($G24,X!$H$2:$H$1000,0),2)","v":"FOURNISSEUR 0019"},{"$f":"INDEX(X!$H$2:$J$1000,MATCH($G24,X!$H$2:$H$1000,0),3)","v":"00181111004000073"},0.2,"EFFET T  04955007","2015-03-05","2014-12-31","2015-03-01",5]
[null,1502000905,"MARCHANDISES",6420,1284,7704,1008607,{"$f":"INDEX(X!$H$2:$J$1000,MATCH($G25,X!$H$2:$H$1000,0),2)","v":"FOURNISSEUR 0014"},{"$f":"INDEX(X!$H$2:$J$1000,MATCH($G25,X!$H$2:$H$1000,0),3)","v":"00131111004000068"},0.2,"CHQ 3755725","2015-03-30","2015-02-28","2015-03-01",2]
[null,"15f0303","MARCHANDISES",4881.67,976.33,5858,1009552,{"$f":"INDEX(X!$H$2:$J$1000,MATCH($G26,X!$H$2:$H$1000,0),2)","v":"FOURNISSEUR 0029"},{"$f":"INDEX(X!$H$2:$J$1000,MATCH($G26,X!$H$2:$H$1000,0),3)","v":"00281111004000083"},0.2,"EFFET T  04670239","2015-03-30","2015-03-04","2015-03-01",5]
[null,2316,"MARCHANDISES",10916.67,2183.33,13100,1009237,{"$f":"INDEX(X!$H$2:$J$1000,MATCH($G27,X!$H$2:$H$1000,0),2)","v":"FOURNISSEUR 0024"},{"$f":"INDEX(X!$H$2:$J$1000,MATCH($G27,X!$H$2:$H$1000,0),3)","v":"00231111004000078"},0.2,"EFFET  04670230","2015-03-02","2015-03-02","2015-04-01",5]
[null,2327,"MARCHANDISES",10833.33,2166.67,13000,1009237,{"$f":"INDEX(X!$H$2:$J$1000,MATCH($G28,X!$H$2:$H$1000,0),2)","v":"FOURNISSEUR 0024"},{"$f":"INDEX(X!$H$2:$J$1000,MATCH($G28,X!$H$2:$H$1000,0),3)","v":"00231111004000078"},0.2,"EFFET  04670231","2015-03-16","2015-03-16","2015-04-01",5]
[null,2335,"MARCHANDISES",17875,3575,21450,1009237,{"$f":"INDEX(X!$H$2:$J$1000,MATCH($G29,X!$H$2:$H$1000,0),2)","v":"FOURNISSEUR 0024"},{"$f":"INDEX(X!$H$2:$J$1000,MATCH($G29,X!$H$2:$H$1000,0),3)","v":"00231111004000078"},0.2,"EFFET  04670238","2015-03-30","2015-03-30","2015-04-01",5]
[null,"15/03/0029","MARCHANDISES",6013.33,1202.67,7216,1009741,{"$f":"INDEX(X!$H$2:$J$1000,MATCH($G30,X!$H$2:$H$1000,0),2)","v":"FOURNISSEUR 0032"},{"$f":"INDEX(X!$H$2:$J$1000,MATCH($G30,X!$H$2:$H$1000,0),3)","v":"00311111004000086"},0.2,"EFFET T  4955017","2015-04-06","2015-03-31","2015-04-01",5]
[null,502106,"MARCHANDISES",12966.67,2593.33,15560,1008733,{"$f":"INDEX(X!$H$2:$J$1000,MATCH($G31,X!$H$2:$H$1000,0),2)","v":"FOURNISSEUR 0016"},{"$f":"INDEX(X!$H$2:$J$1000,MATCH($G31,X!$H$2:$H$1000,0),3)","v":"00151111004000070"},0.2,"EFFET T  04670235","2015-03-02","2015-02-28","2015-05-01",5]
[null,503142,"MARCHANDISES",666.67,133.33000000000001,800,1008733,{"$f":"INDEX(X!$H$2:$J$1000,MATCH($G32,X!$H$2:$H$1000,0),2)","v":"FOURNISSEUR 0016"},{"$f":"INDEX(X!$H$2:$J$1000,MATCH($G32,X!$H$2:$H$1000,0),3)","v":"00151111004000070"},0.2,"EFFET T  04955005","2015-03-27","2015-03-31","2015-05-01",5]
[null,503117,"MARCHANDISES",6591.67,1318.33,7910,1008733,{"$f":"INDEX(X!$H$2:$J$1000,MATCH($G33,X!$H$2:$H$1000,0),2)","v":"FOURNISSEUR 0016"},{"$f":"INDEX(X!$H$2:$J$1000,MATCH($G33,X!$H$2:$H$1000,0),3)","v":"00151111004000070"},0.2,"ESPECES","2015-03-31","2015-03-31","2015-05-01",1]
[null,"f0150061","MARCHANDISES",6000,1200,7200,1007788,{"$f":"INDEX(X!$H$2:$J$1000,MATCH($G34,X!$H$2:$H$1000,0),2)","v":"FOURNISSEUR 0001"},{"$f":"INDEX(X!$H$2:$J$1000,MATCH($G34,X!$H$2:$H$1000,0),3)","v":"00001111004000055"},0.2,"ESPECES","2015-04-01","2015-04-01","2015-05-01",1]
[null,"131/15","MARCHANDISES",5208.33,1041.67,6250,1008670,{"$f":"INDEX(X!$H$2:$J$1000,MATCH($G35,X!$H$2:$H$1000,0),2)","v":"FOURNISSEUR 0015"},{"$f":"INDEX(X!$H$2:$J$1000,MATCH($G35,X!$H$2:$H$1000,0),3)","v":"00141111004000069"},0.2,"EFFET T  04670244","2015-04-15","2015-04-15","2015-05-01",5]
[null,15010111,"MARCHANDISES",18833.75,3766.75,22600.5,1008922,{"$f":"INDEX(X!$H$2:$J$1000,MATCH($G36,X!$H$2:$H$1000,0),2)","v":"FOURNISSEUR 0019"},{"$f":"INDEX(X!$H$2:$J$1000,MATCH($G36,X!$H$2:$H$1000,0),3)","v":"00181111004000073"},0.2,"EFFET T  04670243","2015-04-20","2015-01-31","2015-05-01",5]
[null,"15f0416","MARCHANDISES",2278.33,455.67,2734,1009552,{"$f":"INDEX(X!$H$2:$J$1000,MATCH($G37,X!$H$2:$H$1000,0),2)","v":"FOURNISSEUR 0029"},{"$f":"INDEX(X!$H$2:$J$1000,MATCH($G37,X!$H$2:$H$1000,0),3)","v":"00281111004000083"},0.2,"EFFET T  04955001","2015-04-30","2015-04-24","2015-05-01",5]
[null,15010012,"MARCHANDISES",23097.919999999998,4619.58,27717.5,1008922,{"$f":"INDEX(X!$H$2:$J$1000,MATCH($G38,X!$H$2:$H$1000,0),2)","v":"FOURNISSEUR 0019"},{"$f":"INDEX(X!$H$2:$J$1000,MATCH($G38,X!$H$2:$H$1000,0),3)","v":"00181111004000073"},0.2," EFFET T  04955029","2015-05-06","2015-01-31","2015-05-01",5]
[null,15010013,"MARCHANDISES",9980,1996,11976,1008922,{"$f":"INDEX(X!$H$2:$J$1000,MATCH($G39,X!$H$2:$H$1000,0),2)","v":"FOURNISSEUR 0019"},{"$f":"INDEX(X!$H$2:$J$1000,MATCH($G39,X!$H$2:$H$1000,0),3)","v":"00181111004000073"},0.2," EFFET T  04955029","2015-05-06","2015-01-31","2015-05-01",5]
[null,150200034,"MARCHANDISES",8650,1730,10380,1007914,{"$f":"INDEX(X!$H$2:$J$1000,MATCH($G40,X!$H$2:$H$1000,0),2)","v":"FOURNISSEUR 0003"},{"$f":"INDEX(X!$H$2:$J$1000,MATCH($G40,X!$H$2:$H$1000,0),3)","v":"00021111004000057"},0.2,"EFFET T  04670250","2015-05-11","2015-02-23","2015-05-01",5]
[null,183,"MARCHANDISES",770,154,924,1007914,{"$f":"INDEX(X!$H$2:$J$1000,MATCH($G41,X!$H$2:$H$1000,0),2)","v":"FOURNISSEUR 0003"},{"$f":"INDEX(X!$H$2:$J$1000,MATCH($G41,X!$H$2:$H$1000,0),3)","v":"00021111004000057"},0.2,"EFFET T  04955028","2015-05-15","2015-04-27","2015-05-01",5]
[null,"135/15","MARCHANDISES",5050,1010,6060,1008670,{"$f":"INDEX(X!$H$2:$J$1000,MATCH($G42,X!$H$2:$H$1000,0),2)","v":"FOURNISSEUR 0015"},{"$f":"INDEX(X!$H$2:$J$1000,MATCH($G42,X!$H$2:$H$1000,0),3)","v":"00141111004000069"},0.2,"EFFET T  04670247","2015-05-20","2015-05-15","2015-05-01",5]
[null,27758,"MARCHANDISES",458.33,91.67,550,1008103,{"$f":"INDEX(X!$H$2:$J$1000,MATCH($G43,X!$H$2:$H$1000,0),2)","v":"FOURNISSEUR 0006"},{"$f":"INDEX(X!$H$2:$J$1000,MATCH($G43,X!$H$2:$H$1000,0),3)","v":"00051111004000060"},0.2,"CHQ  3755728","2015-05-29","2015-05-20","2015-05-01",2]
[null,"15/06/0053","MARCHANDISES",1830.7,366.14,2196.84,1009741,{"$f":"INDEX(X!$H$2:$J$1000,MATCH($G44,X!$H$2:$H$1000,0),2)","v":"FOURNISSEUR 0032"},{"$f":"INDEX(X!$H$2:$J$1000,MATCH($G44,X!$H$2:$H$1000,0),3)","v":"00311111004000086"},0.2,"EFFET T  04955034","2015-05-05","2015-06-15","2015-06-01",5]
[null,15020395,"MARCHANDISES",16482.5,3296.5,19779,1008922,{"$f":"INDEX(X!$H$2:$J$1000,MATCH($G45,X!$H$2:$H$1000,0),2)","v":"FOURNISSEUR 0019"},{"$f":"INDEX(X!$H$2:$J$1000,MATCH($G45,X!$H$2:$H$1000,0),3)","v":"00181111004000073"},0.2,"EFFET T  04955030","2015-06-01","2015-02-28","2015-06-01",5]
[null,15020396,"MARCHANDISES",8870.83,1774.17,10645,1008922,{"$f":"INDEX(X!$H$2:$J$1000,MATCH($G46,X!$H$2:$H$1000,0),2)","v":"FOURNISSEUR 0019"},{"$f":"INDEX(X!$H$2:$J$1000,MATCH($G46,X!$H$2:$H$1000,0),3)","v":"00181111004000073"},0.2,"EFFET T  04955030","2015-06-01","2015-02-28","2015-06-01",5]
[null,15020402,"MARCHANDISES",1383.33,276.67,1660,1008922,{"$f":"INDEX(X!$H$2:$J$1000,MATCH($G47,X!$H$2:$H$1000,0),2)","v":"FOURNISSEUR 0019"},{"$f":"INDEX(X!$H$2:$J$1000,MATCH($G47,X!$H$2:$H$1000,0),3)","v":"00181111004000073"},0.2,"EFFET T  04955030","2015-06-01","2015-02-28","2015-06-01",5]
[null,502139,"MARCHANDISES",7283.75,1456.75,8740.5,1009678,{"$f":"INDEX(X!$H$2:$J$1000,MATCH($G48,X!$H$2:$H$1000,0),2)","v":"FOURNISSEUR 0031"},{"$f":"INDEX(X!$H$2:$J$1000,MATCH($G48,X!$H$2:$H$1000,0),3)","v":"00301111004000085"},0.2,"EFFET T  04955025","2015-06-01","2015-02-28","2015-06-01",5]
[null,"15f0506","MARCHANDISES",939.58,187.92,1127.5,1009552,{"$f":"INDEX(X!$H$2:$J$1000,MATCH($G49,X!$H$2:$H$1000,0),2)","v":"FOURNISSEUR 0029"},{"$f":"INDEX(X!$H$2:$J$1000,MATCH($G49,X!$H$2:$H$1000,0),3)","v":"00281111004000083"},0.2,"EFFET T  04955010","2015-06-01","2015-05-11","2015-06-01",5]
[null,"fa2381","MARCHANDISES",14166.67,2833.33,17000,1008670,{"$f":"INDEX(X!$H$2:$J$1000,MATCH($G50,X!$H$2:$H$1000,0),2)","v":"FOURNISSEUR 0015"},{"$f":"INDEX(X!$H$2:$J$1000,MATCH($G50,X!$H$2:$H$1000,0),3)","v":"00141111004000069"},0.2,"EFFET T 04670248","2015-06-01","2015-06-01","2015-06-01",5]
[null,"15/06/0054","MARCHANDISES",7643.38,1528.68,9172.06,1009741,{"$f":"INDEX(X!$H$2:$J$1000,MATCH($G51,X!$H$2:$H$1000,0),2)","v":"FOURNISSEUR 0032"},{"$f":"INDEX(X!$H$2:$J$1000,MATCH($G51,X!$H$2:$H$1000,0),3)","v":"00311111004000086"},0.2,"EFFET T  04955043","2015-06-04","2015-06-15","2015-06-01",5]
[null,15031042,"MARCHANDISES",9627.5,1925.5,11553,1008922,{"$f":"INDEX(X!$H$2:$J$1000,MATCH($G52,X!$H$2:$H$1000,0),2)","v":"FOURNISSEUR 0019"},{"$f":"INDEX(X!$H$2:$J$1000,MATCH($G52,X!$H$2:$H$1000,0),3)","v":"00181111004000073"},0.2,"EFFET T  04955015","2015-06-30","2015-03-31","2015-06-01",5]
[null,503122,"MARCHANDISES",3583.33,716.67,4300,1009678,{"$f":"INDEX(X!$H$2:$J$1000,MATCH($G53,X!$H$2:$H$1000,0),2)","v":"FOURNISSEUR 0031"},{"$f":"INDEX(X!$H$2:$J$1000,MATCH($G53,X!$H$2:$H$1000,0),3)","v":"00301111004000085"},0.2,"EFFET T   04955026","2015-06-30","2015-03-31","2015-06-01",5]
[null,"15f0629","MARCHANDISES",7095.83,1419.17,8515,1008670,{"$f":"INDEX(X!$H$2:$J$1000,MATCH($G54,X!$H$2:$H$1000,0),2)","v":"FOURNISSEUR 0015"},{"$f":"INDEX(X!$H$2:$J$1000,MATCH($G54,X!$H$2:$H$1000,0),3)","v":"00141111004000069"},0.2,"EFFET T 04955016","2015-06-30","2015-06-30","2015-06-01",5]
[null,"avoir 146","MARCHANDISES",-362.5,-72.5,-435,1009678,{"$f":"INDEX(X!$H$2:$J$1000,MATCH($G55,X!$H$2:$H$1000,0),2)","v":"FOURNISSEUR 0031"},{"$f":"INDEX(X!$H$2:$J$1000,MATCH($G55,X!$H$2:$H$1000,0),3)","v":"00301111004000085"},0.2,"AVOIR","2015-07-31","2015-03-31","2015-06-01",7]
[null,15030776,"MARCHANDISES",29160.83,5832.17,34993,1008922,{"$f":"INDEX(X!$H$2:$J$1000,MATCH($G56,X!$H$2:$H$1000,0),2)","v":"FOURNISSEUR 0019"},{"$f":"INDEX(X!$H$2:$J$1000,MATCH($G56,X!$H$2:$H$1000,0),3)","v":"00181111004000073"},0.2,"EFFET T  05202204","2015-07-02","2015-03-31","2015-07-01",5]
[null,15030777,"MARCHANDISES",10920,2184,13104,1008922,{"$f":"INDEX(X!$H$2:$J$1000,MATCH($G57,X!$H$2:$H$1000,0),2)","v":"FOURNISSEUR 0019"},{"$f":"INDEX(X!$H$2:$J$1000,MATCH($G57,X!$H$2:$H$1000,0),3)","v":"00181111004000073"},0.2,"EFFET T  05202204","2015-07-02","2015-03-31","2015-07-01",5]
[null,15030778,"MARCHANDISES",2604.17,520.83000000000004,3125,1008922,{"$f":"INDEX(X!$H$2:$J$1000,MATCH($G58,X!$H$2:$H$1000,0),2)","v":"FOURNISSEUR 0019"},{"$f":"INDEX(X!$H$2:$J$1000,MATCH($G58,X!$H$2:$H$1000,0),3)","v":"00181111004000073"},0.2,"EFFET T  05202204","2015-07-02","2015-03-31","2015-07-01",5]
[null,"15/7/0067","MARCHANDISES",3437.35,687.47,4124.82,1009741,{"$f":"INDEX(X!$H$2:$J$1000,MATCH($G59,X!$H$2:$H$1000,0),2)","v":"FOURNISSEUR 0032"},{"$f":"INDEX(X!$H$2:$J$1000,MATCH($G59,X!$H$2:$H$1000,0),3)","v":"00311111004000086"},0.2,"EFFET T  05202209","2015-07-10","2015-07-10","2015-07-01",5]
[null,"fa2399","MARCHANDISES",7958.33,1591.67,9550,1009237,{"$f":"INDEX(X!$H$2:$J$1000,MATCH($G60,X!$H$2:$H$1000,0),2)","v":"FOURNISSEUR 0024"},{"$f":"INDEX(X!$H$2:$J$1000,MATCH($G60,X!$H$2:$H$1000,0),3)","v":"00231111004000078"},0.2,"EFFET T  04955015","2015-06-30","2015-07-01","2015-08-01",5]
[null,50365,"MARCHANDISES",10493.43,2098.6849999999999,12592.11,1008733,{"$f":"INDEX(X!$H$2:$J$1000,MATCH($G61,X!$H$2:$H$1000,0),2)","v":"FOURNISSEUR 0016"},{"$f":"INDEX(X!$H$2:$J$1000,MATCH($G61,X!$H$2:$H$1000,0),3)","v":"00151111004000070"},0.2,"EFFET 04955027","2015-07-15","2015-03-31","2015-08-01",5]
[null,5042,"MARCHANDISES",1866.66,373.33,2239.9899999999998,1008733,{"$f":"INDEX(X!$H$2:$J$1000,MATCH($G62,X!$H$2:$H$1000,0),2)","v":"FOURNISSEUR 0016"},{"$f":"INDEX(X!$H$2:$J$1000,MATCH($G62,X!$H$2:$H$1000,0),3)","v":"00151111004000070"},0.2,"EFFET 04955027","2015-07-15","2015-04-18","2015-08-01",5]
[null,"fa2403","MARCHANDISES",10000,2000,12000,1009237,{"$f":"INDEX(X!$H$2:$J$1000,MATCH($G63,X!$H$2:$H$1000,0),2)","v":"FOURNISSEUR 0024"},{"$f":"INDEX(X!$H$2:$J$1000,MATCH($G63,X!$H$2:$H$1000,0),3)","v":"00231111004000078"},0.2,"EFFET T  04955019","2015-07-15","2015-07-07","2015-08-01",5]
[null,15041461,"MARCHANDISES",10008.83,2001.77,12010.6,1008922,{"$f":"INDEX(X!$H$2:$J$1000,MATCH($G64,X!$H$2:$H$1000,0),2)","v":"FOURNISSEUR 0019"},{"$f":"INDEX(X!$H$2:$J$1000,MATCH($G64,X!$H$2:$H$1000,0),3)","v":"00181111004000073"},0.2,"EFFET  04955031","2015-07-31","2015-04-30","2015-08-01",5]
[null,15041411,"MARCHANDISES",11700.83,2340.17,14041,1008922,{"$f":"INDEX(X!$H$2:$J$1000,MATCH($G65,X!$H$2:$H$1000,0),2)","v":"FOURNISSEUR 0019"},{"$f":"INDEX(X!$H$2:$J$1000,MATCH($G65,X!$H$2:$H$1000,0),3)","v":"00181111004000073"},0.2,"EFFET  05202205","2015-07-31","2015-04-30","2015-08-01",5]
[null,15041412,"MARCHANDISES",10430.83,2086.17,12517,1008922,{"$f":"INDEX(X!$H$2:$J$1000,MATCH($G66,X!$H$2:$H$1000,0),2)","v":"FOURNISSEUR 0019"},{"$f":"INDEX(X!$H$2:$J$1000,MATCH($G66,X!$H$2:$H$1000,0),3)","v":"00181111004000073"},0.2,"EFFET  05202205","2015-07-31","2015-04-30","2015-08-01",5]
[null,"fa2411","MARCHANDISES",9416.67,1883.33,11300,1009237,{"$f":"INDEX(X!$H$2:$J$1000,MATCH($G67,X!$H$2:$H$1000,0),2)","v":"FOURNISSEUR 0024"},{"$f":"INDEX(X!$H$2:$J$1000,MATCH($G67,X!$H$2:$H$1000,0),3)","v":"00231111004000078"},0.2,"EFFET T  04955020","2015-08-15","2015-08-04","2015-08-01",5]
[null,15080097,"MARCHANDISES",2727.22,545.44000000000005,3272.66,1009741,{"$f":"INDEX(X!$H$2:$J$1000,MATCH($G68,X!$H$2:$H$1000,0),2)","v":"FOURNISSEUR 0032"},{"$f":"INDEX(X!$H$2:$J$1000,MATCH($G68,X!$H$2:$H$1000,0),3)","v":"00311111004000086"},0.2,"EFFET T  5202216","2015-08-01","2015-08-20","2015-09-01",5]
[null,1508898,"MARCHANDISES",259,51.8,310.8,1009741,{"$f":"INDEX(X!$H$2:$J$1000,MATCH($G69,X!$H$2:$H$1000,0),2)","v":"FOURNISSEUR 0032"},{"$f":"INDEX(X!$H$2:$J$1000,MATCH($G69,X!$H$2:$H$1000,0),3)","v":"00311111004000086"},0.2,"ESPECES","2015-08-20","2015-08-20","2015-09-01",{"$f":"IF(COUNTIF(K69,\"*EF*\"),5,IF(COUNTIF(K69,\"*ES*\"),1,IF(COUNTIF(K69,\"*CH*\"),2,IF(COUNTIF(K69,\"*PR*\"),3,IF(COUNTIF(K69,\"*CO*\"),6,IF(COUNTIF(K69,\"*VI*\"),4,7))))))","v":1}]
[null,505127,"MARCHANDISES",8655.83,1731.17,10387,1009678,{"$f":"INDEX(X!$H$2:$J$1000,MATCH($G70,X!$H$2:$H$1000,0),2)","v":"FOURNISSEUR 0031"},{"$f":"INDEX(X!$H$2:$J$1000,MATCH($G70,X!$H$2:$H$1000,0),3)","v":"00301111004000085"},0.2,"EFFET T  4955047","2015-08-31","2015-05-30","2015-09-01",5]
[null,"AVOIR128","MARCHANDISES",-337.58,-67.52,-405.1,1009678,{"$f":"INDEX(X!$H$2:$J$1000,MATCH($G71,X!$H$2:$H$1000,0),2)","v":"FOURNISSEUR 0031"},{"$f":"INDEX(X!$H$2:$J$1000,MATCH($G71,X!$H$2:$H$1000,0),3)","v":"00301111004000085"},0.2,"EFFET T  4955047","2015-08-31","2015-05-30","2015-09-01",5]
[null,50548,"MARCHANDISES",11720.83,2344.17,14065,1008733,{"$f":"INDEX(X!$H$2:$J$1000,MATCH($G72,X!$H$2:$H$1000,0),2)","v":"FOURNISSEUR 0016"},{"$f":"INDEX(X!$H$2:$J$1000,MATCH($G72,X!$H$2:$H$1000,0),3)","v":"00151111004000070"},0.2,"EFFET T 4955048","2015-08-31","2015-05-30","2015-09-01",5]
[null,2426,"MARCHANDISES",16666.669999999998,3333.33,20000,1009237,{"$f":"INDEX(X!$H$2:$J$1000,MATCH($G73,X!$H$2:$H$1000,0),2)","v":"FOURNISSEUR 0024"},{"$f":"INDEX(X!$H$2:$J$1000,MATCH($G73,X!$H$2:$H$1000,0),3)","v":"00231111004000078"},0.2,"EFFET T  4955035","2015-08-31","2015-09-01","2015-09-01",5]
[null,"317 15","MARCHANDISES",1625,325,1950,1008355,{"$f":"INDEX(X!$H$2:$J$1000,MATCH($G74,X!$H$2:$H$1000,0),2)","v":"FOURNISSEUR 0010"},{"$f":"INDEX(X!$H$2:$J$1000,MATCH($G74,X!$H$2:$H$1000,0),3)","v":"00091111004000064"},0.2,"EFFET T  5202212","2015-08-31","2015-09-10","2015-09-01",5]
[null,"318 15","MARCHANDISES",3325,665,3990,1008355,{"$f":"INDEX(X!$H$2:$J$1000,MATCH($G75,X!$H$2:$H$1000,0),2)","v":"FOURNISSEUR 0010"},{"$f":"INDEX(X!$H$2:$J$1000,MATCH($G75,X!$H$2:$H$1000,0),3)","v":"00091111004000064"},0.2,"EFFET T  4955045","2015-08-31","2015-09-10","2015-09-01",5]
[null,"AV15000103","MARCHANDISES",-383.33,-76.67,-460,1008922,{"$f":"INDEX(X!$H$2:$J$1000,MATCH($G76,X!$H$2:$H$1000,0),2)","v":"FOURNISSEUR 0019"},{"$f":"INDEX(X!$H$2:$J$1000,MATCH($G76,X!$H$2:$H$1000,0),3)","v":"00181111004000073"},0.2,"EFFET T  5202230","2015-09-20","2015-05-30","2015-09-01",5]
[null,15051667,"MARCHANDISES",21273.33,4254.67,25528,1008922,{"$f":"INDEX(X!$H$2:$J$1000,MATCH($G77,X!$H$2:$H$1000,0),2)","v":"FOURNISSEUR 0019"},{"$f":"INDEX(X!$H$2:$J$1000,MATCH($G77,X!$H$2:$H$1000,0),3)","v":"00181111004000073"},0.2,"EFFET T  5202230","2015-09-20","2015-05-31","2015-09-01",5]
[null,15051668,"MARCHANDISES",10476.67,2095.33,12572,1008922,{"$f":"INDEX(X!$H$2:$J$1000,MATCH($G78,X!$H$2:$H$1000,0),2)","v":"FOURNISSEUR 0019"},{"$f":"INDEX(X!$H$2:$J$1000,MATCH($G78,X!$H$2:$H$1000,0),3)","v":"00181111004000073"},0.2,"EFFET T  5202230","2015-09-20","2015-05-31","2015-09-01",5]
[null,"15F0621","MARCHANDISES",2128.33,425.67,2554,1009552,{"$f":"INDEX(X!$H$2:$J$1000,MATCH($G79,X!$H$2:$H$1000,0),2)","v":"FOURNISSEUR 0029"},{"$f":"INDEX(X!$H$2:$J$1000,MATCH($G79,X!$H$2:$H$1000,0),3)","v":"00281111004000083"},0.2,"EFF 4955033","2015-07-30","2015-06-29","2015-10-01",5]
[null,507121,"MARCHANDISES",8125,1625,9750,1009678,{"$f":"INDEX(X!$H$2:$J$1000,MATCH($G80,X!$H$2:$H$1000,0),2)","v":"FOURNISSEUR 0031"},{"$f":"INDEX(X!$H$2:$J$1000,MATCH($G80,X!$H$2:$H$1000,0),3)","v":"00301111004000085"},0.2,"EFFET  04955037","2015-08-31","2015-07-31","2015-10-01",5]
[null,"152/15","MARCHANDISES",4300,860,5160,1008670,{"$f":"INDEX(X!$H$2:$J$1000,MATCH($G81,X!$H$2:$H$1000,0),2)","v":"FOURNISSEUR 0015"},{"$f":"INDEX(X!$H$2:$J$1000,MATCH($G81,X!$H$2:$H$1000,0),3)","v":"00141111004000069"},0.2,"EFFET  4955038","2015-08-31","2015-08-20","2015-10-01",5]
[null,"F1508003452","MARCHANDISES",2010,402,2412,1008607,{"$f":"INDEX(X!$H$2:$J$1000,MATCH($G82,X!$H$2:$H$1000,0),2)","v":"FOURNISSEUR 0014"},{"$f":"INDEX(X!$H$2:$J$1000,MATCH($G82,X!$H$2:$H$1000,0),3)","v":"00131111004000068"},0.2,"CHQ 03755739","2015-09-11","2015-08-10","2015-10-01",2]
[null,15062128,"MARCHANDISES",19958.330000000002,3991.67,23950,1008922,{"$f":"INDEX(X!$H$2:$J$1000,MATCH($G83,X!$H$2:$H$1000,0),2)","v":"FOURNISSEUR 0019"},{"$f":"INDEX(X!$H$2:$J$1000,MATCH($G83,X!$H$2:$H$1000,0),3)","v":"00181111004000073"},0.2,"EFFET  05202232","2015-10-28","2015-06-30","2015-10-01",5]
[null,15072538,"MARCHANDISES",2987.5,597.5,3585,1008922,{"$f":"INDEX(X!$H$2:$J$1000,MATCH($G84,X!$H$2:$H$1000,0),2)","v":"FOURNISSEUR 0019"},{"$f":"INDEX(X!$H$2:$J$1000,MATCH($G84,X!$H$2:$H$1000,0),3)","v":"00181111004000073"},0.2,"EFFET  05202232","2015-10-28","2015-07-31","2015-10-01",5]
[null,"1506-2441","MARCHANDISES",2666.67,533.33000000000004,3200,1008418,{"$f":"INDEX(X!$H$2:$J$1000,MATCH($G85,X!$H$2:$H$1000,0),2)","v":"FOURNISSEUR 0011"},{"$f":"INDEX(X!$H$2:$J$1000,MATCH($G85,X!$H$2:$H$1000,0),3)","v":"00101111004000065"},0.2,"EFFET T  4955041","2015-06-26","2015-06-25","2015-11-01",5]
[null,15062415,"MARCHANDISES",16458.330000000002,3291.67,19750,1008922,{"$f":"INDEX(X!$H$2:$J$1000,MATCH($G86,X!$H$2:$H$1000,0),2)","v":"FOURNISSEUR 0019"},{"$f":"INDEX(X!$H$2:$J$1000,MATCH($G86,X!$H$2:$H$1000,0),3)","v":"00181111004000073"},0.2,"EFFET T  5202202","2015-09-30","2015-06-30","2015-11-01",5]
[null,"165/15","MARCHANDISES",3883.33,776.67,4660,1008670,{"$f":"INDEX(X!$H$2:$J$1000,MATCH($G87,X!$H$2:$H$1000,0),2)","v":"FOURNISSEUR 0015"},{"$f":"INDEX(X!$H$2:$J$1000,MATCH($G87,X!$H$2:$H$1000,0),3)","v":"00141111004000069"},0.2,"EFFET T  4955049","2015-09-30","2015-09-28","2015-11-01",5]
[null,"1509-4878","MARCHANDISES",1500,300,1800,1009174,{"$f":"INDEX(X!$H$2:$J$1000,MATCH($G88,X!$H$2:$H$1000,0),2)","v":"FOURNISSEUR 0023"},{"$f":"INDEX(X!$H$2:$J$1000,MATCH($G88,X!$H$2:$H$1000,0),3)","v":"00221111004000077"},0.2,"EFFET T  5202215","2015-09-30","2015-09-29","2015-11-01",5]
[null,"15F0934","MARCHANDISES",3723.5,744.7,4468.2,1009552,{"$f":"INDEX(X!$H$2:$J$1000,MATCH($G89,X!$H$2:$H$1000,0),2)","v":"FOURNISSEUR 0029"},{"$f":"INDEX(X!$H$2:$J$1000,MATCH($G89,X!$H$2:$H$1000,0),3)","v":"00281111004000083"},0.2,"EFFET T  5202208","2015-10-11","2015-09-30","2015-11-01",5]
[null,"171/15","MARCHANDISES",4375,875,5250,1008670,{"$f":"INDEX(X!$H$2:$J$1000,MATCH($G90,X!$H$2:$H$1000,0),2)","v":"FOURNISSEUR 0015"},{"$f":"INDEX(X!$H$2:$J$1000,MATCH($G90,X!$H$2:$H$1000,0),3)","v":"00141111004000069"},0.2,"EFFET T  5202211","2015-10-15","2015-10-23","2015-11-01",5]
[null,"1511-3914","MARCHANDISES",4354.17,870.83,5225,1008418,{"$f":"INDEX(X!$H$2:$J$1000,MATCH($G91,X!$H$2:$H$1000,0),2)","v":"FOURNISSEUR 0011"},{"$f":"INDEX(X!$H$2:$J$1000,MATCH($G91,X!$H$2:$H$1000,0),3)","v":"00101111004000065"},0.2,"EFFET T  5202220","2015-11-20","2015-11-27","2015-11-01",5]
[null,"76-2015","MARCHANDISES",135,27,162,1009426,{"$f":"INDEX(X!$H$2:$J$1000,MATCH($G92,X!$H$2:$H$1000,0),2)","v":"FOURNISSEUR 0027"},{"$f":"INDEX(X!$H$2:$J$1000,MATCH($G92,X!$H$2:$H$1000,0),3)","v":"00261111004000081"},0.2,"CHQ 3755735","2015-06-30","2015-02-28","2015-12-01",2]
[null,"132/2015","MARCHANDISES",100,20,120,1009426,{"$f":"INDEX(X!$H$2:$J$1000,MATCH($G93,X!$H$2:$H$1000,0),2)","v":"FOURNISSEUR 0027"},{"$f":"INDEX(X!$H$2:$J$1000,MATCH($G93,X!$H$2:$H$1000,0),3)","v":"00261111004000081"},0.2,"CHQ 3755735","2015-06-30","2015-03-31","2015-12-01",2]
[null,"222-2015","MARCHANDISES",1730.83,346.17,2077,1009426,{"$f":"INDEX(X!$H$2:$J$1000,MATCH($G94,X!$H$2:$H$1000,0),2)","v":"FOURNISSEUR 0027"},{"$f":"INDEX(X!$H$2:$J$1000,MATCH($G94,X!$H$2:$H$1000,0),3)","v":"00261111004000081"},0.2,"CHQ 3755735","2015-06-30","2015-04-30","2015-12-01",2]
[null,506128,"MARCHANDISES",6879.17,1375.83,8255,1009678,{"$f":"INDEX(X!$H$2:$J$1000,MATCH($G95,X!$H$2:$H$1000,0),2)","v":"FOURNISSEUR 0031"},{"$f":"INDEX(X!$H$2:$J$1000,MATCH($G95,X!$H$2:$H$1000,0),3)","v":"00301111004000085"},0.2,"EFFET  5202214","2015-11-01","2015-06-30","2015-12-01",5]
[null,"AVOIR 130","MARCHANDISES",-100,-20,-120,1009678,{"$f":"INDEX(X!$H$2:$J$1000,MATCH($G96,X!$H$2:$H$1000,0),2)","v":"FOURNISSEUR 0031"},{"$f":"INDEX(X!$H$2:$J$1000,MATCH($G96,X!$H$2:$H$1000,0),3)","v":"00301111004000085"},0.2,"EFFET  5202214","2015-11-01","2015-06-30","2015-12-01",5]
[null,50792,"MARCHANDISES",3108.33,621.66999999999996,3730,1009678,{"$f":"INDEX(X!$H$2:$J$1000,MATCH($G97,X!$H$2:$H$1000,0),2)","v":"FOURNISSEUR 0031"},{"$f":"INDEX(X!$H$2:$J$1000,MATCH($G97,X!$H$2:$H$1000,0),3)","v":"00301111004000085"},0.2,"EFFET  5202214","2015-11-01","2015-07-31","2015-12-01",5]
[null,"AVOIR 111","MARCHANDISES",-135.41999999999999,-27.08,-162.5,1009678,{"$f":"INDEX(X!$H$2:$J$1000,MATCH($G98,X!$H$2:$H$1000,0),2)","v":"FOURNISSEUR 0031"},{"$f":"INDEX(X!$H$2:$J$1000,MATCH($G98,X!$H$2:$H$1000,0),3)","v":"00301111004000085"},0.2,"EFFET  5202214","2015-11-01","2015-07-31","2015-12-01",5]
[null,"FA2452","MARCHANDISES",10000,2000,12000,1009237,{"$f":"INDEX(X!$H$2:$J$1000,MATCH($G99,X!$H$2:$H$1000,0),2)","v":"FOURNISSEUR 0024"},{"$f":"INDEX(X!$H$2:$J$1000,MATCH($G99,X!$H$2:$H$1000,0),3)","v":"00231111004000078"},0.2,"EFFET  5202210","2015-11-01","2015-11-03","2015-12-01",5]
[null,"F7420112015","MARCHANDISES",2500,500,3000,1007851,{"$f":"INDEX(X!$H$2:$J$1000,MATCH($G100,X!$H$2:$H$1000,0),2)","v":"FOURNISSEUR 0002"},{"$f":"INDEX(X!$H$2:$J$1000,MATCH($G100,X!$H$2:$H$1000,0),3)","v":"00011111004000056"},0.2,"CHQ  4386131","2015-11-13","2015-11-20","2015-12-01",2]
[null,"FA-15082840","MARCHANDISES",14323.75,2864.75,17188.5,1008922,{"$f":"INDEX(X!$H$2:$J$1000,MATCH($G101,X!$H$2:$H$1000,0),2)","v":"FOURNISSEUR 0019"},{"$f":"INDEX(X!$H$2:$J$1000,MATCH($G101,X!$H$2:$H$1000,0),3)","v":"00181111004000073"},0.2,"EFFET  5202245","2015-11-30","2015-08-31","2015-12-01",5]
[null,"FA-15083113","MARCHANDISES",22910.77,4582.1499999999996,27492.92,1008922,{"$f":"INDEX(X!$H$2:$J$1000,MATCH($G102,X!$H$2:$H$1000,0),2)","v":"FOURNISSEUR 0019"},{"$f":"INDEX(X!$H$2:$J$1000,MATCH($G102,X!$H$2:$H$1000,0),3)","v":"00181111004000073"},0.2,"EFFET  5202229","2015-12-15","2015-08-31","2015-12-01",5]
[null,"FA-15093247","MARCHANDISES",14388.33,2877.67,17266,1008922,{"$f":"INDEX(X!$H$2:$J$1000,MATCH($G103,X!$H$2:$H$1000,0),2)","v":"FOURNISSEUR 0019"},{"$f":"INDEX(X!$H$2:$J$1000,MATCH($G103,X!$H$2:$H$1000,0),3)","v":"00181111004000073"},0.2,"EFFET  5202246","2015-12-28","2015-09-30","2015-12-01",5]
[null,"508 81","MARCHANDISES",2183.33,436.67,2620,1009678,{"$f":"INDEX(X!$H$2:$J$1000,MATCH($G104,X!$H$2:$H$1000,0),2)","v":"FOURNISSEUR 0031"},{"$f":"INDEX(X!$H$2:$J$1000,MATCH($G104,X!$H$2:$H$1000,0),3)","v":"00301111004000085"},0.2,"EFFET  5202240","2015-12-30","2015-08-31","2015-12-01",5]
[null,"FA 1514536","MARCHANDISES",16666.669999999998,3333.33,20000,1009048,{"$f":"INDEX(X!$H$2:$J$1000,MATCH($G105,X!$H$2:$H$1000,0),2)","v":"FOURNISSEUR 0021"},{"$f":"INDEX(X!$H$2:$J$1000,MATCH($G105,X!$H$2:$H$1000,0),3)","v":"00201111004000075"},0.2,"EFFET  5202228","2015-12-31","2015-08-31","2015-12-01",5]
[null,"FA2478","MARCHANDISES",16666.669999999998,3333.33,20000,1009237,{"$f":"INDEX(X!$H$2:$J$1000,MATCH($G106,X!$H$2:$H$1000,0),2)","v":"FOURNISSEUR 0024"},{"$f":"INDEX(X!$H$2:$J$1000,MATCH($G106,X!$H$2:$H$1000,0),3)","v":"00231111004000078"},0.2,"EFFET T 5202227","2016-01-04","2016-01-04","2016-01-01",5]
[null,"FA2440","MARCHANDISES",18583.330000000002,3716.67,22300,1009237,{"$f":"INDEX(X!$H$2:$J$1000,MATCH($G107,X!$H$2:$H$1000,0),2)","v":"FOURNISSEUR 0024"},{"$f":"INDEX(X!$H$2:$J$1000,MATCH($G107,X!$H$2:$H$1000,0),3)","v":"00231111004000078"},0.2,"EFFET  4955046","2016-01-07","2015-10-09","2016-01-01",5]
[null,"FA15/606","MARCHANDISES",333.33,66.67,400,1009615,{"$f":"INDEX(X!$H$2:$J$1000,MATCH($G108,X!$H$2:$H$1000,0),2)","v":"FOURNISSEUR 0030"},{"$f":"INDEX(X!$H$2:$J$1000,MATCH($G108,X!$H$2:$H$1000,0),3)","v":"00291111004000084"},0.2,"CHQ  4386138","2016-01-07","2015-12-15","2016-01-01",2]
[null,"FA/15/12/138","MARCHANDISES",1052,210.4,1262.4000000000001,1009741,{"$f":"INDEX(X!$H$2:$J$1000,MATCH($G109,X!$H$2:$H$1000,0),2)","v":"FOURNISSEUR 0032"},{"$f":"INDEX(X!$H$2:$J$1000,MATCH($G109,X!$H$2:$H$1000,0),3)","v":"00311111004000086"},0.2,"EFFET T  5438864","2016-01-07","2015-12-30","2016-01-01",5]
[null,1186,"MARCHANDISES",3000,600,3600,1009804,{"$f":"INDEX(X!$H$2:$J$1000,MATCH($G110,X!$H$2:$H$1000,0),2)","v":"FOURNISSEUR 0033"},{"$f":"INDEX(X!$H$2:$J$1000,MATCH($G110,X!$H$2:$H$1000,0),3)","v":"00321111004000087"},0.2,"EFFET  52022215","2016-01-19","2015-12-31","2016-01-01",5]
[null,510104,"MARCHANDISES",9252.5,1850.5,11103,1009678,{"$f":"INDEX(X!$H$2:$J$1000,MATCH($G111,X!$H$2:$H$1000,0),2)","v":"FOURNISSEUR 0031"},{"$f":"INDEX(X!$H$2:$J$1000,MATCH($G111,X!$H$2:$H$1000,0),3)","v":"00301111004000085"},0.2,"EFFET T  5483858","2016-02-01","2015-10-31","2016-02-01",5]
[null,5102,"MARCHANDISES",19011.669999999998,3802.33,22814,1008733,{"$f":"INDEX(X!$H$2:$J$1000,MATCH($G112,X!$H$2:$H$1000,0),2)","v":"FOURNISSEUR 0016"},{"$f":"INDEX(X!$H$2:$J$1000,MATCH($G112,X!$H$2:$H$1000,0),3)","v":"00151111004000070"},0.2,"EFFET T  5202241","2016-02-01","2015-10-31","2016-02-01",5]
[null,1514581,"MARCHANDISES",8333.33,1666.67,10000,1009048,{"$f":"INDEX(X!$H$2:$J$1000,MATCH($G113,X!$H$2:$H$1000,0),2)","v":"FOURNISSEUR 0021"},{"$f":"INDEX(X!$H$2:$J$1000,MATCH($G113,X!$H$2:$H$1000,0),3)","v":"00201111004000075"},0.2,"EFFET T  5202236","2016-02-01","2015-10-31","2016-02-01",5]
[null,150000165,"MARCHANDISES",2408.5,481.7,2890.2,1009426,{"$f":"INDEX(X!$H$2:$J$1000,MATCH($G114,X!$H$2:$H$1000,0),2)","v":"FOURNISSEUR 0027"},{"$f":"INDEX(X!$H$2:$J$1000,MATCH($G114,X!$H$2:$H$1000,0),3)","v":"00261111004000081"},0.2,"EFFET T 5483857","2016-02-15","2015-10-31","2016-02-01",5]
[null,150000182,"MARCHANDISES",194,38.799999999999997,232.8,1009426,{"$f":"INDEX(X!$H$2:$J$1000,MATCH($G115,X!$H$2:$H$1000,0),2)","v":"FOURNISSEUR 0027"},{"$f":"INDEX(X!$H$2:$J$1000,MATCH($G115,X!$H$2:$H$1000,0),3)","v":"00261111004000081"},0.2,"EFFET T 5483857","2016-02-15","2015-11-30","2016-02-01",5]
[null,15103629,"MARCHANDISES",12841.33,2568.27,15409.6,1008922,{"$f":"INDEX(X!$H$2:$J$1000,MATCH($G116,X!$H$2:$H$1000,0),2)","v":"FOURNISSEUR 0019"},{"$f":"INDEX(X!$H$2:$J$1000,MATCH($G116,X!$H$2:$H$1000,0),3)","v":"00181111004000073"},0.2,"EFFET T  5483869","2016-02-23","2015-10-31","2016-02-01",5]
[null,13145,"MARCHANDISES",450,90,540,1007977,{"$f":"INDEX(X!$H$2:$J$1000,MATCH($G117,X!$H$2:$H$1000,0),2)","v":"FOURNISSEUR 0004"},{"$f":"INDEX(X!$H$2:$J$1000,MATCH($G117,X!$H$2:$H$1000,0),3)","v":"00031111004000058"},0.2,"CHQ 5721","2016-02-26","2015-01-14","2016-02-01",2]
[null,"115/2015","MARCHANDISES",1666.67,333.33,2000,1008166,{"$f":"INDEX(X!$H$2:$J$1000,MATCH($G118,X!$H$2:$H$1000,0),2)","v":"FOURNISSEUR 0007"},{"$f":"INDEX(X!$H$2:$J$1000,MATCH($G118,X!$H$2:$H$1000,0),3)","v":"00061111004000061"},0.2,"EFFET T  5202201","2016-02-26","2015-08-12","2016-02-01",5]
[null,"187/15","MARCHANDISES",3100,620,3720,1008670,{"$f":"INDEX(X!$H$2:$J$1000,MATCH($G119,X!$H$2:$H$1000,0),2)","v":"FOURNISSEUR 0015"},{"$f":"INDEX(X!$H$2:$J$1000,MATCH($G119,X!$H$2:$H$1000,0),3)","v":"00141111004000069"},0.2,"EFFET T  5202217","2016-02-26","2015-11-10","2016-02-01",5]
[null,"188/2015","MARCHANDISES",2166.67,433.33,2600,1008166,{"$f":"INDEX(X!$H$2:$J$1000,MATCH($G120,X!$H$2:$H$1000,0),2)","v":"FOURNISSEUR 0007"},{"$f":"INDEX(X!$H$2:$J$1000,MATCH($G120,X!$H$2:$H$1000,0),3)","v":"00061111004000061"},0.2,"EFFET T  5202237","2016-02-26","2015-12-10","2016-02-01",5]
[null,"023/12/HB2015","MARCHANDISES",1980,396,2376,1009363,{"$f":"INDEX(X!$H$2:$J$1000,MATCH($G121,X!$H$2:$H$1000,0),2)","v":"FOURNISSEUR 0026"},{"$f":"INDEX(X!$H$2:$J$1000,MATCH($G121,X!$H$2:$H$1000,0),3)","v":"00251111004000080"},0.2,"CHQ 6141","2016-02-26","2015-12-21","2016-02-01",2]
[null,1602000388,"MARCHANDISES",1425,285,1710,1008607,{"$f":"INDEX(X!$H$2:$J$1000,MATCH($G122,X!$H$2:$H$1000,0),2)","v":"FOURNISSEUR 0014"},{"$f":"INDEX(X!$H$2:$J$1000,MATCH($G122,X!$H$2:$H$1000,0),3)","v":"00131111004000068"},0.2,"CHQ  4386149","2016-02-26","2016-02-03","2016-02-01",2]
[null,51149,"MARCHANDISES",1312.5,262.5,1575,1008733,{"$f":"INDEX(X!$H$2:$J$1000,MATCH($G123,X!$H$2:$H$1000,0),2)","v":"FOURNISSEUR 0016"},{"$f":"INDEX(X!$H$2:$J$1000,MATCH($G123,X!$H$2:$H$1000,0),3)","v":"00151111004000070"},0.2,"EFFET T  5483859","2016-02-29","2015-11-30","2016-02-01",5]
[null,15114003,"MARCHANDISES",9417.5,1883.5,11301,1008922,{"$f":"INDEX(X!$H$2:$J$1000,MATCH($G124,X!$H$2:$H$1000,0),2)","v":"FOURNISSEUR 0019"},{"$f":"INDEX(X!$H$2:$J$1000,MATCH($G124,X!$H$2:$H$1000,0),3)","v":"00181111004000073"},0.2,"EFFET T  5483870","2016-02-29","2015-11-30","2016-02-01",5]
[null,15114267,"MARCHANDISES",12924.17,2584.83,15509,1008922,{"$f":"INDEX(X!$H$2:$J$1000,MATCH($G125,X!$H$2:$H$1000,0),2)","v":"FOURNISSEUR 0019"},{"$f":"INDEX(X!$H$2:$J$1000,MATCH($G125,X!$H$2:$H$1000,0),3)","v":"00181111004000073"},0.2,"EFFET T  5202244","2016-02-29","2015-11-30","2016-02-01",5]
[null,"0021/16","MARCHANDISES",2737.5,547.5,3285,1008670,{"$f":"INDEX(X!$H$2:$J$1000,MATCH($G126,X!$H$2:$H$1000,0),2)","v":"FOURNISSEUR 0015"},{"$f":"INDEX(X!$H$2:$J$1000,MATCH($G126,X!$H$2:$H$1000,0),3)","v":"00141111004000069"},0.2,"EFFET T 05202239","2016-01-18","2016-01-05","2016-03-01",5]
[null,"FA2490","MARCHANDISES",6583.33,1316.67,7900,1009237,{"$f":"INDEX(X!$H$2:$J$1000,MATCH($G127,X!$H$2:$H$1000,0),2)","v":"FOURNISSEUR 0024"},{"$f":"INDEX(X!$H$2:$J$1000,MATCH($G127,X!$H$2:$H$1000,0),3)","v":"00231111004000078"},0.2,"EFFET T  2235","2016-02-01","2016-02-01","2016-03-01",5]
[null,"0022/16","MARCHANDISES",4916.67,983.33,5900,1008670,{"$f":"INDEX(X!$H$2:$J$1000,MATCH($G128,X!$H$2:$H$1000,0),2)","v":"FOURNISSEUR 0015"},{"$f":"INDEX(X!$H$2:$J$1000,MATCH($G128,X!$H$2:$H$1000,0),3)","v":"00141111004000069"},0.2,"EFFET T 05202248","2016-02-29","2016-02-15","2016-03-01",5]
[null,"FA2504","MARCHANDISES",12833.33,2566.67,15400,1009237,{"$f":"INDEX(X!$H$2:$J$1000,MATCH($G129,X!$H$2:$H$1000,0),2)","v":"FOURNISSEUR 0024"},{"$f":"INDEX(X!$H$2:$J$1000,MATCH($G129,X!$H$2:$H$1000,0),3)","v":"00231111004000078"},0.2,"EFFET T 5202243","2016-02-29","2016-03-07","2016-03-01",5]
[null,"FA/15/12/0185","MARCHANDISES",437,87.4,524.4,1009741,{"$f":"INDEX(X!$H$2:$J$1000,MATCH($G130,X!$H$2:$H$1000,0),2)","v":"FOURNISSEUR 0032"},{"$f":"INDEX(X!$H$2:$J$1000,MATCH($G130,X!$H$2:$H$1000,0),3)","v":"00311111004000086"},0.2,"EFFET T 05483881","2016-03-09","2015-12-30","2016-03-01",5]
[null,"FA/15/12/0184","MARCHANDISES",3463.1,692.62,4155.72,1009741,{"$f":"INDEX(X!$H$2:$J$1000,MATCH($G131,X!$H$2:$H$1000,0),2)","v":"FOURNISSEUR 0032"},{"$f":"INDEX(X!$H$2:$J$1000,MATCH($G131,X!$H$2:$H$1000,0),3)","v":"00311111004000086"},0.2,"EFFET T 05483881","2016-03-09","2015-12-30","2016-03-01",5]
[null,"1603-0662","MARCHANDISES",3916.67,783.33,4700,1009174,{"$f":"INDEX(X!$H$2:$J$1000,MATCH($G132,X!$H$2:$H$1000,0),2)","v":"FOURNISSEUR 0023"},{"$f":"INDEX(X!$H$2:$J$1000,MATCH($G132,X!$H$2:$H$1000,0),3)","v":"00221111004000077"},0.2,"EFFET T 5202250","2016-03-15","2016-03-11","2016-03-01",5]
[null,"1603-0885","MARCHANDISES",2833.33,566.66999999999996,3400,1008418,{"$f":"INDEX(X!$H$2:$J$1000,MATCH($G133,X!$H$2:$H$1000,0),2)","v":"FOURNISSEUR 0011"},{"$f":"INDEX(X!$H$2:$J$1000,MATCH($G133,X!$H$2:$H$1000,0),3)","v":"00101111004000065"},0.2,"EFFET T 5202249","2016-03-15","2016-03-15","2016-03-01",{"$f":"IF(COUNTIF(K133,\"*EF*\"),5,IF(COUNTIF(K133,\"*ES*\"),1,IF(COUNTIF(K133,\"*CH*\"),2,IF(COUNTIF(K133,\"*PR*\"),3,IF(COUNTIF(K133,\"*CO*\"),6,IF(COUNTIF(K133,\"*VI*\"),4,7))))))","v":5}]
[null,150000216,"MARCHANDISES",800,160,960,1009426,{"$f":"INDEX(X!$H$2:$J$1000,MATCH($G134,X!$H$2:$H$1000,0),2)","v":"FOURNISSEUR 0027"},{"$f":"INDEX(X!$H$2:$J$1000,MATCH($G134,X!$H$2:$H$1000,0),3)","v":"00261111004000081"},0.2,"EFFET T 05483860","2016-03-30","2015-12-28","2016-03-01",5]
[null,"1603-732","MARCHANDISES",2968.33,593.66999999999996,3562,1009174,{"$f":"INDEX(X!$H$2:$J$1000,MATCH($G135,X!$H$2:$H$1000,0),2)","v":"FOURNISSEUR 0023"},{"$f":"INDEX(X!$H$2:$J$1000,MATCH($G135,X!$H$2:$H$1000,0),3)","v":"00221111004000077"},0.2,"EFFET T 5483862","2016-03-31","2016-03-29","2016-03-01",5]
[null,"1603-0753","MARCHANDISES",1333.33,266.67,1600,1009174,{"$f":"INDEX(X!$H$2:$J$1000,MATCH($G136,X!$H$2:$H$1000,0),2)","v":"FOURNISSEUR 0023"},{"$f":"INDEX(X!$H$2:$J$1000,MATCH($G136,X!$H$2:$H$1000,0),3)","v":"00221111004000077"},0.2,"EFFET T 5483875","2016-03-31","2016-03-29","2016-03-01",5]
[null,"FF562978022015","PRES DE SERVICES",169,33.799999999999997,202.8,1009300,{"$f":"INDEX(X!$H$2:$J$1000,MATCH($G137,X!$H$2:$H$1000,0),2)","v":"FOURNISSEUR 0025"},{"$f":"INDEX(X!$H$2:$J$1000,MATCH($G137,X!$H$2:$H$1000,0),3)","v":"00241111004000079"},0.2,"CHQ 326674","2015-01-10","2015-01-01","2016-04-01",2]
[null,"FF562979022015","PRES DE SERVICES",82.5,16.5,99,1009300,{"$f":"INDEX(X!$H$2:$J$1000,MATCH($G138,X!$H$2:$H$1000,0),2)","v":"FOURNISSEUR 0025"},{"$f":"INDEX(X!$H$2:$J$1000,MATCH($G138,X!$H$2:$H$1000,0),3)","v":"00241111004000079"},0.2,"CHQ 326674","2015-01-10","2015-01-01","2016-04-01",2]
[null,"379548032015","PRES DE SERVICES",264,52.8,316.8,1009300,{"$f":"INDEX(X!$H$2:$J$1000,MATCH($G139,X!$H$2:$H$1000,0),2)","v":"FOURNISSEUR 0025"},{"$f":"INDEX(X!$H$2:$J$1000,MATCH($G139,X!$H$2:$H$1000,0),3)","v":"00241111004000079"},0.2,"CHQ 326674","2015-01-10","2015-02-01","2016-04-01",2]
[null,"16F0313","MARCHANDISES",4725,945,5670,1009552,{"$f":"INDEX(X!$H$2:$J$1000,MATCH($G140,X!$H$2:$H$1000,0),2)","v":"FOURNISSEUR 0029"},{"$f":"INDEX(X!$H$2:$J$1000,MATCH($G140,X!$H$2:$H$1000,0),3)","v":"00281111004000083"},0.2,"EFFET T 5483863","2015-03-30","2016-03-17","2016-04-01",5]
[null,"793419032015","PRES DE SERVICES",169,33.799999999999997,202.8,1009300,{"$f":"INDEX(X!$H$2:$J$1000,MATCH($G141,X!$H$2:$H$1000,0),2)","v":"FOURNISSEUR 0025"},{"$f":"INDEX(X!$H$2:$J$1000,MATCH($G141,X!$H$2:$H$1000,0),3)","v":"00241111004000079"},0.2,"CHQ 3755759","2015-04-01","2015-02-01","2016-04-01",2]
[null,"793420032015","PRES DE SERVICES",82.5,16.5,99,1009300,{"$f":"INDEX(X!$H$2:$J$1000,MATCH($G142,X!$H$2:$H$1000,0),2)","v":"FOURNISSEUR 0025"},{"$f":"INDEX(X!$H$2:$J$1000,MATCH($G142,X!$H$2:$H$1000,0),3)","v":"00241111004000079"},0.2,"CHQ 3755759","2015-04-01","2015-02-01","2016-04-01",2]
[null,"379548032015","PRES DE SERVICES",264,52.8,316.8,1009300,{"$f":"INDEX(X!$H$2:$J$1000,MATCH($G143,X!$H$2:$H$1000,0),2)","v":"FOURNISSEUR 0025"},{"$f":"INDEX(X!$H$2:$J$1000,MATCH($G143,X!$H$2:$H$1000,0),3)","v":"00241111004000079"},0.2,"CHQ 3755759","2015-04-01","2015-03-11","2016-04-01",2]
[null,120150506599,"ELECTRICITE",83.58,16.72,100.3,1008040,{"$f":"INDEX(X!$H$2:$J$1000,MATCH($G144,X!$H$2:$H$1000,0),2)","v":"FOURNISSEUR 0005"},{"$f":"INDEX(X!$H$2:$J$1000,MATCH($G144,X!$H$2:$H$1000,0),3)","v":"00041111004000059"},0.14000000000000001,"ESPECES","2015-04-07","2015-03-15","2016-04-01",1]
[null,"425569042015","PRES DE SERVICES",264,52.8,316.8,1009300,{"$f":"INDEX(X!$H$2:$J$1000,MATCH($G145,X!$H$2:$H$1000,0),2)","v":"FOURNISSEUR 0025"},{"$f":"INDEX(X!$H$2:$J$1000,MATCH($G145,X!$H$2:$H$1000,0),3)","v":"00241111004000079"},0.2,"ESPECES","2015-04-30","2015-04-08","2016-04-01",1]
[null,"813820042015","PRES DE SERVICES",169,33.799999999999997,202.8,1009300,{"$f":"INDEX(X!$H$2:$J$1000,MATCH($G146,X!$H$2:$H$1000,0),2)","v":"FOURNISSEUR 0025"},{"$f":"INDEX(X!$H$2:$J$1000,MATCH($G146,X!$H$2:$H$1000,0),3)","v":"00241111004000079"},0.2,"CHQ 3755733","2015-06-02","2015-03-01","2016-04-01",2]
[null,"813821042015","PRES DE SERVICES",82.5,16.5,99,1009300,{"$f":"INDEX(X!$H$2:$J$1000,MATCH($G147,X!$H$2:$H$1000,0),2)","v":"FOURNISSEUR 0025"},{"$f":"INDEX(X!$H$2:$J$1000,MATCH($G147,X!$H$2:$H$1000,0),3)","v":"00241111004000079"},0.2,"CHQ 3755733","2015-06-02","2015-03-01","2016-04-01",2]
[null,"448052052015","PRES DE SERVICES",264,52.8,316.8,1009300,{"$f":"INDEX(X!$H$2:$J$1000,MATCH($G148,X!$H$2:$H$1000,0),2)","v":"FOURNISSEUR 0025"},{"$f":"INDEX(X!$H$2:$J$1000,MATCH($G148,X!$H$2:$H$1000,0),3)","v":"00241111004000079"},0.2,"CHQ 3755733","2015-06-02","2015-05-12","2016-04-01",2]
[null,220150506599,"ELECTRICITE",69.48,10.64,83.37,1008040,{"$f":"INDEX(X!$H$2:$J$1000,MATCH($G149,X!$H$2:$H$1000,0),2)","v":"FOURNISSEUR 0005"},{"$f":"INDEX(X!$H$2:$J$1000,MATCH($G149,X!$H$2:$H$1000,0),3)","v":"00041111004000059"},0.14000000000000001,"ESPECES","2015-06-15","2015-04-14","2016-04-01",1]
[null,"812247052015","PRES DE SERVICES",169,33.799999999999997,202.8,1009300,{"$f":"INDEX(X!$H$2:$J$1000,MATCH($G150,X!$H$2:$H$1000,0),2)","v":"FOURNISSEUR 0025"},{"$f":"INDEX(X!$H$2:$J$1000,MATCH($G150,X!$H$2:$H$1000,0),3)","v":"00241111004000079"},0.2,"CHQ 3755737","2015-07-02","2015-04-01","2016-04-01",2]
[null,"812248052015","PRES DE SERVICES",82.5,16.5,99,1009300,{"$f":"INDEX(X!$H$2:$J$1000,MATCH($G151,X!$H$2:$H$1000,0),2)","v":"FOURNISSEUR 0025"},{"$f":"INDEX(X!$H$2:$J$1000,MATCH($G151,X!$H$2:$H$1000,0),3)","v":"00241111004000079"},0.2,"CHQ 3755737","2015-07-02","2015-04-01","2016-04-01",2]
[null,"321934062015","PRES DE SERVICES",264,52.8,316.8,1009300,{"$f":"INDEX(X!$H$2:$J$1000,MATCH($G152,X!$H$2:$H$1000,0),2)","v":"FOURNISSEUR 0025"},{"$f":"INDEX(X!$H$2:$J$1000,MATCH($G152,X!$H$2:$H$1000,0),3)","v":"00241111004000079"},0.2,"CHQ 3755737","2015-07-02","2015-06-13","2016-04-01",2]
[null,"1962584062015","PRES DE SERVICES",169,33.799999999999997,202.8,1009300,{"$f":"INDEX(X!$H$2:$J$1000,MATCH($G153,X!$H$2:$H$1000,0),2)","v":"FOURNISSEUR 0025"},{"$f":"INDEX(X!$H$2:$J$1000,MATCH($G153,X!$H$2:$H$1000,0),3)","v":"00241111004000079"},0.2,"CHQ 3755738","2015-08-03","2015-05-01","2016-04-01",2]
[null,"1962585062015","PRES DE SERVICES",82.5,16.5,99,1009300,{"$f":"INDEX(X!$H$2:$J$1000,MATCH($G154,X!$H$2:$H$1000,0),2)","v":"FOURNISSEUR 0025"},{"$f":"INDEX(X!$H$2:$J$1000,MATCH($G154,X!$H$2:$H$1000,0),3)","v":"00241111004000079"},0.2,"CHQ 3755738","2015-08-03","2015-05-01","2016-04-01",2]
[null,"941024072015","PRES DE SERVICES",264,52.8,316.8,1009300,{"$f":"INDEX(X!$H$2:$J$1000,MATCH($G155,X!$H$2:$H$1000,0),2)","v":"FOURNISSEUR 0025"},{"$f":"INDEX(X!$H$2:$J$1000,MATCH($G155,X!$H$2:$H$1000,0),3)","v":"00241111004000079"},0.2,"CHQ 3755738","2015-08-03","2015-07-13","2016-04-01",2]
[null,320150506599,"ELECTRICITE",71.83,10.98,86.2,1008040,{"$f":"INDEX(X!$H$2:$J$1000,MATCH($G156,X!$H$2:$H$1000,0),2)","v":"FOURNISSEUR 0005"},{"$f":"INDEX(X!$H$2:$J$1000,MATCH($G156,X!$H$2:$H$1000,0),3)","v":"00041111004000059"},0.14000000000000001,"ESPECES","2015-08-24","2015-05-11","2016-04-01",1]
[null,420150506599,"ELECTRICITE",67.11,10.29,80.53,1008040,{"$f":"INDEX(X!$H$2:$J$1000,MATCH($G157,X!$H$2:$H$1000,0),2)","v":"FOURNISSEUR 0005"},{"$f":"INDEX(X!$H$2:$J$1000,MATCH($G157,X!$H$2:$H$1000,0),3)","v":"00041111004000059"},0.14000000000000001,"ESPECES","2015-08-24","2015-06-10","2016-04-01",1]
[null,520150506599,"ELECTRICITE",73.02,11.16,87.62,1008040,{"$f":"INDEX(X!$H$2:$J$1000,MATCH($G158,X!$H$2:$H$1000,0),2)","v":"FOURNISSEUR 0005"},{"$f":"INDEX(X!$H$2:$J$1000,MATCH($G158,X!$H$2:$H$1000,0),3)","v":"00041111004000059"},0.14000000000000001,"ESPECES","2015-08-24","2015-07-14","2016-04-01",1]
[null,"809693072015","PRES DE SERVICES",169,33.799999999999997,202.8,1009300,{"$f":"INDEX(X!$H$2:$J$1000,MATCH($G159,X!$H$2:$H$1000,0),2)","v":"FOURNISSEUR 0025"},{"$f":"INDEX(X!$H$2:$J$1000,MATCH($G159,X!$H$2:$H$1000,0),3)","v":"00241111004000079"},0.2,"CHQ 3755741","2015-09-08","2015-06-01","2016-04-01",2]
[null,"809694072015","PRES DE SERVICES",82.5,16.5,99,1009300,{"$f":"INDEX(X!$H$2:$J$1000,MATCH($G160,X!$H$2:$H$1000,0),2)","v":"FOURNISSEUR 0025"},{"$f":"INDEX(X!$H$2:$J$1000,MATCH($G160,X!$H$2:$H$1000,0),3)","v":"00241111004000079"},0.2,"CHQ 3755741","2015-09-08","2015-06-01","2016-04-01",2]
[null,"805387082015","PRES DE SERVICES",169,33.799999999999997,202.8,1009300,{"$f":"INDEX(X!$H$2:$J$1000,MATCH($G161,X!$H$2:$H$1000,0),2)","v":"FOURNISSEUR 0025"},{"$f":"INDEX(X!$H$2:$J$1000,MATCH($G161,X!$H$2:$H$1000,0),3)","v":"00241111004000079"},0.2,"CHQ 3755741","2015-09-08","2015-07-01","2016-04-01",2]
[null,"805388082015","PRES DE SERVICES",82.5,16.5,99,1009300,{"$f":"INDEX(X!$H$2:$J$1000,MATCH($G162,X!$H$2:$H$1000,0),2)","v":"FOURNISSEUR 0025"},{"$f":"INDEX(X!$H$2:$J$1000,MATCH($G162,X!$H$2:$H$1000,0),3)","v":"00241111004000079"},0.2,"CHQ 3755741","2015-09-08","2015-07-01","2016-04-01",2]
[null,"417730082015","PRES DE SERVICES",264,52.8,316.8,1009300,{"$f":"INDEX(X!$H$2:$J$1000,MATCH($G163,X!$H$2:$H$1000,0),2)","v":"FOURNISSEUR 0025"},{"$f":"INDEX(X!$H$2:$J$1000,MATCH($G163,X!$H$2:$H$1000,0),3)","v":"00241111004000079"},0.2,"CHQ 3755741","2015-09-08","2015-08-10","2016-04-01",2]
[null,"979561092015","PRES DE SERVICES",390,78,468,1009300,{"$f":"INDEX(X!$H$2:$J$1000,MATCH($G164,X!$H$2:$H$1000,0),2)","v":"FOURNISSEUR 0025"},{"$f":"INDEX(X!$H$2:$J$1000,MATCH($G164,X!$H$2:$H$1000,0),3)","v":"00241111004000079"},0.2,"ESPECES","2015-10-15","2015-09-15","2016-04-01",1]
[null,"530269102015","PRES DE SERVICES",174,34.799999999999997,208.8,1009300,{"$f":"INDEX(X!$H$2:$J$1000,MATCH($G165,X!$H$2:$H$1000,0),2)","v":"FOURNISSEUR 0025"},{"$f":"INDEX(X!$H$2:$J$1000,MATCH($G165,X!$H$2:$H$1000,0),3)","v":"00241111004000079"},0.2,"CARTE","2015-11-04","2015-10-12","2016-04-01",7]
[null,620150506599,"ELECTRICITE",76.56,11.68,91.87,1008040,{"$f":"INDEX(X!$H$2:$J$1000,MATCH($G166,X!$H$2:$H$1000,0),2)","v":"FOURNISSEUR 0005"},{"$f":"INDEX(X!$H$2:$J$1000,MATCH($G166,X!$H$2:$H$1000,0),3)","v":"00041111004000059"},0.14000000000000001,"ESPECES","2015-11-30","2015-08-18","2016-04-01",1]
[null,720150506599,"ELECTRICITE",55.3,8.5500000000000007,66.36,1008040,{"$f":"INDEX(X!$H$2:$J$1000,MATCH($G167,X!$H$2:$H$1000,0),2)","v":"FOURNISSEUR 0005"},{"$f":"INDEX(X!$H$2:$J$1000,MATCH($G167,X!$H$2:$H$1000,0),3)","v":"00041111004000059"},0.14000000000000001,"ESPECES","2015-11-30","2015-09-14","2016-04-01",1]
[null,"820150506599","ELECTRICITE",94.28,14.28,113.14,1008040,{"$f":"INDEX(X!$H$2:$J$1000,MATCH($G168,X!$H$2:$H$1000,0),2)","v":"FOURNISSEUR 0005"},{"$f":"INDEX(X!$H$2:$J$1000,MATCH($G168,X!$H$2:$H$1000,0),3)","v":"00041111004000059"},0.14000000000000001,"ESPECES","2015-11-30","2015-10-14","2016-04-01",1]
[null,"796946092015","PRES DE SERVICES",169,33.799999999999997,202.8,1009300,{"$f":"INDEX(X!$H$2:$J$1000,MATCH($G169,X!$H$2:$H$1000,0),2)","v":"FOURNISSEUR 0025"},{"$f":"INDEX(X!$H$2:$J$1000,MATCH($G169,X!$H$2:$H$1000,0),3)","v":"00241111004000079"},0.2,"CHQ 4386136","2015-12-10","2015-08-01","2016-04-01",2]
[null,"796947092015","PRES DE SERVICES",82.5,16.5,99,1009300,{"$f":"INDEX(X!$H$2:$J$1000,MATCH($G170,X!$H$2:$H$1000,0),2)","v":"FOURNISSEUR 0025"},{"$f":"INDEX(X!$H$2:$J$1000,MATCH($G170,X!$H$2:$H$1000,0),3)","v":"00241111004000079"},0.2,"CHQ 4386136","2015-12-10","2015-08-01","2016-04-01",2]
[null,"790540102015","PRES DE SERVICES",169,33.799999999999997,202.8,1009300,{"$f":"INDEX(X!$H$2:$J$1000,MATCH($G171,X!$H$2:$H$1000,0),2)","v":"FOURNISSEUR 0025"},{"$f":"INDEX(X!$H$2:$J$1000,MATCH($G171,X!$H$2:$H$1000,0),3)","v":"00241111004000079"},0.2,"CHQ 4386136","2015-12-10","2015-09-01","2016-04-01",2]
[null,"790541102015","PRES DE SERVICES",82.5,16.5,99,1009300,{"$f":"INDEX(X!$H$2:$J$1000,MATCH($G172,X!$H$2:$H$1000,0),2)","v":"FOURNISSEUR 0025"},{"$f":"INDEX(X!$H$2:$J$1000,MATCH($G172,X!$H$2:$H$1000,0),3)","v":"00241111004000079"},0.2,"CHQ 4386136","2015-12-10","2015-09-01","2016-04-01",2]
[null,"780753112015","PRES DE SERVICES",169,33.799999999999997,202.8,1009300,{"$f":"INDEX(X!$H$2:$J$1000,MATCH($G173,X!$H$2:$H$1000,0),2)","v":"FOURNISSEUR 0025"},{"$f":"INDEX(X!$H$2:$J$1000,MATCH($G173,X!$H$2:$H$1000,0),3)","v":"00241111004000079"},0.2,"CHQ 4386136","2015-12-10","2015-10-01","2016-04-01",2]
[null,"780754112015","PRES DE SERVICES",82.5,16.5,99,1009300,{"$f":"INDEX(X!$H$2:$J$1000,MATCH($G174,X!$H$2:$H$1000,0),2)","v":"FOURNISSEUR 0025"},{"$f":"INDEX(X!$H$2:$J$1000,MATCH($G174,X!$H$2:$H$1000,0),3)","v":"00241111004000079"},0.2,"CHQ 4386136","2015-12-10","2015-10-01","2016-04-01",2]
[null,"773963122015","PRES DE SERVICES",169,33.799999999999997,202.8,1009300,{"$f":"INDEX(X!$H$2:$J$1000,MATCH($G175,X!$H$2:$H$1000,0),2)","v":"FOURNISSEUR 0025"},{"$f":"INDEX(X!$H$2:$J$1000,MATCH($G175,X!$H$2:$H$1000,0),3)","v":"00241111004000079"},0.2,"CHQ 4386136","2015-12-10","2015-11-01","2016-04-01",2]
[null,"028/12/HB2015","MARCHANDISES",5250,1050,6300,1009363,{"$f":"INDEX(X!$H$2:$J$1000,MATCH($G176,X!$H$2:$H$1000,0),2)","v":"FOURNISSEUR 0026"},{"$f":"INDEX(X!$H$2:$J$1000,MATCH($G176,X!$H$2:$H$1000,0),3)","v":"00251111004000080"},0.2,"ESPECES","2015-12-21","2015-12-21","2016-04-01",1]
[null,"004/1/1HB2016","MARCHANDISES",941.67,188.33,1130,1009363,{"$f":"INDEX(X!$H$2:$J$1000,MATCH($G177,X!$H$2:$H$1000,0),2)","v":"FOURNISSEUR 0026"},{"$f":"INDEX(X!$H$2:$J$1000,MATCH($G177,X!$H$2:$H$1000,0),3)","v":"00251111004000080"},0.2,"CHQ 4386142","2016-01-12","2016-01-05","2016-04-01",2]
[null,"454439122015","PRES DE SERVICES",189.83,37.97,227.8,1009300,{"$f":"INDEX(X!$H$2:$J$1000,MATCH($G178,X!$H$2:$H$1000,0),2)","v":"FOURNISSEUR 0025"},{"$f":"INDEX(X!$H$2:$J$1000,MATCH($G178,X!$H$2:$H$1000,0),3)","v":"00241111004000079"},0.2,"CHQ 4386144","2016-01-15","2015-12-11","2016-04-01",2]
[null,"61402102016","PRES DE SERVICES",169,33.799999999999997,202.8,1009300,{"$f":"INDEX(X!$H$2:$J$1000,MATCH($G179,X!$H$2:$H$1000,0),2)","v":"FOURNISSEUR 0025"},{"$f":"INDEX(X!$H$2:$J$1000,MATCH($G179,X!$H$2:$H$1000,0),3)","v":"00241111004000079"},0.2,"CHQ 4386144","2016-01-15","2015-12-31","2016-04-01",2]
[null,"920150506599","ELECTRICITE",80.11,12.2,96.13,1008040,{"$f":"INDEX(X!$H$2:$J$1000,MATCH($G180,X!$H$2:$H$1000,0),2)","v":"FOURNISSEUR 0005"},{"$f":"INDEX(X!$H$2:$J$1000,MATCH($G180,X!$H$2:$H$1000,0),3)","v":"00041111004000059"},0.14000000000000001,"ESPECES","2016-02-10","2015-11-12","2016-04-01",1]
[null,"1020150506599","ELECTRICITE",51.74,8.0299999999999994,62.09,1008040,{"$f":"INDEX(X!$H$2:$J$1000,MATCH($G181,X!$H$2:$H$1000,0),2)","v":"FOURNISSEUR 0005"},{"$f":"INDEX(X!$H$2:$J$1000,MATCH($G181,X!$H$2:$H$1000,0),3)","v":"00041111004000059"},0.14000000000000001,"ESPECES","2016-02-10","2015-12-30","2016-04-01",1]
[null,"1120150506599","ELECTRICITE",63.57,9.77,76.28,1008040,{"$f":"INDEX(X!$H$2:$J$1000,MATCH($G182,X!$H$2:$H$1000,0),2)","v":"FOURNISSEUR 0005"},{"$f":"INDEX(X!$H$2:$J$1000,MATCH($G182,X!$H$2:$H$1000,0),3)","v":"00041111004000059"},0.14000000000000001,"ESPECES","2016-02-10","2015-12-31","2016-04-01",1]
[null,"1220150506599","ELECTRICITE",56.48,8.73,67.77,1008040,{"$f":"INDEX(X!$H$2:$J$1000,MATCH($G183,X!$H$2:$H$1000,0),2)","v":"FOURNISSEUR 0005"},{"$f":"INDEX(X!$H$2:$J$1000,MATCH($G183,X!$H$2:$H$1000,0),3)","v":"00041111004000059"},0.14000000000000001,"ESPECES","2016-02-10","2015-12-31","2016-04-01",1]
[null,"773964122015","PRES DE SERVICES",82.5,16.5,99,1009300,{"$f":"INDEX(X!$H$2:$J$1000,MATCH($G184,X!$H$2:$H$1000,0),2)","v":"FOURNISSEUR 0025"},{"$f":"INDEX(X!$H$2:$J$1000,MATCH($G184,X!$H$2:$H$1000,0),3)","v":"00241111004000079"},0.2,"CHQ 4386151","2016-02-15","2015-11-01","2016-04-01",2]
[null,"588640112015","PRES DE SERVICES",169,33.799999999999997,202.8,1009300,{"$f":"INDEX(X!$H$2:$J$1000,MATCH($G185,X!$H$2:$H$1000,0),2)","v":"FOURNISSEUR 0025"},{"$f":"INDEX(X!$H$2:$J$1000,MATCH($G185,X!$H$2:$H$1000,0),3)","v":"00241111004000079"},0.2,"CHQ 4386151","2016-02-15","2015-11-10","2016-04-01",2]
[null,"766859012016","PRES DE SERVICES",164.16,32.83,196.99,1009300,{"$f":"INDEX(X!$H$2:$J$1000,MATCH($G186,X!$H$2:$H$1000,0),2)","v":"FOURNISSEUR 0025"},{"$f":"INDEX(X!$H$2:$J$1000,MATCH($G186,X!$H$2:$H$1000,0),3)","v":"00241111004000079"},0.2,"CHQ 4386151","2016-02-15","2015-12-01","2016-04-01",2]
[null,"766860012016","PRES DE SERVICES",82.5,16.5,99,1009300,{"$f":"INDEX(X!$H$2:$J$1000,MATCH($G187,X!$H$2:$H$1000,0),2)","v":"FOURNISSEUR 0025"},{"$f":"INDEX(X!$H$2:$J$1000,MATCH($G187,X!$H$2:$H$1000,0),3)","v":"00241111004000079"},0.2,"CHQ 4386151","2016-02-15","2015-12-01","2016-04-01",2]
[null,"016/02/HB2016","MARCHANDISES",1575,315,1890,1009363,{"$f":"INDEX(X!$H$2:$J$1000,MATCH($G188,X!$H$2:$H$1000,0),2)","v":"FOURNISSEUR 0026"},{"$f":"INDEX(X!$H$2:$J$1000,MATCH($G188,X!$H$2:$H$1000,0),3)","v":"00251111004000080"},0.2,"CHQ 4386143","2016-02-28","2016-02-10","2016-04-01",2]
[null,"512 82","MARCHANDISES",3304.75,660.95,3965.7,1009678,{"$f":"INDEX(X!$H$2:$J$1000,MATCH($G189,X!$H$2:$H$1000,0),2)","v":"FOURNISSEUR 0031"},{"$f":"INDEX(X!$H$2:$J$1000,MATCH($G189,X!$H$2:$H$1000,0),3)","v":"00301111004000085"},0.2,"EFFET T 5483872","2016-03-30","2015-12-31","2016-04-01",5]
[null,15124668,"MARCHANDISES",2075.42,415.08,2490.5,1008922,{"$f":"INDEX(X!$H$2:$J$1000,MATCH($G190,X!$H$2:$H$1000,0),2)","v":"FOURNISSEUR 0019"},{"$f":"INDEX(X!$H$2:$J$1000,MATCH($G190,X!$H$2:$H$1000,0),3)","v":"00181111004000073"},0.2,"EFFET T 5483860","2016-03-30","2015-12-31","2016-04-01",5]
[null,15124428,"MARCHANDISES",14929.17,2985.83,17915,1008922,{"$f":"INDEX(X!$H$2:$J$1000,MATCH($G191,X!$H$2:$H$1000,0),2)","v":"FOURNISSEUR 0019"},{"$f":"INDEX(X!$H$2:$J$1000,MATCH($G191,X!$H$2:$H$1000,0),3)","v":"00181111004000073"},0.2,"EFFET T 5483871","2016-03-30","2015-12-31","2016-04-01",5]
[null,160000241,"MARCHANDISES",768,153.6,921.6,1009426,{"$f":"INDEX(X!$H$2:$J$1000,MATCH($G192,X!$H$2:$H$1000,0),2)","v":"FOURNISSEUR 0027"},{"$f":"INDEX(X!$H$2:$J$1000,MATCH($G192,X!$H$2:$H$1000,0),3)","v":"00261111004000081"},0.2,"EFFET T 5483874","2016-03-30","2016-01-30","2016-04-01",5]
[null,"0023/16","MARCHANDISES",6513.33,1302.67,7816,1008670,{"$f":"INDEX(X!$H$2:$J$1000,MATCH($G193,X!$H$2:$H$1000,0),2)","v":"FOURNISSEUR 0015"},{"$f":"INDEX(X!$H$2:$J$1000,MATCH($G193,X!$H$2:$H$1000,0),3)","v":"00141111004000069"},0.2,"EFFET T 5483851","2016-04-01","2016-03-18","2016-04-01",5]
[null,"FA2530","MARCHANDISES",6500,1300,7800,1009237,{"$f":"INDEX(X!$H$2:$J$1000,MATCH($G194,X!$H$2:$H$1000,0),2)","v":"FOURNISSEUR 0024"},{"$f":"INDEX(X!$H$2:$J$1000,MATCH($G194,X!$H$2:$H$1000,0),3)","v":"00231111004000078"},0.2,"EFFET T 5483854","2016-04-15","2016-04-20","2016-04-01",5]
[null,"AVOIR16000001","MARCHANDISES",-583.33000000000004,-116.67,-700,1008922,{"$f":"INDEX(X!$H$2:$J$1000,MATCH($G195,X!$H$2:$H$1000,0),2)","v":"FOURNISSEUR 0019"},{"$f":"INDEX(X!$H$2:$J$1000,MATCH($G195,X!$H$2:$H$1000,0),3)","v":"00181111004000073"},0.2,"EFFET T 5483895","2016-04-25","2016-01-07","2016-04-01",5]
[null,16010055,"MARCHANDISES",17614.5,3522.9,21137.4,1008922,{"$f":"INDEX(X!$H$2:$J$1000,MATCH($G196,X!$H$2:$H$1000,0),2)","v":"FOURNISSEUR 0019"},{"$f":"INDEX(X!$H$2:$J$1000,MATCH($G196,X!$H$2:$H$1000,0),3)","v":"00181111004000073"},0.2,"EFFET T 5483895","2016-04-25","2016-01-31","2016-04-01",5]
[null,"FA16020506","MARCHANDISES",17895,3579,21474,1008922,{"$f":"INDEX(X!$H$2:$J$1000,MATCH($G197,X!$H$2:$H$1000,0),2)","v":"FOURNISSEUR 0019"},{"$f":"INDEX(X!$H$2:$J$1000,MATCH($G197,X!$H$2:$H$1000,0),3)","v":"00181111004000073"},0.2,"EFFET T 5483896","2016-05-30","2016-02-29","2016-05-01",{"$f":"IF(COUNTIF(K197,\"*EF*\"),5,IF(COUNTIF(K197,\"*ES*\"),1,IF(COUNTIF(K197,\"*CH*\"),2,IF(COUNTIF(K197,\"*PR*\"),3,IF(COUNTIF(K197,\"*CO*\"),6,IF(COUNTIF(K197,\"*VI*\"),4,7))))))","v":5}]
[null,"FA16020507","MARCHANDISES",17755,3551,21306,1008922,{"$f":"INDEX(X!$H$2:$J$1000,MATCH($G198,X!$H$2:$H$1000,0),2)","v":"FOURNISSEUR 0019"},{"$f":"INDEX(X!$H$2:$J$1000,MATCH($G198,X!$H$2:$H$1000,0),3)","v":"00181111004000073"},0.2,"EFFET T 5483896","2016-05-30","2016-02-29","2016-05-01",5]
[null,183,"MARCHANDISES",1041.67,208.33,1250,1007914,{"$f":"INDEX(X!$H$2:$J$1000,MATCH($G199,X!$H$2:$H$1000,0),2)","v":"FOURNISSEUR 0003"},{"$f":"INDEX(X!$H$2:$J$1000,MATCH($G199,X!$H$2:$H$1000,0),3)","v":"00021111004000057"},0.2,"EFFET T 05483894","2016-06-06","2016-05-03","2016-06-01",5]
[null,60351,"MARCHANDISES",2584.17,516.83000000000004,3101,1008733,{"$f":"INDEX(X!$H$2:$J$1000,MATCH($G200,X!$H$2:$H$1000,0),2)","v":"FOURNISSEUR 0016"},{"$f":"INDEX(X!$H$2:$J$1000,MATCH($G200,X!$H$2:$H$1000,0),3)","v":"00151111004000070"},0.2,"EFFET T 056900206","2016-06-30","2016-03-31","2016-06-01",5]
[null,60340,"MARCHANDISES",15708.33,3141.67,18850,1008733,{"$f":"INDEX(X!$H$2:$J$1000,MATCH($G201,X!$H$2:$H$1000,0),2)","v":"FOURNISSEUR 0016"},{"$f":"INDEX(X!$H$2:$J$1000,MATCH($G201,X!$H$2:$H$1000,0),3)","v":"00151111004000070"},0.2,"EFFET T 056900206","2016-06-30","2016-03-31","2016-06-01",5]
[null,603133,"MARCHANDISES",11121.83,2224.37,13346.2,1009678,{"$f":"INDEX(X!$H$2:$J$1000,MATCH($G202,X!$H$2:$H$1000,0),2)","v":"FOURNISSEUR 0031"},{"$f":"INDEX(X!$H$2:$J$1000,MATCH($G202,X!$H$2:$H$1000,0),3)","v":"00301111004000085"},0.2,"EFFET T 056900204","2016-06-30","2016-03-31","2016-06-01",5]
[null,16030957,"MARCHANDISES",23649.17,4729.83,28379,1008922,{"$f":"INDEX(X!$H$2:$J$1000,MATCH($G203,X!$H$2:$H$1000,0),2)","v":"FOURNISSEUR 0019"},{"$f":"INDEX(X!$H$2:$J$1000,MATCH($G203,X!$H$2:$H$1000,0),3)","v":"00181111004000073"},0.2,"EFFET T 05483897","2016-06-30","2016-03-31","2016-06-01",5]
[null,601116,"MARCHANDISES",3289.58,657.92,3947.5,1009678,{"$f":"INDEX(X!$H$2:$J$1000,MATCH($G204,X!$H$2:$H$1000,0),2)","v":"FOURNISSEUR 0031"},{"$f":"INDEX(X!$H$2:$J$1000,MATCH($G204,X!$H$2:$H$1000,0),3)","v":"00301111004000085"},0.2,"EFFET 05483878","2016-05-02","2016-01-30","2016-07-01",5]
[null,"042/16","MARCHANDISES",10102.5,2020.5,12123,1008670,{"$f":"INDEX(X!$H$2:$J$1000,MATCH($G205,X!$H$2:$H$1000,0),2)","v":"FOURNISSEUR 0015"},{"$f":"INDEX(X!$H$2:$J$1000,MATCH($G205,X!$H$2:$H$1000,0),3)","v":"00141111004000069"},0.2,"EFFET T 05483865","2016-05-02","2016-05-09","2016-07-01",5]
[null,"FA2542","MARCHANDISES",6406.67,1281.33,7688,1009237,{"$f":"INDEX(X!$H$2:$J$1000,MATCH($G206,X!$H$2:$H$1000,0),2)","v":"FOURNISSEUR 0024"},{"$f":"INDEX(X!$H$2:$J$1000,MATCH($G206,X!$H$2:$H$1000,0),3)","v":"00231111004000078"},0.2,"EFFET T 5483882","2016-05-20","2016-05-23","2016-07-01",5]
[null,60249,"MARCHANDISES",1758.33,351.67,2110,1009678,{"$f":"INDEX(X!$H$2:$J$1000,MATCH($G207,X!$H$2:$H$1000,0),2)","v":"FOURNISSEUR 0031"},{"$f":"INDEX(X!$H$2:$J$1000,MATCH($G207,X!$H$2:$H$1000,0),3)","v":"00301111004000085"},0.2,"EFFET T 05483880","2016-05-30","2016-02-29","2016-07-01",5]
[null,"044 /16","MARCHANDISES",3079.17,615.83000000000004,3695,1008670,{"$f":"INDEX(X!$H$2:$J$1000,MATCH($G208,X!$H$2:$H$1000,0),2)","v":"FOURNISSEUR 0015"},{"$f":"INDEX(X!$H$2:$J$1000,MATCH($G208,X!$H$2:$H$1000,0),3)","v":"00141111004000069"},0.2,"EFFET T 05483876","2016-05-30","2016-05-17","2016-07-01",5]
[null,1194,"MARCHANDISES",3250,650,3900,1009804,{"$f":"INDEX(X!$H$2:$J$1000,MATCH($G209,X!$H$2:$H$1000,0),2)","v":"FOURNISSEUR 0033"},{"$f":"INDEX(X!$H$2:$J$1000,MATCH($G209,X!$H$2:$H$1000,0),3)","v":"00321111004000087"},0.2,"EFFET T 5483935","2016-05-30","2016-05-19","2016-07-01",5]
[null,1614737,"MARCHANDISES",13333.33,2666.67,16000,1009048,{"$f":"INDEX(X!$H$2:$J$1000,MATCH($G210,X!$H$2:$H$1000,0),2)","v":"FOURNISSEUR 0021"},{"$f":"INDEX(X!$H$2:$J$1000,MATCH($G210,X!$H$2:$H$1000,0),3)","v":"00201111004000075"},0.2,"EF3883/EF3855","2016-06-30","2016-02-28","2016-07-01",5]
[null,"FA2563","MARCHANDISES",8666.67,1733.33,10400,1009237,{"$f":"INDEX(X!$H$2:$J$1000,MATCH($G211,X!$H$2:$H$1000,0),2)","v":"FOURNISSEUR 0024"},{"$f":"INDEX(X!$H$2:$J$1000,MATCH($G211,X!$H$2:$H$1000,0),3)","v":"00231111004000078"},0.2,"EFFET 3884","2016-07-01","2016-07-04","2016-07-01",5]
[null,"F1606002426","MARCHANDISES",2500,500,3000,1008607,{"$f":"INDEX(X!$H$2:$J$1000,MATCH($G212,X!$H$2:$H$1000,0),2)","v":"FOURNISSEUR 0014"},{"$f":"INDEX(X!$H$2:$J$1000,MATCH($G212,X!$H$2:$H$1000,0),3)","v":"00131111004000068"},0.2,"CHQ04949581","2016-07-13","2016-06-07","2016-07-01",2]
[null,160000241,"MARCHANDISES",768,153.6,921.6,1009426,{"$f":"INDEX(X!$H$2:$J$1000,MATCH($G213,X!$H$2:$H$1000,0),2)","v":"FOURNISSEUR 0027"},{"$f":"INDEX(X!$H$2:$J$1000,MATCH($G213,X!$H$2:$H$1000,0),3)","v":"00261111004000081"},0.2,"EFFET 05690213","2016-07-28","2016-01-30","2016-07-01",5]
[null,160000259,"MARCHANDISES",2895,579,3474,1009426,{"$f":"INDEX(X!$H$2:$J$1000,MATCH($G214,X!$H$2:$H$1000,0),2)","v":"FOURNISSEUR 0027"},{"$f":"INDEX(X!$H$2:$J$1000,MATCH($G214,X!$H$2:$H$1000,0),3)","v":"00261111004000081"},0.2,"EFFET T 05690212","2016-07-28","2016-02-29","2016-07-01",5]
[null,"FA 16041385","MARCHANDISES",12839.17,2567.83,15407,1008922,{"$f":"INDEX(X!$H$2:$J$1000,MATCH($G215,X!$H$2:$H$1000,0),2)","v":"FOURNISSEUR 0019"},{"$f":"INDEX(X!$H$2:$J$1000,MATCH($G215,X!$H$2:$H$1000,0),3)","v":"00181111004000073"},0.2,"EFFET T 05690217","2016-07-29","2016-04-30","2016-07-01",5]
[null,"FA16041386","MARCHANDISES",6556.67,1311.33,7868,1008922,{"$f":"INDEX(X!$H$2:$J$1000,MATCH($G216,X!$H$2:$H$1000,0),2)","v":"FOURNISSEUR 0019"},{"$f":"INDEX(X!$H$2:$J$1000,MATCH($G216,X!$H$2:$H$1000,0),3)","v":"00181111004000073"},0.2,"EFFET T 05690217","2016-07-29","2016-04-30","2016-07-01",5]
[null,"FV16-001427","MARCHANDISES",2100,420,2520,1008292,{"$f":"INDEX(X!$H$2:$J$1000,MATCH($G217,X!$H$2:$H$1000,0),2)","v":"FOURNISSEUR 0009"},{"$f":"INDEX(X!$H$2:$J$1000,MATCH($G217,X!$H$2:$H$1000,0),3)","v":"00081111004000063"},0.2,"EFFET T  N°5690214","2016-08-01","2016-03-07","2016-08-01",5]
[null,"FV16-001610","MARCHANDISES",1260,252,1512,1008292,{"$f":"INDEX(X!$H$2:$J$1000,MATCH($G218,X!$H$2:$H$1000,0),2)","v":"FOURNISSEUR 0009"},{"$f":"INDEX(X!$H$2:$J$1000,MATCH($G218,X!$H$2:$H$1000,0),3)","v":"00081111004000063"},0.2,"EFFET T  N°5690214","2016-08-01","2016-03-15","2016-08-01",5]
[null,"16F0717","MARCHANDISES",1047.5,209.5,1257,1009552,{"$f":"INDEX(X!$H$2:$J$1000,MATCH($G219,X!$H$2:$H$1000,0),2)","v":"FOURNISSEUR 0029"},{"$f":"INDEX(X!$H$2:$J$1000,MATCH($G219,X!$H$2:$H$1000,0),3)","v":"00281111004000083"},0.2,"EFFET T  N°5690216","2016-08-01","2016-07-28","2016-08-01",5]
[null,"FA-16-08-0135","MARCHANDISES",768,153.6,921.6,1009741,{"$f":"INDEX(X!$H$2:$J$1000,MATCH($G220,X!$H$2:$H$1000,0),2)","v":"FOURNISSEUR 0032"},{"$f":"INDEX(X!$H$2:$J$1000,MATCH($G220,X!$H$2:$H$1000,0),3)","v":"00311111004000086"},0.2,"CHQ 4949585","2016-08-08","2016-08-31","2016-08-01",2]
[null,605138,"MARCHANDISES",5604.17,1120.83,6725,1008733,{"$f":"INDEX(X!$H$2:$J$1000,MATCH($G221,X!$H$2:$H$1000,0),2)","v":"FOURNISSEUR 0016"},{"$f":"INDEX(X!$H$2:$J$1000,MATCH($G221,X!$H$2:$H$1000,0),3)","v":"00151111004000070"},0.2,"EFFET T  N°5690207","2016-08-30","2016-05-31","2016-08-01",5]
[null,605127,"MARCHANDISES",3032.08,606.41999999999996,3638.5,1009678,{"$f":"INDEX(X!$H$2:$J$1000,MATCH($G222,X!$H$2:$H$1000,0),2)","v":"FOURNISSEUR 0031"},{"$f":"INDEX(X!$H$2:$J$1000,MATCH($G222,X!$H$2:$H$1000,0),3)","v":"00301111004000085"},0.2,"EFFET T  N°5690205","2016-08-30","2016-05-31","2016-08-01",5]
[null,"FA 16051868","MARCHANDISES",16554.169999999998,3310.83,19865,1008922,{"$f":"INDEX(X!$H$2:$J$1000,MATCH($G223,X!$H$2:$H$1000,0),2)","v":"FOURNISSEUR 0019"},{"$f":"INDEX(X!$H$2:$J$1000,MATCH($G223,X!$H$2:$H$1000,0),3)","v":"00181111004000073"},0.2,"EFFET T  N°5690218","2016-08-30","2016-05-31","2016-08-01",5]
[null,"FA 16051869","MARCHANDISES",7049.17,1409.83,8459,1008922,{"$f":"INDEX(X!$H$2:$J$1000,MATCH($G224,X!$H$2:$H$1000,0),2)","v":"FOURNISSEUR 0019"},{"$f":"INDEX(X!$H$2:$J$1000,MATCH($G224,X!$H$2:$H$1000,0),3)","v":"00181111004000073"},0.2,"EFFET T  N°5690218","2016-08-30","2016-05-31","2016-08-01",5]
[null,"fa16041691","MARCHANDISES",8146.67,1629.33,9776,1008922,{"$f":"INDEX(X!$H$2:$J$1000,MATCH($G225,X!$H$2:$H$1000,0),2)","v":"FOURNISSEUR 0019"},{"$f":"INDEX(X!$H$2:$J$1000,MATCH($G225,X!$H$2:$H$1000,0),3)","v":"00181111004000073"},0.2,"EFFET T 05483890","2016-07-12","2016-04-30","2016-09-01",5]
[null,160000241,"MARCHANDISES",-768,-153.6,-921.6,1009426,{"$f":"INDEX(X!$H$2:$J$1000,MATCH($G226,X!$H$2:$H$1000,0),2)","v":"FOURNISSEUR 0027"},{"$f":"INDEX(X!$H$2:$J$1000,MATCH($G226,X!$H$2:$H$1000,0),3)","v":"00261111004000081"},0.2,"EFFET 05690213","2016-07-28","2016-01-30","2016-09-01",5]
[null,"FA2576","MARCHANDISES",10333.33,2066.67,12400,1009237,{"$f":"INDEX(X!$H$2:$J$1000,MATCH($G227,X!$H$2:$H$1000,0),2)","v":"FOURNISSEUR 0024"},{"$f":"INDEX(X!$H$2:$J$1000,MATCH($G227,X!$H$2:$H$1000,0),3)","v":"00231111004000078"},0.2,"EFFET 3892","2016-08-03","2016-08-03","2016-09-01",5]
[null,"FA2590","MARCHANDISES",6141.67,1228.33,7370,1009237,{"$f":"INDEX(X!$H$2:$J$1000,MATCH($G228,X!$H$2:$H$1000,0),2)","v":"FOURNISSEUR 0024"},{"$f":"INDEX(X!$H$2:$J$1000,MATCH($G228,X!$H$2:$H$1000,0),3)","v":"00231111004000078"},0.2,"EFFET 0201","2016-09-01","2016-09-01","2016-09-01",5]
[null,"fa16062644","MARCHANDISES",8215,1643,9858,1008922,{"$f":"INDEX(X!$H$2:$J$1000,MATCH($G229,X!$H$2:$H$1000,0),2)","v":"FOURNISSEUR 0019"},{"$f":"INDEX(X!$H$2:$J$1000,MATCH($G229,X!$H$2:$H$1000,0),3)","v":"00181111004000073"},0.2,"EFFET T 05690203","2016-09-05","2016-06-30","2016-09-01",5]
[null,"FA16062366","MARCHANDISES",13968.33,2793.67,16762,1008922,{"$f":"INDEX(X!$H$2:$J$1000,MATCH($G230,X!$H$2:$H$1000,0),2)","v":"FOURNISSEUR 0019"},{"$f":"INDEX(X!$H$2:$J$1000,MATCH($G230,X!$H$2:$H$1000,0),3)","v":"00181111004000073"},0.2,"EFFET T 05690219","2016-09-30","2016-06-30","2016-09-01",5]
[null,"1606-1334","MARCHANDISES",1333.33,266.67,1600,1009174,{"$f":"INDEX(X!$H$2:$J$1000,MATCH($G231,X!$H$2:$H$1000,0),2)","v":"FOURNISSEUR 0023"},{"$f":"INDEX(X!$H$2:$J$1000,MATCH($G231,X!$H$2:$H$1000,0),3)","v":"00221111004000077"},0.2,"EFFET T 5483894","2016-06-06","2016-06-02","2016-10-01",5]
[null,"FA0057/16","MARCHANDISES",4900,980,5880,1008670,{"$f":"INDEX(X!$H$2:$J$1000,MATCH($G232,X!$H$2:$H$1000,0),2)","v":"FOURNISSEUR 0015"},{"$f":"INDEX(X!$H$2:$J$1000,MATCH($G232,X!$H$2:$H$1000,0),3)","v":"00141111004000069"},0.2,"EFFET T  05483888","2016-06-30","2016-06-30","2016-10-01",5]
[null,"FA0056/16","MARCHANDISES",1936.67,387.33,2324,1008670,{"$f":"INDEX(X!$H$2:$J$1000,MATCH($G233,X!$H$2:$H$1000,0),2)","v":"FOURNISSEUR 0015"},{"$f":"INDEX(X!$H$2:$J$1000,MATCH($G233,X!$H$2:$H$1000,0),3)","v":"00141111004000069"},0.2,"EFFET T 5483899","2016-07-26","2016-06-25","2016-10-01",5]
[null,"FA0064/16","MARCHANDISES",4078.33,815.67,4894,1008670,{"$f":"INDEX(X!$H$2:$J$1000,MATCH($G234,X!$H$2:$H$1000,0),2)","v":"FOURNISSEUR 0015"},{"$f":"INDEX(X!$H$2:$J$1000,MATCH($G234,X!$H$2:$H$1000,0),3)","v":"00141111004000069"},0.2,"EFFET T  5690202","2016-08-30","2016-09-19","2016-10-01",5]
[null,"FA2599","MARCHANDISES",5250,1050,6300,1009237,{"$f":"INDEX(X!$H$2:$J$1000,MATCH($G235,X!$H$2:$H$1000,0),2)","v":"FOURNISSEUR 0024"},{"$f":"INDEX(X!$H$2:$J$1000,MATCH($G235,X!$H$2:$H$1000,0),3)","v":"00231111004000078"},0.2,"EFFET T  05690208","2016-10-04","2016-10-03","2016-10-01",5]
[null,"FA 60768","MARCHANDISES",807.5,161.5,969,1009678,{"$f":"INDEX(X!$H$2:$J$1000,MATCH($G236,X!$H$2:$H$1000,0),2)","v":"FOURNISSEUR 0031"},{"$f":"INDEX(X!$H$2:$J$1000,MATCH($G236,X!$H$2:$H$1000,0),3)","v":"00301111004000085"},0.2,"EFFET T  05690229","2016-10-31","2016-07-30","2016-10-01",5]
[null,"1605-1130","MARCHANDISES",2783.33,556.66999999999996,3340,1009174,{"$f":"INDEX(X!$H$2:$J$1000,MATCH($G237,X!$H$2:$H$1000,0),2)","v":"FOURNISSEUR 0023"},{"$f":"INDEX(X!$H$2:$J$1000,MATCH($G237,X!$H$2:$H$1000,0),3)","v":"00221111004000077"},0.2,"EFFET T 5483887","2016-05-11","2016-05-09","2016-11-01",5]
[null,"1607-1762","MARCHANDISES",1625,325,1950,1009174,{"$f":"INDEX(X!$H$2:$J$1000,MATCH($G238,X!$H$2:$H$1000,0),2)","v":"FOURNISSEUR 0023"},{"$f":"INDEX(X!$H$2:$J$1000,MATCH($G238,X!$H$2:$H$1000,0),3)","v":"00221111004000077"},0.2,"EFFET T 5483891","2016-07-13","2016-07-11","2016-11-01",5]
[null,"1608-2718","MARCHANDISES",916.67,183.33,1100,1009174,{"$f":"INDEX(X!$H$2:$J$1000,MATCH($G239,X!$H$2:$H$1000,0),2)","v":"FOURNISSEUR 0023"},{"$f":"INDEX(X!$H$2:$J$1000,MATCH($G239,X!$H$2:$H$1000,0),3)","v":"00221111004000077"},0.2,"CHQ04949584","2016-08-15","2016-08-15","2016-11-01",2]
[null,374,"MARCHANDISES",1166.67,233.33,1400,1009111,{"$f":"INDEX(X!$H$2:$J$1000,MATCH($G240,X!$H$2:$H$1000,0),2)","v":"FOURNISSEUR 0022"},{"$f":"INDEX(X!$H$2:$J$1000,MATCH($G240,X!$H$2:$H$1000,0),3)","v":"00211111004000076"},0.2,"EFFET T 05690215","2016-08-30","2016-08-18","2016-11-01",5]
[null,1199,"MARCHANDISES",2566.67,513.33000000000004,3080,1009804,{"$f":"INDEX(X!$H$2:$J$1000,MATCH($G241,X!$H$2:$H$1000,0),2)","v":"FOURNISSEUR 0033"},{"$f":"INDEX(X!$H$2:$J$1000,MATCH($G241,X!$H$2:$H$1000,0),3)","v":"00321111004000087"},0.2,"EFFET T 05690220","2016-10-04","2016-09-30","2016-11-01",5]
[null,60782,"MARCHANDISES",9912.5,1982.5,11895,1008733,{"$f":"INDEX(X!$H$2:$J$1000,MATCH($G242,X!$H$2:$H$1000,0),2)","v":"FOURNISSEUR 0016"},{"$f":"INDEX(X!$H$2:$J$1000,MATCH($G242,X!$H$2:$H$1000,0),3)","v":"00151111004000070"},0.2,"EFFET T 05690228","2016-10-31","2016-07-30","2016-11-01",5]
[null,"fa16/08/0136","MARCHANDISES",5000,1000,6000,1009741,{"$f":"INDEX(X!$H$2:$J$1000,MATCH($G243,X!$H$2:$H$1000,0),2)","v":"FOURNISSEUR 0032"},{"$f":"INDEX(X!$H$2:$J$1000,MATCH($G243,X!$H$2:$H$1000,0),3)","v":"00311111004000086"},0.2,"EFFET T 05690222","2016-11-15","2016-08-31","2016-11-01",5]
[null,"fa16093802","MARCHANDISES",6366.67,1273.33,7640,1008922,{"$f":"INDEX(X!$H$2:$J$1000,MATCH($G244,X!$H$2:$H$1000,0),2)","v":"FOURNISSEUR 0019"},{"$f":"INDEX(X!$H$2:$J$1000,MATCH($G244,X!$H$2:$H$1000,0),3)","v":"00181111004000073"},0.2,"EFFET T 05690226","2016-11-28","2016-09-30","2016-11-01",5]
[null,608154,"MARCHANDISES",1308.33,261.67,1570,1008733,{"$f":"INDEX(X!$H$2:$J$1000,MATCH($G245,X!$H$2:$H$1000,0),2)","v":"FOURNISSEUR 0016"},{"$f":"INDEX(X!$H$2:$J$1000,MATCH($G245,X!$H$2:$H$1000,0),3)","v":"00151111004000070"},0.2,"EFFET T 05690234","2016-11-30","2016-08-31","2016-11-01",5]
[null,608155,"MARCHANDISES",2830,566,3396,1009678,{"$f":"INDEX(X!$H$2:$J$1000,MATCH($G246,X!$H$2:$H$1000,0),2)","v":"FOURNISSEUR 0031"},{"$f":"INDEX(X!$H$2:$J$1000,MATCH($G246,X!$H$2:$H$1000,0),3)","v":"00301111004000085"},0.2,"EFFET T 05690235","2016-11-30","2016-08-31","2016-11-01",5]
[null,"F065/2016","MARCHANDISES",2083.33,416.67,2500,1008544,{"$f":"INDEX(X!$H$2:$J$1000,MATCH($G247,X!$H$2:$H$1000,0),2)","v":"FOURNISSEUR 0013"},{"$f":"INDEX(X!$H$2:$J$1000,MATCH($G247,X!$H$2:$H$1000,0),3)","v":"00121111004000067"},0.2,"EFFET T 5483889","2016-05-30","2016-05-27","2016-12-01",5]
[null,"F111/2016","MARCHANDISES",750,150,900,1008544,{"$f":"INDEX(X!$H$2:$J$1000,MATCH($G248,X!$H$2:$H$1000,0),2)","v":"FOURNISSEUR 0013"},{"$f":"INDEX(X!$H$2:$J$1000,MATCH($G248,X!$H$2:$H$1000,0),3)","v":"00121111004000067"},0.2,"EFFET T 5690225","2016-10-10","2016-09-03","2016-12-01",5]
[null,"FA0082/16","MARCHANDISES",7166.67,1433.33,8600,1008670,{"$f":"INDEX(X!$H$2:$J$1000,MATCH($G249,X!$H$2:$H$1000,0),2)","v":"FOURNISSEUR 0015"},{"$f":"INDEX(X!$H$2:$J$1000,MATCH($G249,X!$H$2:$H$1000,0),3)","v":"00141111004000069"},0.2,"EFFET T  5690210","2016-10-30","2016-11-06","2016-12-01",5]
[null,"FA2621","MARCHANDISES",10000,2000,12000,1009237,{"$f":"INDEX(X!$H$2:$J$1000,MATCH($G250,X!$H$2:$H$1000,0),2)","v":"FOURNISSEUR 0024"},{"$f":"INDEX(X!$H$2:$J$1000,MATCH($G250,X!$H$2:$H$1000,0),3)","v":"00231111004000078"},0.2,"EFFET T  5690224","2016-11-20","2016-11-23","2016-12-01",5]
[null,"FA2626","MARCHANDISES",10083.33,2016.67,12100,1009237,{"$f":"INDEX(X!$H$2:$J$1000,MATCH($G251,X!$H$2:$H$1000,0),2)","v":"FOURNISSEUR 0024"},{"$f":"INDEX(X!$H$2:$J$1000,MATCH($G251,X!$H$2:$H$1000,0),3)","v":"00231111004000078"},0.2,"EFFET T 5690223","2016-11-30","2016-12-01","2016-12-01",5]
[null,"16F1202","MARCHANDISES",2495.83,499.17,2995,1009552,{"$f":"INDEX(X!$H$2:$J$1000,MATCH($G252,X!$H$2:$H$1000,0),2)","v":"FOURNISSEUR 0029"},{"$f":"INDEX(X!$H$2:$J$1000,MATCH($G252,X!$H$2:$H$1000,0),3)","v":"00281111004000083"},0.2,"EFFET T 5690230","2016-11-30","2016-12-02","2016-12-01",5]
[null,"FA-16072812","MARCHANDISES",10051.67,2010.33,12062,1008922,{"$f":"INDEX(X!$H$2:$J$1000,MATCH($G253,X!$H$2:$H$1000,0),2)","v":"FOURNISSEUR 0019"},{"$f":"INDEX(X!$H$2:$J$1000,MATCH($G253,X!$H$2:$H$1000,0),3)","v":"00181111004000073"},0.2,"EFFET T  5690238","2016-12-10","2016-07-31","2016-12-01",5]
[null,"FA-16093618","MARCHANDISES",13425,2685,16110,1008922,{"$f":"INDEX(X!$H$2:$J$1000,MATCH($G254,X!$H$2:$H$1000,0),2)","v":"FOURNISSEUR 0019"},{"$f":"INDEX(X!$H$2:$J$1000,MATCH($G254,X!$H$2:$H$1000,0),3)","v":"00181111004000073"},0.2,"EFFET T  5690239","2016-12-10","2016-09-30","2016-12-01",5]
[null,"FV16-004170","MARCHANDISES",4973,994.6,5967.6,1008292,{"$f":"INDEX(X!$H$2:$J$1000,MATCH($G255,X!$H$2:$H$1000,0),2)","v":"FOURNISSEUR 0009"},{"$f":"INDEX(X!$H$2:$J$1000,MATCH($G255,X!$H$2:$H$1000,0),3)","v":"00081111004000063"},0.2,"EFFET T 5690241","2016-12-15","2016-08-01","2016-12-01",5]
[null,"FA686/2016","IMMOBILISATION",6666.67,1333.33,8000,1009489,{"$f":"INDEX(X!$H$2:$J$1000,MATCH($G256,X!$H$2:$H$1000,0),2)","v":"FOURNISSEUR 0028"},{"$f":"INDEX(X!$H$2:$J$1000,MATCH($G256,X!$H$2:$H$1000,0),3)","v":"00271111004000082"},0.2,"CHQ 4949592","2016-12-25","2016-12-26","2016-12-01",2]
[null,559,"MARCHANDISES",1245.83,249.17,1495,1009111,{"$f":"INDEX(X!$H$2:$J$1000,MATCH($G257,X!$H$2:$H$1000,0),2)","v":"FOURNISSEUR 0022"},{"$f":"INDEX(X!$H$2:$J$1000,MATCH($G257,X!$H$2:$H$1000,0),3)","v":"00211111004000076"},0.2,"EFFET T  5690237","2016-12-30","2016-11-30","2016-12-01",5]
[null,"FA 16104387","MARCHANDISES",1833.32,366.68,2200,1008922,{"$f":"INDEX(X!$H$2:$J$1000,MATCH($G258,X!$H$2:$H$1000,0),2)","v":"FOURNISSEUR 0019"},{"$f":"INDEX(X!$H$2:$J$1000,MATCH($G258,X!$H$2:$H$1000,0),3)","v":"00181111004000073"},0.2,"EFFET T  5690227","2016-11-28","2016-10-31","2017-01-01",5]
[null,"FA2640","MARCHANDISES",10775,2155,12930,1009237,{"$f":"INDEX(X!$H$2:$J$1000,MATCH($G259,X!$H$2:$H$1000,0),2)","v":"FOURNISSEUR 0024"},{"$f":"INDEX(X!$H$2:$J$1000,MATCH($G259,X!$H$2:$H$1000,0),3)","v":"00231111004000078"},0.2,"EFFET T 5690232","2017-01-02","2017-01-04","2017-01-01",5]
[null,"FA 16083429","MARCHANDISES",31600,6320,37920,1008922,{"$f":"INDEX(X!$H$2:$J$1000,MATCH($G260,X!$H$2:$H$1000,0),2)","v":"FOURNISSEUR 0019"},{"$f":"INDEX(X!$H$2:$J$1000,MATCH($G260,X!$H$2:$H$1000,0),3)","v":"00181111004000073"},0.2,"EFFET T 5690240","2017-01-04","2016-08-31","2017-01-01",5]
[null,"FA 16083439","MARCHANDISES",2166.67,433.33,2600,1008922,{"$f":"INDEX(X!$H$2:$J$1000,MATCH($G261,X!$H$2:$H$1000,0),2)","v":"FOURNISSEUR 0019"},{"$f":"INDEX(X!$H$2:$J$1000,MATCH($G261,X!$H$2:$H$1000,0),3)","v":"00181111004000073"},0.2,"EFFET T 5690240","2017-01-04","2016-08-31","2017-01-01",{"$f":"IF(COUNTIF(K261,\"*EF*\"),5,IF(COUNTIF(K261,\"*ES*\"),1,IF(COUNTIF(K261,\"*CH*\"),2,IF(COUNTIF(K261,\"*PR*\"),3,IF(COUNTIF(K261,\"*CO*\"),6,IF(COUNTIF(K261,\"*VI*\"),4,7))))))","v":5}]
[null,"F 610 32","MARCHANDISES",5484.17,1096.83,6581,1009678,{"$f":"INDEX(X!$H$2:$J$1000,MATCH($G262,X!$H$2:$H$1000,0),2)","v":"FOURNISSEUR 0031"},{"$f":"INDEX(X!$H$2:$J$1000,MATCH($G262,X!$H$2:$H$1000,0),3)","v":"00301111004000085"},0.2,"EFFET T 5690236","2017-01-30","2016-10-31","2017-01-01",5]
[null,"17F0118","MARCHANDISES",941.67,188.33,1130,1009552,{"$f":"INDEX(X!$H$2:$J$1000,MATCH($G263,X!$H$2:$H$1000,0),2)","v":"FOURNISSEUR 0029"},{"$f":"INDEX(X!$H$2:$J$1000,MATCH($G263,X!$H$2:$H$1000,0),3)","v":"00281111004000083"},0.2,"EFFET T  5690249","2017-01-31","2017-01-28","2017-01-01",5]
[null,"82/2016","MARCHANDISES",{"$f":"Tableachat[[#This Row],[MONTANT TTC]]/1.2","v":1143.81},{"$f":"Tableachat[[#This Row],[MONTANT TTC]]-Tableachat[[#This Row],[MONTANT HT]]","v":228.76},1372.57,1008859,{"$f":"INDEX(X!$H$2:$J$1000,MATCH($G264,X!$H$2:$H$1000,0),2)","v":"FOURNISSEUR 0016"},{"$f":"INDEX(X!$H$2:$J$1000,MATCH($G264,X!$H$2:$H$1000,0),3)","v":"00171111004000072"},0.2,"CHQ 4949590","2016-10-24","2016-10-20","2017-02-01",2]
[null,"FA2650","MARCHANDISES",{"$f":"Tableachat[[#This Row],[MONTANT TTC]]/1.2","v":12750},{"$f":"Tableachat[[#This Row],[MONTANT TTC]]-Tableachat[[#This Row],[MONTANT HT]]","v":2550},15300,1009237,{"$f":"INDEX(X!$H$2:$J$1000,MATCH($G265,X!$H$2:$H$1000,0),2)","v":"FOURNISSEUR 0024"},{"$f":"INDEX(X!$H$2:$J$1000,MATCH($G265,X!$H$2:$H$1000,0),3)","v":"00231111004000078"},0.2,"EFFET T 5690233","2017-01-31","2017-02-02","2017-02-01",5]
[null,1701000033,"MARCHANDISES",{"$f":"Tableachat[[#This Row],[MONTANT TTC]]/1.2","v":1658.5},{"$f":"Tableachat[[#This Row],[MONTANT TTC]]-Tableachat[[#This Row],[MONTANT HT]]","v":331.7},1990.2,1008607,{"$f":"INDEX(X!$H$2:$J$1000,MATCH($G266,X!$H$2:$H$1000,0),2)","v":"FOURNISSEUR 0014"},{"$f":"INDEX(X!$H$2:$J$1000,MATCH($G266,X!$H$2:$H$1000,0),3)","v":"00131111004000068"},0.2,"CHQ 4949596","2017-02-14","2017-01-12","2017-02-01",2]
[null,16104008,"MARCHANDISES",{"$f":"Tableachat[[#This Row],[MONTANT TTC]]/1.2","v":20543.169999999998},{"$f":"Tableachat[[#This Row],[MONTANT TTC]]-Tableachat[[#This Row],[MONTANT HT]]","v":4108.63},24651.8,1008922,{"$f":"INDEX(X!$H$2:$J$1000,MATCH($G267,X!$H$2:$H$1000,0),2)","v":"FOURNISSEUR 0019"},{"$f":"INDEX(X!$H$2:$J$1000,MATCH($G267,X!$H$2:$H$1000,0),3)","v":"00181111004000073"},0.2,"EFFET T 05994606","2017-02-17","2016-10-31","2017-02-01",5]
[null,16104009,"MARCHANDISES",{"$f":"Tableachat[[#This Row],[MONTANT TTC]]/1.2","v":12802.08},{"$f":"Tableachat[[#This Row],[MONTANT TTC]]-Tableachat[[#This Row],[MONTANT HT]]","v":2560.42},15362.5,1008922,{"$f":"INDEX(X!$H$2:$J$1000,MATCH($G268,X!$H$2:$H$1000,0),2)","v":"FOURNISSEUR 0019"},{"$f":"INDEX(X!$H$2:$J$1000,MATCH($G268,X!$H$2:$H$1000,0),3)","v":"00181111004000073"},0.2,"EFFET T 05994606","2017-02-17","2016-10-31","2017-02-01",5]
[null,16104010,"MARCHANDISES",{"$f":"Tableachat[[#This Row],[MONTANT TTC]]/1.2","v":4916.67},{"$f":"Tableachat[[#This Row],[MONTANT TTC]]-Tableachat[[#This Row],[MONTANT HT]]","v":983.33},5900,1008922,{"$f":"INDEX(X!$H$2:$J$1000,MATCH($G269,X!$H$2:$H$1000,0),2)","v":"FOURNISSEUR 0019"},{"$f":"INDEX(X!$H$2:$J$1000,MATCH($G269,X!$H$2:$H$1000,0),3)","v":"00181111004000073"},0.2,"EFFET T 05994606","2017-02-17","2016-10-31","2017-02-01",5]
[null,"FV16-005714","MARCHANDISES",{"$f":"Tableachat[[#This Row],[MONTANT TTC]]/1.2","v":900},{"$f":"Tableachat[[#This Row],[MONTANT TTC]]-Tableachat[[#This Row],[MONTANT HT]]","v":180},1080,1008292,{"$f":"INDEX(X!$H$2:$J$1000,MATCH($G270,X!$H$2:$H$1000,0),2)","v":"FOURNISSEUR 0009"},{"$f":"INDEX(X!$H$2:$J$1000,MATCH($G270,X!$H$2:$H$1000,0),3)","v":"00081111004000063"},0.2,"EFFET T 05994609","2017-02-22","2016-10-28","2017-02-01",5]
[null,300006424,"MARCHANDISES",{"$f":"Tableachat[[#This Row],[MONTANT TTC]]/1.2","v":493.33},{"$f":"Tableachat[[#This Row],[MONTANT TTC]]-Tableachat[[#This Row],[MONTANT HT]]","v":98.67},592,1008481,{"$f":"INDEX(X!$H$2:$J$1000,MATCH($G271,X!$H$2:$H$1000,0),2)","v":"FOURNISSEUR 0012"},{"$f":"INDEX(X!$H$2:$J$1000,MATCH($G271,X!$H$2:$H$1000,0),3)","v":"00111111004000066"},0.2,"CARTE00810882","2017-02-22","2017-02-23","2017-02-01",7]
[null,611103,"MARCHANDISES",{"$f":"Tableachat[[#This Row],[MONTANT TTC]]/1.2","v":3805.5},{"$f":"Tableachat[[#This Row],[MONTANT TTC]]-Tableachat[[#This Row],[MONTANT HT]]","v":761.1},4566.6000000000004,1009678,{"$f":"INDEX(X!$H$2:$J$1000,MATCH($G272,X!$H$2:$H$1000,0),2)","v":"FOURNISSEUR 0031"},{"$f":"INDEX(X!$H$2:$J$1000,MATCH($G272,X!$H$2:$H$1000,0),3)","v":"00301111004000085"},0.2,"EFFET T 05690246","2017-02-28","2016-11-30","2017-02-01",5]
[null,16114633,"MARCHANDISES",{"$f":"Tableachat[[#This Row],[MONTANT TTC]]/1.2","v":9951.25},{"$f":"Tableachat[[#This Row],[MONTANT TTC]]-Tableachat[[#This Row],[MONTANT HT]]","v":1990.25},11941.5,1008922,{"$f":"INDEX(X!$H$2:$J$1000,MATCH($G273,X!$H$2:$H$1000,0),2)","v":"FOURNISSEUR 0019"},{"$f":"INDEX(X!$H$2:$J$1000,MATCH($G273,X!$H$2:$H$1000,0),3)","v":"00181111004000073"},0.2,"EFFET T 05994607","2017-02-28","2016-11-30","2017-02-01",5]
[null,"FA/16/12/0186","MARCHANDISES",771.85,154.37,926.22,1009741,{"$f":"INDEX(X!$H$2:$J$1000,MATCH($G274,X!$H$2:$H$1000,0),2)","v":"FOURNISSEUR 0032"},{"$f":"INDEX(X!$H$2:$J$1000,MATCH($G274,X!$H$2:$H$1000,0),3)","v":"00311111004000086"},0.2,"EFFET T  5690247","2017-03-01","2016-12-31","2017-03-01",5]
[null,"51/2017","IMMOBILISATION",2084,416.8,2500.8000000000002,1009489,{"$f":"INDEX(X!$H$2:$J$1000,MATCH($G275,X!$H$2:$H$1000,0),2)","v":"FOURNISSEUR 0028"},{"$f":"INDEX(X!$H$2:$J$1000,MATCH($G275,X!$H$2:$H$1000,0),3)","v":"00271111004000082"},0.2,"CHQ 4949593","2017-03-01","2017-01-31","2017-03-01",2]
[null,"AV16000301","MARCHANDISES",-1904.17,-380.83,-2285,1008922,{"$f":"INDEX(X!$H$2:$J$1000,MATCH($G276,X!$H$2:$H$1000,0),2)","v":"FOURNISSEUR 0019"},{"$f":"INDEX(X!$H$2:$J$1000,MATCH($G276,X!$H$2:$H$1000,0),3)","v":"00181111004000073"},0.2,"EFFET T  5994608","2017-03-30","2016-12-14","2017-03-01",5]
[null,"FA 16125180","MARCHANDISES",13289.17,2657.83,15947,1008922,{"$f":"INDEX(X!$H$2:$J$1000,MATCH($G277,X!$H$2:$H$1000,0),2)","v":"FOURNISSEUR 0019"},{"$f":"INDEX(X!$H$2:$J$1000,MATCH($G277,X!$H$2:$H$1000,0),3)","v":"00181111004000073"},0.2,"EFFET T  5994608","2017-03-30","2016-12-31","2017-03-01",5]
[null,"FA 16125181","MARCHANDISES",14964.17,2992.83,17957,1008922,{"$f":"INDEX(X!$H$2:$J$1000,MATCH($G278,X!$H$2:$H$1000,0),2)","v":"FOURNISSEUR 0019"},{"$f":"INDEX(X!$H$2:$J$1000,MATCH($G278,X!$H$2:$H$1000,0),3)","v":"00181111004000073"},0.2,"EFFET T  5994608","2017-03-30","2016-12-31","2017-03-01",5]
[null,"RELEVE MOIS 01/16","OP DE BANQUE",{"$f":"E279/0.1","v":6},0.6,{"$f":"Tableachat[[#This Row],[MONTANT HT]]+Tableachat[[#This Row],[TVA]]","v":6.6},1008229,{"$f":"INDEX(X!$H$2:$J$1000,MATCH($G279,X!$H$2:$H$1000,0),2)","v":"FOURNISSEUR 0008"},{"$f":"INDEX(X!$H$2:$J$1000,MATCH($G279,X!$H$2:$H$1000,0),3)","v":"00071111004000062"},0.1,"PRELEVEMENT","2016-01-15","2016-01-15","2017-04-01",3]
[null,"AVOIR110","MARCHANDISES",-100,-20,-120,1009678,{"$f":"INDEX(X!$H$2:$J$1000,MATCH($G280,X!$H$2:$H$1000,0),2)","v":"FOURNISSEUR 0031"},{"$f":"INDEX(X!$H$2:$J$1000,MATCH($G280,X!$H$2:$H$1000,0),3)","v":"00301111004000085"},0.2,"EFFET T  5483858","2016-02-01","2015-10-30","2017-04-01",5]
[null,"FF12016050659","ELECTRICITE",{"$f":"E281/0.14","v":53.5},7.49,{"$f":"Tableachat[[#This Row],[MONTANT HT]]+Tableachat[[#This Row],[TVA]]","v":60.99},1008040,{"$f":"INDEX(X!$H$2:$J$1000,MATCH($G281,X!$H$2:$H$1000,0),2)","v":"FOURNISSEUR 0005"},{"$f":"INDEX(X!$H$2:$J$1000,MATCH($G281,X!$H$2:$H$1000,0),3)","v":"00041111004000059"},0.14000000000000001,"CHQ 4386150","2016-02-17","2016-01-01","2017-04-01",2]
[null,"FF22016050659","ELECTRICITE",{"$f":"E282/0.14","v":48.36},6.77,{"$f":"Tableachat[[#This Row],[MONTANT HT]]+Tableachat[[#This Row],[TVA]]","v":55.13},1008040,{"$f":"INDEX(X!$H$2:$J$1000,MATCH($G282,X!$H$2:$H$1000,0),2)","v":"FOURNISSEUR 0005"},{"$f":"INDEX(X!$H$2:$J$1000,MATCH($G282,X!$H$2:$H$1000,0),3)","v":"00041111004000059"},0.14000000000000001,"CHQ 4386150","2016-02-17","2016-02-01","2017-04-01",2]
[null,"RELEVE MOIS 03/16","OP DE BANQUE",{"$f":"E283/0.1","v":10},1,{"$f":"Tableachat[[#This Row],[MONTANT HT]]+Tableachat[[#This Row],[TVA]]","v":11},1008229,{"$f":"INDEX(X!$H$2:$J$1000,MATCH($G283,X!$H$2:$H$1000,0),2)","v":"FOURNISSEUR 0008"},{"$f":"INDEX(X!$H$2:$J$1000,MATCH($G283,X!$H$2:$H$1000,0),3)","v":"00071111004000062"},0.1,"PRELEVEMENT","2016-03-02","2016-03-02","2017-04-01",3]
[null,"644956022016","PRES DE SERVICES",169,33.799999999999997,202.8,1009300,{"$f":"INDEX(X!$H$2:$J$1000,MATCH($G284,X!$H$2:$H$1000,0),2)","v":"FOURNISSEUR 0025"},{"$f":"INDEX(X!$H$2:$J$1000,MATCH($G284,X!$H$2:$H$1000,0),3)","v":"00241111004000079"},0.2,"CHQ 4386153","2016-03-16","2016-02-10","2017-04-01",2]
[null,"RELEVE MOIS 03/16","OP DE BANQUE",{"$f":"E285/0.1","v":10},1,{"$f":"Tableachat[[#This Row],[MONTANT HT]]+Tableachat[[#This Row],[TVA]]","v":11},1008229,{"$f":"INDEX(X!$H$2:$J$1000,MATCH($G285,X!$H$2:$H$1000,0),2)","v":"FOURNISSEUR 0008"},{"$f":"INDEX(X!$H$2:$J$1000,MATCH($G285,X!$H$2:$H$1000,0),3)","v":"00071111004000062"},0.1,"PRELEVEMENT","2016-03-25","2016-03-25","2017-04-01",3]
[null,"760996022016","PRES DE SERVICES",169,33.799999999999997,202.8,1009300,{"$f":"INDEX(X!$H$2:$J$1000,MATCH($G286,X!$H$2:$H$1000,0),2)","v":"FOURNISSEUR 0025"},{"$f":"INDEX(X!$H$2:$J$1000,MATCH($G286,X!$H$2:$H$1000,0),3)","v":"00241111004000079"},0.2,"CHQ 4386154","2016-04-11","2016-01-01","2017-04-01",2]
[null,"760997022016","PRES DE SERVICES",82.5,16.5,99,1009300,{"$f":"INDEX(X!$H$2:$J$1000,MATCH($G287,X!$H$2:$H$1000,0),2)","v":"FOURNISSEUR 0025"},{"$f":"INDEX(X!$H$2:$J$1000,MATCH($G287,X!$H$2:$H$1000,0),3)","v":"00241111004000079"},0.2,"CHQ 4386154","2016-04-11","2016-01-01","2017-04-01",2]
[null,"464381032016","PRES DE SERVICES",169,33.799999999999997,202.8,1009300,{"$f":"INDEX(X!$H$2:$J$1000,MATCH($G288,X!$H$2:$H$1000,0),2)","v":"FOURNISSEUR 0025"},{"$f":"INDEX(X!$H$2:$J$1000,MATCH($G288,X!$H$2:$H$1000,0),3)","v":"00241111004000079"},0.2,"CHQ 4386154","2016-04-11","2016-02-01","2017-04-01",2]
[null,"464382032016","PRES DE SERVICES",82.5,16.5,99,1009300,{"$f":"INDEX(X!$H$2:$J$1000,MATCH($G289,X!$H$2:$H$1000,0),2)","v":"FOURNISSEUR 0025"},{"$f":"INDEX(X!$H$2:$J$1000,MATCH($G289,X!$H$2:$H$1000,0),3)","v":"00241111004000079"},0.2,"CHQ 4386154","2016-04-11","2016-02-01","2017-04-01",2]
[null,"576172032016","PRES DE SERVICES",189.85,37.97,227.82,1009300,{"$f":"INDEX(X!$H$2:$J$1000,MATCH($G290,X!$H$2:$H$1000,0),2)","v":"FOURNISSEUR 0025"},{"$f":"INDEX(X!$H$2:$J$1000,MATCH($G290,X!$H$2:$H$1000,0),3)","v":"00241111004000079"},0.2,"CHQ 4386154","2016-04-11","2016-03-11","2017-04-01",2]
[null,"RELEVE MOIS 05/16","OP DE BANQUE",{"$f":"E291/0.1","v":30},3,{"$f":"Tableachat[[#This Row],[MONTANT HT]]+Tableachat[[#This Row],[TVA]]","v":33},1008229,{"$f":"INDEX(X!$H$2:$J$1000,MATCH($G291,X!$H$2:$H$1000,0),2)","v":"FOURNISSEUR 0008"},{"$f":"INDEX(X!$H$2:$J$1000,MATCH($G291,X!$H$2:$H$1000,0),3)","v":"00071111004000062"},0.1,"PRELEVEMENT","2016-05-10","2016-05-10","2017-04-01",3]
[null,"522815042016","PRES DE SERVICES",169,33.799999999999997,202.8,1009300,{"$f":"INDEX(X!$H$2:$J$1000,MATCH($G292,X!$H$2:$H$1000,0),2)","v":"FOURNISSEUR 0025"},{"$f":"INDEX(X!$H$2:$J$1000,MATCH($G292,X!$H$2:$H$1000,0),3)","v":"00241111004000079"},0.2,"CARTE","2016-05-16","2016-04-11","2017-04-01",7]
[null,"763164042016","PRES DE SERVICES",169,33.799999999999997,202.8,1009300,{"$f":"INDEX(X!$H$2:$J$1000,MATCH($G293,X!$H$2:$H$1000,0),2)","v":"FOURNISSEUR 0025"},{"$f":"INDEX(X!$H$2:$J$1000,MATCH($G293,X!$H$2:$H$1000,0),3)","v":"00241111004000079"},0.2,"CHQ 4949582","2016-06-10","2016-03-01","2017-04-01",2]
[null,"763165042016","PRES DE SERVICES",82.5,16.5,99,1009300,{"$f":"INDEX(X!$H$2:$J$1000,MATCH($G294,X!$H$2:$H$1000,0),2)","v":"FOURNISSEUR 0025"},{"$f":"INDEX(X!$H$2:$J$1000,MATCH($G294,X!$H$2:$H$1000,0),3)","v":"00241111004000079"},0.2,"CHQ 4949582","2016-06-10","2016-03-01","2017-04-01",2]
[null,"758173052016","PRES DE SERVICES",169,33.799999999999997,202.8,1009300,{"$f":"INDEX(X!$H$2:$J$1000,MATCH($G295,X!$H$2:$H$1000,0),2)","v":"FOURNISSEUR 0025"},{"$f":"INDEX(X!$H$2:$J$1000,MATCH($G295,X!$H$2:$H$1000,0),3)","v":"00241111004000079"},0.2,"CHQ 4949582","2016-06-10","2016-04-01","2017-04-01",2]
[null,"758174052016","PRES DE SERVICES",82.5,16.5,99,1009300,{"$f":"INDEX(X!$H$2:$J$1000,MATCH($G296,X!$H$2:$H$1000,0),2)","v":"FOURNISSEUR 0025"},{"$f":"INDEX(X!$H$2:$J$1000,MATCH($G296,X!$H$2:$H$1000,0),3)","v":"00241111004000079"},0.2,"CHQ 4949582","2016-06-10","2016-04-01","2017-04-01",2]
[null,"538393062016","PRES DE SERVICES",82.5,16.5,99,1009300,{"$f":"INDEX(X!$H$2:$J$1000,MATCH($G297,X!$H$2:$H$1000,0),2)","v":"FOURNISSEUR 0025"},{"$f":"INDEX(X!$H$2:$J$1000,MATCH($G297,X!$H$2:$H$1000,0),3)","v":"00241111004000079"},0.2,"CHQ 4949582","2016-06-10","2016-06-09","2017-04-01",2]
[null,"562028072016","PRES DE SERVICES",82.5,16.5,99,1009300,{"$f":"INDEX(X!$H$2:$J$1000,MATCH($G298,X!$H$2:$H$1000,0),2)","v":"FOURNISSEUR 0025"},{"$f":"INDEX(X!$H$2:$J$1000,MATCH($G298,X!$H$2:$H$1000,0),3)","v":"00241111004000079"},0.2,"CHQ 4949586","2016-06-10","2016-07-10","2017-04-01",2]
[null,"FF32060506599","ELECTRICITE",{"$f":"E299/0.14","v":43.21},6.05,{"$f":"Tableachat[[#This Row],[MONTANT HT]]+Tableachat[[#This Row],[TVA]]","v":49.26},1008040,{"$f":"INDEX(X!$H$2:$J$1000,MATCH($G299,X!$H$2:$H$1000,0),2)","v":"FOURNISSEUR 0005"},{"$f":"INDEX(X!$H$2:$J$1000,MATCH($G299,X!$H$2:$H$1000,0),3)","v":"00041111004000059"},0.14000000000000001,"CHQ 4949583","2016-07-14","2016-03-01","2017-04-01",2]
[null,"F420160560599","ELECTRICITE",{"$f":"E300/0.14","v":44.57},6.24,{"$f":"Tableachat[[#This Row],[MONTANT HT]]+Tableachat[[#This Row],[TVA]]","v":50.81},1008040,{"$f":"INDEX(X!$H$2:$J$1000,MATCH($G300,X!$H$2:$H$1000,0),2)","v":"FOURNISSEUR 0005"},{"$f":"INDEX(X!$H$2:$J$1000,MATCH($G300,X!$H$2:$H$1000,0),3)","v":"00041111004000059"},0.14000000000000001,"CHQ 4949583","2016-07-14","2016-04-01","2017-04-01",2]
[null,"F520160506599","ELECTRICITE",{"$f":"E301/0.14","v":50.93},7.13,{"$f":"Tableachat[[#This Row],[MONTANT HT]]+Tableachat[[#This Row],[TVA]]","v":58.06},1008040,{"$f":"INDEX(X!$H$2:$J$1000,MATCH($G301,X!$H$2:$H$1000,0),2)","v":"FOURNISSEUR 0005"},{"$f":"INDEX(X!$H$2:$J$1000,MATCH($G301,X!$H$2:$H$1000,0),3)","v":"00041111004000059"},0.14000000000000001,"CHQ 4949583","2016-07-14","2016-05-01","2017-04-01",2]
[null,"F620160506599","ELECTRICITE",{"$f":"E302/0.14","v":35.57},4.9800000000000004,{"$f":"Tableachat[[#This Row],[MONTANT HT]]+Tableachat[[#This Row],[TVA]]","v":40.549999999999997},1008040,{"$f":"INDEX(X!$H$2:$J$1000,MATCH($G302,X!$H$2:$H$1000,0),2)","v":"FOURNISSEUR 0005"},{"$f":"INDEX(X!$H$2:$J$1000,MATCH($G302,X!$H$2:$H$1000,0),3)","v":"00041111004000059"},0.14000000000000001,"CHQ 4949583","2016-07-14","2016-06-01","2017-04-01",2]
[null,"F720160506599","ELECTRICITE",{"$f":"E303/0.14","v":39.43},5.52,{"$f":"Tableachat[[#This Row],[MONTANT HT]]+Tableachat[[#This Row],[TVA]]","v":44.95},1008040,{"$f":"INDEX(X!$H$2:$J$1000,MATCH($G303,X!$H$2:$H$1000,0),2)","v":"FOURNISSEUR 0005"},{"$f":"INDEX(X!$H$2:$J$1000,MATCH($G303,X!$H$2:$H$1000,0),3)","v":"00041111004000059"},0.14000000000000001,"CHQ 4949583","2016-07-14","2016-07-01","2017-04-01",2]
[null,"83711062016","PRES DE SERVICES",169,33.799999999999997,202.8,1009300,{"$f":"INDEX(X!$H$2:$J$1000,MATCH($G304,X!$H$2:$H$1000,0),2)","v":"FOURNISSEUR 0025"},{"$f":"INDEX(X!$H$2:$J$1000,MATCH($G304,X!$H$2:$H$1000,0),3)","v":"00241111004000079"},0.2,"CHQ 4949586","2016-08-12","2016-05-01","2017-04-01",2]
[null,"83712062016","PRES DE SERVICES",82.5,16.5,99,1009300,{"$f":"INDEX(X!$H$2:$J$1000,MATCH($G305,X!$H$2:$H$1000,0),2)","v":"FOURNISSEUR 0025"},{"$f":"INDEX(X!$H$2:$J$1000,MATCH($G305,X!$H$2:$H$1000,0),3)","v":"00241111004000079"},0.2,"CHQ 4949586","2016-08-12","2016-05-01","2017-04-01",2]
[null,"812419072016","PRES DE SERVICES",169,33.799999999999997,202.8,1009300,{"$f":"INDEX(X!$H$2:$J$1000,MATCH($G306,X!$H$2:$H$1000,0),2)","v":"FOURNISSEUR 0025"},{"$f":"INDEX(X!$H$2:$J$1000,MATCH($G306,X!$H$2:$H$1000,0),3)","v":"00241111004000079"},0.2,"CHQ 4949586","2016-08-12","2016-06-01","2017-04-01",2]
[null,"812420072016","PRES DE SERVICES",82.5,16.5,99,1009300,{"$f":"INDEX(X!$H$2:$J$1000,MATCH($G307,X!$H$2:$H$1000,0),2)","v":"FOURNISSEUR 0025"},{"$f":"INDEX(X!$H$2:$J$1000,MATCH($G307,X!$H$2:$H$1000,0),3)","v":"00241111004000079"},0.2,"CHQ 4949586","2016-08-12","2016-06-01","2017-04-01",2]
[null,"1139750082016","PRES DE SERVICES",169,33.799999999999997,202.8,1009300,{"$f":"INDEX(X!$H$2:$J$1000,MATCH($G308,X!$H$2:$H$1000,0),2)","v":"FOURNISSEUR 0025"},{"$f":"INDEX(X!$H$2:$J$1000,MATCH($G308,X!$H$2:$H$1000,0),3)","v":"00241111004000079"},0.2,"CHQ 4949588","2016-10-06","2016-07-01","2017-04-01",2]
[null,"1139751082016","PRES DE SERVICES",82.5,16.5,99,1009300,{"$f":"INDEX(X!$H$2:$J$1000,MATCH($G309,X!$H$2:$H$1000,0),2)","v":"FOURNISSEUR 0025"},{"$f":"INDEX(X!$H$2:$J$1000,MATCH($G309,X!$H$2:$H$1000,0),3)","v":"00241111004000079"},0.2,"CHQ 4949588","2016-10-06","2016-07-01","2017-04-01",2]
[null,"798655092016","PRES DE SERVICES",169,33.799999999999997,202.8,1009300,{"$f":"INDEX(X!$H$2:$J$1000,MATCH($G310,X!$H$2:$H$1000,0),2)","v":"FOURNISSEUR 0025"},{"$f":"INDEX(X!$H$2:$J$1000,MATCH($G310,X!$H$2:$H$1000,0),3)","v":"00241111004000079"},0.2,"CHQ 4949588","2016-10-06","2016-08-01","2017-04-01",2]
[null,"798656092016","PRES DE SERVICES",82.5,16.5,99,1009300,{"$f":"INDEX(X!$H$2:$J$1000,MATCH($G311,X!$H$2:$H$1000,0),2)","v":"FOURNISSEUR 0025"},{"$f":"INDEX(X!$H$2:$J$1000,MATCH($G311,X!$H$2:$H$1000,0),3)","v":"00241111004000079"},0.2,"CHQ 4949588","2016-10-06","2016-08-01","2017-04-01",2]
[null,"633409082016","PRES DE SERVICES",99.15,19.829999999999998,118.98,1009300,{"$f":"INDEX(X!$H$2:$J$1000,MATCH($G312,X!$H$2:$H$1000,0),2)","v":"FOURNISSEUR 0025"},{"$f":"INDEX(X!$H$2:$J$1000,MATCH($G312,X!$H$2:$H$1000,0),3)","v":"00241111004000079"},0.2,"CHQ 4949588","2016-10-06","2016-08-12","2017-04-01",2]
[null,"592364092016","PRES DE SERVICES",82.5,16.5,99,1009300,{"$f":"INDEX(X!$H$2:$J$1000,MATCH($G313,X!$H$2:$H$1000,0),2)","v":"FOURNISSEUR 0025"},{"$f":"INDEX(X!$H$2:$J$1000,MATCH($G313,X!$H$2:$H$1000,0),3)","v":"00241111004000079"},0.2,"CHQ 4949588","2016-10-06","2016-09-10","2017-04-01",2]
[null,"790243102016","PRES DE SERVICES",169,33.799999999999997,202.8,1009300,{"$f":"INDEX(X!$H$2:$J$1000,MATCH($G314,X!$H$2:$H$1000,0),2)","v":"FOURNISSEUR 0025"},{"$f":"INDEX(X!$H$2:$J$1000,MATCH($G314,X!$H$2:$H$1000,0),3)","v":"00241111004000079"},0.2,"CHQ 4949591","2016-12-07","2016-09-01","2017-04-01",2]
[null,"790244102016","PRES DE SERVICES",82.5,16.5,99,1009300,{"$f":"INDEX(X!$H$2:$J$1000,MATCH($G315,X!$H$2:$H$1000,0),2)","v":"FOURNISSEUR 0025"},{"$f":"INDEX(X!$H$2:$J$1000,MATCH($G315,X!$H$2:$H$1000,0),3)","v":"00241111004000079"},0.2,"CHQ 4949591","2016-12-07","2016-09-01","2017-04-01",2]
[null,"794378112016","PRES DE SERVICES",169,33.799999999999997,202.8,1009300,{"$f":"INDEX(X!$H$2:$J$1000,MATCH($G316,X!$H$2:$H$1000,0),2)","v":"FOURNISSEUR 0025"},{"$f":"INDEX(X!$H$2:$J$1000,MATCH($G316,X!$H$2:$H$1000,0),3)","v":"00241111004000079"},0.2,"CHQ 4949591","2016-12-07","2016-10-01","2017-04-01",2]
[null,"794379112016","PRES DE SERVICES",82.5,16.5,99,1009300,{"$f":"INDEX(X!$H$2:$J$1000,MATCH($G317,X!$H$2:$H$1000,0),2)","v":"FOURNISSEUR 0025"},{"$f":"INDEX(X!$H$2:$J$1000,MATCH($G317,X!$H$2:$H$1000,0),3)","v":"00241111004000079"},0.2,"CHQ 4949591","2016-12-07","2016-10-01","2017-04-01",2]
[null,"671145102016","PRES DE SERVICES",82.5,16.5,99,1009300,{"$f":"INDEX(X!$H$2:$J$1000,MATCH($G318,X!$H$2:$H$1000,0),2)","v":"FOURNISSEUR 0025"},{"$f":"INDEX(X!$H$2:$J$1000,MATCH($G318,X!$H$2:$H$1000,0),3)","v":"00241111004000079"},0.2,"CHQ 4949591","2016-12-07","2016-10-12","2017-04-01",2]
[null,"908843112016","PRES DE SERVICES",82.5,16.5,99,1009300,{"$f":"INDEX(X!$H$2:$J$1000,MATCH($G319,X!$H$2:$H$1000,0),2)","v":"FOURNISSEUR 0025"},{"$f":"INDEX(X!$H$2:$J$1000,MATCH($G319,X!$H$2:$H$1000,0),3)","v":"00241111004000079"},0.2,"CHQ 4949591","2016-12-07","2016-11-11","2017-04-01",2]
[null,"788625122016","PRES DE SERVICES",169,33.799999999999997,202.8,1009300,{"$f":"INDEX(X!$H$2:$J$1000,MATCH($G320,X!$H$2:$H$1000,0),2)","v":"FOURNISSEUR 0025"},{"$f":"INDEX(X!$H$2:$J$1000,MATCH($G320,X!$H$2:$H$1000,0),3)","v":"00241111004000079"},0.2,"CHQ 4949598","2017-01-23","2016-11-01","2017-04-01",2]
[null,"788626122016","PRES DE SERVICES",82.5,16.5,99,1009300,{"$f":"INDEX(X!$H$2:$J$1000,MATCH($G321,X!$H$2:$H$1000,0),2)","v":"FOURNISSEUR 0025"},{"$f":"INDEX(X!$H$2:$J$1000,MATCH($G321,X!$H$2:$H$1000,0),3)","v":"00241111004000079"},0.2,"CHQ 4949598","2017-01-23","2016-11-01","2017-04-01",2]
[null,"600767122016","PRES DE SERVICES",82.5,16.5,99,1009300,{"$f":"INDEX(X!$H$2:$J$1000,MATCH($G322,X!$H$2:$H$1000,0),2)","v":"FOURNISSEUR 0025"},{"$f":"INDEX(X!$H$2:$J$1000,MATCH($G322,X!$H$2:$H$1000,0),3)","v":"00241111004000079"},0.2,"CHQ 4949598","2017-01-23","2016-12-10","2017-04-01",2]
[null,"109182012017","PRES DE SERVICES",82.5,16.5,99,1009300,{"$f":"INDEX(X!$H$2:$J$1000,MATCH($G323,X!$H$2:$H$1000,0),2)","v":"FOURNISSEUR 0025"},{"$f":"INDEX(X!$H$2:$J$1000,MATCH($G323,X!$H$2:$H$1000,0),3)","v":"00241111004000079"},0.2,"CHQ 4949598","2017-01-23","2016-12-31","2017-04-01",2]
[null,"F112016050659","ELECTRICITE",{"$f":"E324/0.14","v":58.64},8.2100000000000009,{"$f":"Tableachat[[#This Row],[MONTANT HT]]+Tableachat[[#This Row],[TVA]]","v":66.849999999999994},1008040,{"$f":"INDEX(X!$H$2:$J$1000,MATCH($G324,X!$H$2:$H$1000,0),2)","v":"FOURNISSEUR 0005"},{"$f":"INDEX(X!$H$2:$J$1000,MATCH($G324,X!$H$2:$H$1000,0),3)","v":"00041111004000059"},0.14000000000000001,"ESPECES","2017-03-04","2016-11-01","2017-04-01",1]
[null,"1220160506599","ELECTRICITE",{"$f":"E325/0.14","v":57.36},8.0299999999999994,{"$f":"Tableachat[[#This Row],[MONTANT HT]]+Tableachat[[#This Row],[TVA]]","v":65.39},1008040,{"$f":"INDEX(X!$H$2:$J$1000,MATCH($G325,X!$H$2:$H$1000,0),2)","v":"FOURNISSEUR 0005"},{"$f":"INDEX(X!$H$2:$J$1000,MATCH($G325,X!$H$2:$H$1000,0),3)","v":"00041111004000059"},0.14000000000000001,"ESPECES","2017-03-04","2016-12-30","2017-04-01",{"$f":"IF(COUNTIF(K325,\"*EF*\"),5,IF(COUNTIF(K325,\"*ES*\"),1,IF(COUNTIF(K325,\"*CH*\"),2,IF(COUNTIF(K325,\"*PR*\"),3,IF(COUNTIF(K325,\"*CO*\"),6,IF(COUNTIF(K325,\"*VI*\"),4,7))))))","v":1}]
[null,"FC000324","MARCHANDISES",{"$f":"Tableachat[[#This Row],[MONTANT TTC]]/(1+Tableachat[[#This Row],[TX %]])","v":6705.17},{"$f":"Tableachat[[#This Row],[MONTANT TTC]]-Tableachat[[#This Row],[MONTANT HT]]","v":1341.03},8046.2,1008922,{"$f":"INDEX(X!$H$2:$J$1000,MATCH($G326,X!$H$2:$H$1000,0),2)","v":"FOURNISSEUR 0019"},{"$f":"INDEX(X!$H$2:$J$1000,MATCH($G326,X!$H$2:$H$1000,0),3)","v":"00181111004000073"},0.2,"EFFET 5994618","2017-04-27","2017-01-31","2017-04-01",5]
[null,"FC000325","MARCHANDISES",{"$f":"Tableachat[[#This Row],[MONTANT TTC]]/(1+Tableachat[[#This Row],[TX %]])","v":8804.17},{"$f":"Tableachat[[#This Row],[MONTANT TTC]]-Tableachat[[#This Row],[MONTANT HT]]","v":1760.83},10565,1008922,{"$f":"INDEX(X!$H$2:$J$1000,MATCH($G327,X!$H$2:$H$1000,0),2)","v":"FOURNISSEUR 0019"},{"$f":"INDEX(X!$H$2:$J$1000,MATCH($G327,X!$H$2:$H$1000,0),3)","v":"00181111004000073"},0.2,"EFFET 5994618","2017-04-27","2017-01-31","2017-04-01",5]
[null,"FC000326","MARCHANDISES",{"$f":"Tableachat[[#This Row],[MONTANT TTC]]/(1+Tableachat[[#This Row],[TX %]])","v":7034.17},{"$f":"Tableachat[[#This Row],[MONTANT TTC]]-Tableachat[[#This Row],[MONTANT HT]]","v":1406.83},8441,1008922,{"$f":"INDEX(X!$H$2:$J$1000,MATCH($G328,X!$H$2:$H$1000,0),2)","v":"FOURNISSEUR 0019"},{"$f":"INDEX(X!$H$2:$J$1000,MATCH($G328,X!$H$2:$H$1000,0),3)","v":"00181111004000073"},0.2,"EFFET 5994618","2017-04-27","2017-01-31","2017-04-01",5]
[null,"FC000327","MARCHANDISES",{"$f":"Tableachat[[#This Row],[MONTANT TTC]]/(1+Tableachat[[#This Row],[TX %]])","v":5166.67},{"$f":"Tableachat[[#This Row],[MONTANT TTC]]-Tableachat[[#This Row],[MONTANT HT]]","v":1033.33},6200,1008922,{"$f":"INDEX(X!$H$2:$J$1000,MATCH($G329,X!$H$2:$H$1000,0),2)","v":"FOURNISSEUR 0019"},{"$f":"INDEX(X!$H$2:$J$1000,MATCH($G329,X!$H$2:$H$1000,0),3)","v":"00181111004000073"},0.2,"EFFET 5994618","2017-04-27","2017-01-31","2017-04-01",5]
[null,"17/01/0008","MARCHANDISES",{"$f":"Tableachat[[#This Row],[MONTANT TTC]]/(1+Tableachat[[#This Row],[TX %]])","v":2290.48},{"$f":"Tableachat[[#This Row],[MONTANT TTC]]-Tableachat[[#This Row],[MONTANT HT]]","v":458.1},2748.58,1009741,{"$f":"INDEX(X!$H$2:$J$1000,MATCH($G330,X!$H$2:$H$1000,0),2)","v":"FOURNISSEUR 0032"},{"$f":"INDEX(X!$H$2:$J$1000,MATCH($G330,X!$H$2:$H$1000,0),3)","v":"00311111004000086"},0.2,"EFFET 5994619","2017-04-28","2017-01-31","2017-04-01",5]
[null,"F820160506599","ELECTRICITE",{"$f":"E331/0.14","v":48.36},6.77,{"$f":"Tableachat[[#This Row],[MONTANT HT]]+Tableachat[[#This Row],[TVA]]","v":55.13},1008040,{"$f":"INDEX(X!$H$2:$J$1000,MATCH($G331,X!$H$2:$H$1000,0),2)","v":"FOURNISSEUR 0005"},{"$f":"INDEX(X!$H$2:$J$1000,MATCH($G331,X!$H$2:$H$1000,0),3)","v":"00041111004000059"},0.14000000000000001,"ESPECES","2017-05-04","2016-08-01","2017-04-01",1]
[null,"F920160506599","ELECTRICITE",{"$f":"E332/0.14","v":47.07},6.59,{"$f":"Tableachat[[#This Row],[MONTANT HT]]+Tableachat[[#This Row],[TVA]]","v":53.66},1008040,{"$f":"INDEX(X!$H$2:$J$1000,MATCH($G332,X!$H$2:$H$1000,0),2)","v":"FOURNISSEUR 0005"},{"$f":"INDEX(X!$H$2:$J$1000,MATCH($G332,X!$H$2:$H$1000,0),3)","v":"00041111004000059"},0.14000000000000001,"ESPECES","2017-05-04","2016-09-01","2017-04-01",1]
[null,"F102016050659","ELECTRICITE",{"$f":"E333/0.14","v":50.93},7.13,{"$f":"Tableachat[[#This Row],[MONTANT HT]]+Tableachat[[#This Row],[TVA]]","v":58.06},1008040,{"$f":"INDEX(X!$H$2:$J$1000,MATCH($G333,X!$H$2:$H$1000,0),2)","v":"FOURNISSEUR 0005"},{"$f":"INDEX(X!$H$2:$J$1000,MATCH($G333,X!$H$2:$H$1000,0),3)","v":"00041111004000059"},0.14000000000000001,"ESPECES","2017-05-04","2016-10-01","2017-04-01",1]
[null,null,null,null,null,null,null,{"$f":"INDEX(X!$H$2:$J$1000,MATCH($G334,X!$H$2:$H$1000,0),2)","v":{"$error":"#N/A"}},{"$f":"INDEX(X!$H$2:$J$1000,MATCH($G334,X!$H$2:$H$1000,0),3)","v":{"$error":"#N/A"}},null,null,null,null,null,7]
[null,null,null,null,null,null,null,{"$f":"INDEX(X!$H$2:$J$1000,MATCH($G335,X!$H$2:$H$1000,0),2)","v":{"$error":"#N/A"}},{"$f":"INDEX(X!$H$2:$J$1000,MATCH($G335,X!$H$2:$H$1000,0),3)","v":{"$error":"#N/A"}},null,null,null,null,null,7]
[null,null,null,null,null,null,null,{"$f":"INDEX(X!$H$2:$J$1000,MATCH($G336,X!$H$2:$H$1000,0),2)","v":{"$error":"#N/A"}},{"$f":"INDEX(X!$H$2:$J$1000,MATCH($G336,X!$H$2:$H$1000,0),3)","v":{"$error":"#N/A"}},null,null,null,null,null,7]
[null,null,null,null,null,null,null,{"$f":"INDEX(X!$H$2:$J$1000,MATCH($G337,X!$H$2:$H$1000,0),2)","v":{"$error":"#N/A"}},{"$f":"INDEX(X!$H$2:$J$1000,MATCH($G337,X!$H$2:$H$1000,0),3)","v":{"$error":"#N/A"}},null,null,null,null,null,7]
[null,null,null,null,null,null,null,{"$f":"INDEX(X!$H$2:$J$1000,MATCH($G338,X!$H$2:$H$1000,0),2)","v":{"$error":"#N/A"}},{"$f":"INDEX(X!$H$2:$J$1000,MATCH($G338,X!$H$2:$H$1000,0),3)","v":{"$error":"#N/A"}},null,null,null,null,null,7]
[null,null,null,null,null,null,null,{"$f":"INDEX(X!$H$2:$J$1000,MATCH($G339,X!$H$2:$H$1000,0),2)","v":{"$error":"#N/A"}},{"$f":"INDEX(X!$H$2:$J$1000,MATCH($G339,X!$H$2:$H$1000,0),3)","v":{"$error":"#N/A"}},null,null,null,null,null,7]
[null,null,null,null,null,null,null,{"$f":"INDEX(X!$H$2:$J$1000,MATCH($G340,X!$H$2:$H$1000,0),2)","v":{"$error":"#N/A"}},{"$f":"INDEX(X!$H$2:$J$1000,MATCH($G340,X!$H$2:$H$1000,0),3)","v":{"$error":"#N/A"}},null,null,null,null,null,7]
[null,null,null,null,null,null,null,{"$f":"INDEX(X!$H$2:$J$1000,MATCH($G341,X!$H$2:$H$1000,0),2)","v":{"$error":"#N/A"}},{"$f":"INDEX(X!$H$2:$J$1000,MATCH($G341,X!$H$2:$H$1000,0),3)","v":{"$error":"#N/A"}},null,null,null,null,null,7]
[null,null,null,null,null,null,null,{"$f":"INDEX(X!$H$2:$J$1000,MATCH($G342,X!$H$2:$H$1000,0),2)","v":{"$error":"#N/A"}},{"$f":"INDEX(X!$H$2:$J$1000,MATCH($G342,X!$H$2:$H$1000,0),3)","v":{"$error":"#N/A"}},null,null,null,null,null,7]
[null,null,null,null,null,null,null,{"$f":"INDEX(X!$H$2:$J$1000,MATCH($G343,X!$H$2:$H$1000,0),2)","v":{"$error":"#N/A"}},{"$f":"INDEX(X!$H$2:$J$1000,MATCH($G343,X!$H$2:$H$1000,0),3)","v":{"$error":"#N/A"}},null,null,null,null,null,7]
[null,null,null,null,null,null,null,{"$f":"INDEX(X!$H$2:$J$1000,MATCH($G344,X!$H$2:$H$1000,0),2)","v":{"$error":"#N/A"}},{"$f":"INDEX(X!$H$2:$J$1000,MATCH($G344,X!$H$2:$H$1000,0),3)","v":{"$error":"#N/A"}},null,null,null,null,null,7]
[null,null,null,null,{"$f":"Tableachat[[#This Row],[MONTANT TTC]]-Tableachat[[#This Row],[MONTANT HT]]","v":0},null,null,{"$f":"INDEX(X!$H$2:$J$1000,MATCH($G345,X!$H$2:$H$1000,0),2)","v":{"$error":"#N/A"}},{"$f":"INDEX(X!$H$2:$J$1000,MATCH($G345,X!$H$2:$H$1000,0),3)","v":{"$error":"#N/A"}},null,null,null,null,null,7]
[null,null,null,null,null,null,null,{"$f":"INDEX(X!$H$2:$J$1000,MATCH($G346,X!$H$2:$H$1000,0),2)","v":{"$error":"#N/A"}},{"$f":"INDEX(X!$H$2:$J$1000,MATCH($G346,X!$H$2:$H$1000,0),3)","v":{"$error":"#N/A"}},null,null,null,null,null,7]
[null,null,null,null,null,null,null,{"$f":"INDEX(X!$H$2:$J$1000,MATCH($G347,X!$H$2:$H$1000,0),2)","v":{"$error":"#N/A"}},{"$f":"INDEX(X!$H$2:$J$1000,MATCH($G347,X!$H$2:$H$1000,0),3)","v":{"$error":"#N/A"}},null,null,null,null,null,7]
[null,null,null,null,null,null,null,{"$f":"INDEX(X!$H$2:$J$1000,MATCH($G348,X!$H$2:$H$1000,0),2)","v":{"$error":"#N/A"}},{"$f":"INDEX(X!$H$2:$J$1000,MATCH($G348,X!$H$2:$H$1000,0),3)","v":{"$error":"#N/A"}},null,null,null,null,null,7]
[null,null,null,null,null,null,null,{"$f":"INDEX(X!$H$2:$J$1000,MATCH($G349,X!$H$2:$H$1000,0),2)","v":{"$error":"#N/A"}},{"$f":"INDEX(X!$H$2:$J$1000,MATCH($G349,X!$H$2:$H$1000,0),3)","v":{"$error":"#N/A"}},null,null,null,null,null,7]
[null,null,null,null,null,null,null,{"$f":"INDEX(X!$H$2:$J$1000,MATCH($G350,X!$H$2:$H$1000,0),2)","v":{"$error":"#N/A"}},{"$f":"INDEX(X!$H$2:$J$1000,MATCH($G350,X!$H$2:$H$1000,0),3)","v":{"$error":"#N/A"}},null,null,null,null,null,7]
[null,null,null,null,null,null,null,{"$f":"INDEX(X!$H$2:$J$1000,MATCH($G351,X!$H$2:$H$1000,0),2)","v":{"$error":"#N/A"}},{"$f":"INDEX(X!$H$2:$J$1000,MATCH($G351,X!$H$2:$H$1000,0),3)","v":{"$error":"#N/A"}},null,null,null,null,null,7]
[null,null,null,null,null,null,null,{"$f":"INDEX(X!$H$2:$J$1000,MATCH($G352,X!$H$2:$H$1000,0),2)","v":{"$error":"#N/A"}},{"$f":"INDEX(X!$H$2:$J$1000,MATCH($G352,X!$H$2:$H$1000,0),3)","v":{"$error":"#N/A"}},null,null,null,null,null,7]
[null,null,null,null,null,null,null,{"$f":"INDEX(X!$H$2:$J$1000,MATCH($G353,X!$H$2:$H$1000,0),2)","v":{"$error":"#N/A"}},{"$f":"INDEX(X!$H$2:$J$1000,MATCH($G353,X!$H$2:$H$1000,0),3)","v":{"$error":"#N/A"}},null,null,null,null,null,7]
[null,null,null,null,null,null,null,{"$f":"INDEX(X!$H$2:$J$1000,MATCH($G354,X!$H$2:$H$1000,0),2)","v":{"$error":"#N/A"}},{"$f":"INDEX(X!$H$2:$J$1000,MATCH($G354,X!$H$2:$H$1000,0),3)","v":{"$error":"#N/A"}},null,null,null,null,null,7]

{"sheet":"RECAP","index":2,"n_rows":62,"n_cols":30,"rows_kept":62,"cut":false,"hidden":false,"merged":[[24,20,24,22],[25,20,25,21],[1,0,1,17],[22,0,22,17],[24,0,24,3],[25,2,26,3],[24,6,24,8],[25,6,25,7],[24,11,24,14],[25,9,25,10],[41,9,41,10],[42,9,42,10],[43,9,43,10],[44,9,44,10],[46,5,46,6],[41,5,41,6],[42,5,42,6],[43,5,43,6],[44,5,44,6],[45,5,45,6],[37,9,37,10],[38,9,38,10],[39,9,39,10],[40,9,40,10],[30,2,30,3],[31,2,31,3],[49,5,49,6],[50,5,50,6],[25,0,25,1],[47,5,47,6],[48,5,48,6],[39,5,39,6],[40,5,40,6],[32,2,32,3],[33,2,33,3],[27,2,27,3],[28,2,28,3],[29,2,29,3],[34,2,34,3],[37,5,37,6],[38,5,38,6],[37,0,37,4],[58,9,58,10],[59,9,59,10],[60,9,60,10],[61,9,61,10],[45,9,45,10],[46,9,46,10],[47,9,47,10],[48,9,48,10],[49,9,49,10],[50,9,50,10],[51,9,51,10],[52,9,52,10],[53,9,53,10],[55,9,55,10],[56,9,56,10],[57,9,57,10],[58,5,58,6],[59,5,59,6],[60,5,60,6],[61,5,61,6],[51,5,51,6],[52,5,52,6],[53,5,53,6],[55,5,55,6],[56,5,56,6],[57,5,57,6]]}
[]
[{"$f":"\"TABLEAU DEDUCTION TVA ANNEE\"&\" \"&YEAR(A6)","v":"TABLEAU DEDUCTION TVA ANNEE 2016"}]
[1,2,3,4,5,6,7,8,9,10,11,12,13,14,15,16,17,18]
["Mois Décl","Vente HT","Tva Vente 7%","Tva Vente 10%","Tva Vente 14%","Tva Vente 30%","Tva Vente 20%","Pres serv 20%","Transp 14% ","Op Bq 10%","March 20%","Services 7%","Elect 14%","Immob 20%","Total TVA Mois Achat","Crédit Préc","Total Ded Mois","Mt Tva a declare",null,"Années","Montant Crédit TVA"]
[{"$f":"\"Report Crédit Tva\" &\" \"&YEAR(A6-1)","v":"Report Crédit Tva 2015"},null,null,null,null,null,null,null,null,null,null,null,null,null,null,null,null,{"$f":"VLOOKUP(Tableau4[[#This Row],[Mois Décl]],T5:U10,2)","v":-5535.27},null,{"$f":"\"Report Crédit Tva\"&\" \"&YEAR(X!$F$2)-1","v":"Report Crédit Tva 2015"},-5535.27]
[{"$f":"VENTE!F2","v":"2016-01-01"},{"$f":"SUMIFS(VENTE!$D$4:$D$74974,VENTE!$J$4:$J$74974,A6)","v":64359.6},{"$f":"SUMIFS(VENTE!$F$4:$F$14982,VENTE!$E$4:$E$14982,\"0,07\",VENTE!$J$4:$J$14982,Tableau4[[#This Row],[Mois Décl]])","v":0},{"$f":"SUMIFS(VENTE!$F$4:$F$14982,VENTE!$E$4:$E$14982,\"0,10\",VENTE!$J$4:$J$14982,A6)","v":0},{"$f":"SUMIFS(VENTE!$F$4:$F$14982,VENTE!$E$4:$E$14982,\"0,14\",VENTE!$J$4:$J$14982,A6)","v":0},{"$f":"SUMIFS(VENTE!$F$4:$F$14982,VENTE!$E$4:$E$14982,\"0,30\",VENTE!$J$4:$J$14982,A6)","v":0},{"$f":"ROUNDUP(Tableau4[[#This Row],[Vente HT]],-1)*0.2","v":12872},{"$f":"SUMIFS(ACHAT!$E$5:$E$34826,ACHAT!$C$5:$C$34826,XML!$I$2,ACHAT!$N$5:$N$34826,A6,ACHAT!$J$5:$J$34826,XML!$J$2)","v":0},{"$f":"SUMIFS(ACHAT!$E$5:$E$34826,ACHAT!$C$5:$C$34826,XML!$I$4,ACHAT!$N$5:$N$34826,A6,ACHAT!$J$5:$J$34826,XML!$J$4)","v":0},{"$f":"SUMIFS(ACHAT!$E$5:$E$34826,ACHAT!$C$5:$C$34826,XML!$I$3,ACHAT!$N$5:$N$34826,A6,ACHAT!$J$5:$J$34826,XML!$J$3)","v":0},{"$f":"SUMIFS(ACHAT!$E$5:$E$34826,ACHAT!$C$5:$C$34826,XML!$I$8,ACHAT!$N$5:$N$34826,A6,ACHAT!$J$5:$J$34826,XML!$J$8)","v":7927.07},{"$f":"SUMIFS(ACHAT!$E$5:$E$34826,ACHAT!$C$5:$C$34826,XML!$I$5,ACHAT!$N$5:$N$34826,A6,ACHAT!$J$5:$J$34826,XML!$J$5)","v":0},{"$f":"SUMIFS(ACHAT!$E$5:$E$34826,ACHAT!$C$5:$C$34826,XML!$I$6,ACHAT!$N$5:$N$34826,A6,ACHAT!$J$5:$J$34826,XML!$J$6)","v":0},{"$f":"SUMIFS(ACHAT!$E$5:$E$34826,ACHAT!$C$5:$C$34826,XML!$I$7,ACHAT!$N$5:$N$34826,A6,ACHAT!$J$5:$J$34826,XML!$J$7)","v":0},{"$f":"H6+I6+J6+K6+L6+N6","v":7927.07},{"$f":"IF(R5>=0,0,OFFSET(A1,4,17))","v":-5535.27},{"$f":"O6-P6","v":13462.34},{"$f":"G6-Q6","v":-590.34},null,{"$f":"\"Report Crédit Tva\"&\" \"&YEAR(X!$F$2)","v":"Report Crédit Tva 2016"},0,null,null,null,null,null,null,null,7.0000000000000007E-2,"EAU "]
[{"$f":"EDATE(A6,1)","v":"2016-02-01"},{"$f":"SUMIFS(VENTE!$D$4:$D$74974,VENTE!$J$4:$J$74974,A7)","v":54222.84},{"$f":"SUMIFS(VENTE!$F$4:$F$14982,VENTE!$E$4:$E$14982,\"0,07\",VENTE!$J$4:$J$14982,Tableau4[[#This Row],[Mois Décl]])","v":0},{"$f":"SUMIFS(VENTE!$F$4:$F$14982,VENTE!$E$4:$E$14982,\"0,10\",VENTE!$J$4:$J$14982,A7)","v":0},{"$f":"SUMIFS(VENTE!$F$4:$F$14982,VENTE!$E$4:$E$14982,\"0,14\",VENTE!$J$4:$J$14982,A7)","v":0},{"$f":"SUMIFS(VENTE!$F$4:$F$14982,VENTE!$E$4:$E$14982,\"0,30\",VENTE!$J$4:$J$14982,A7)","v":0},{"$f":"ROUNDUP(Tableau4[[#This Row],[Vente HT]],-1)*0.2","v":10846},{"$f":"SUMIFS(ACHAT!$E$5:$E$34826,ACHAT!$C$5:$C$34826,XML!$I$2,ACHAT!$N$5:$N$34826,A7,ACHAT!$J$5:$J$34826,XML!$J$2)","v":0},{"$f":"SUMIFS(ACHAT!$E$5:$E$34826,ACHAT!$C$5:$C$34826,XML!$I$4,ACHAT!$N$5:$N$34826,A7,ACHAT!$J$5:$J$34826,XML!$J$4)","v":0},{"$f":"SUMIFS(ACHAT!$E$5:$E$34826,ACHAT!$C$5:$C$34826,XML!$I$3,ACHAT!$N$5:$N$34826,A7,ACHAT!$J$5:$J$34826,XML!$J$3)","v":0},{"$f":"SUMIFS(ACHAT!$E$5:$E$34826,ACHAT!$C$5:$C$34826,XML!$I$8,ACHAT!$N$5:$N$34826,A7,ACHAT!$J$5:$J$34826,XML!$J$8)","v":17296.759999999998},{"$f":"SUMIFS(ACHAT!$E$5:$E$34826,ACHAT!$C$5:$C$34826,XML!$I$5,ACHAT!$N$5:$N$34826,A7,ACHAT!$J$5:$J$34826,XML!$J$5)","v":0},{"$f":"SUMIFS(ACHAT!$E$5:$E$34826,ACHAT!$C$5:$C$34826,XML!$I$6,ACHAT!$N$5:$N$34826,A7,ACHAT!$J$5:$J$34826,XML!$J$6)","v":0},{"$f":"SUMIFS(ACHAT!$E$5:$E$34826,ACHAT!$C$5:$C$34826,XML!$I$7,ACHAT!$N$5:$N$34826,A7,ACHAT!$J$5:$J$34826,XML!$J$7)","v":0},{"$f":"H7+I7+J7+K7+L7+N7","v":17296.759999999998},-590.34,{"$f":"O7-P7","v":17887.099999999999},{"$f":"G7-Q7","v":-7041.1},null,{"$f":"\"Report Crédit Tva\"&\" \"&YEAR(X!$F$2)+1","v":"Report Crédit Tva 2017"},null,null,null,null,null,null,null,null,0.1,"OP DE BANQUE"]
[{"$f":"EDATE(A7,1)","v":"2016-03-01"},{"$f":"SUMIFS(VENTE!$D$4:$D$74974,VENTE!$J$4:$J$74974,A8)","v":75193.179999999993},{"$f":"SUMIFS(VENTE!$F$4:$F$14982,VENTE!$E$4:$E$14982,\"0,07\",VENTE!$J$4:$J$14982,Tableau4[[#This Row],[Mois Décl]])","v":0},{"$f":"SUMIFS(VENTE!$F$4:$F$14982,VENTE!$E$4:$E$14982,\"0,10\",VENTE!$J$4:$J$14982,A8)","v":0},{"$f":"SUMIFS(VENTE!$F$4:$F$14982,VENTE!$E$4:$E$14982,\"0,14\",VENTE!$J$4:$J$14982,A8)","v":0},{"$f":"SUMIFS(VENTE!$F$4:$F$14982,VENTE!$E$4:$E$14982,\"0,30\",VENTE!$J$4:$J$14982,A8)","v":0},{"$f":"ROUNDUP(Tableau4[[#This Row],[Vente HT]],-1)*0.2","v":15040},{"$f":"SUMIFS(ACHAT!$E$5:$E$34826,ACHAT!$C$5:$C$34826,XML!$I$2,ACHAT!$N$5:$N$34826,A8,ACHAT!$J$5:$J$34826,XML!$J$2)","v":0},{"$f":"SUMIFS(ACHAT!$E$5:$E$34826,ACHAT!$C$5:$C$34826,XML!$I$4,ACHAT!$N$5:$N$34826,A8,ACHAT!$J$5:$J$34826,XML!$J$4)","v":0},{"$f":"SUMIFS(ACHAT!$E$5:$E$34826,ACHAT!$C$5:$C$34826,XML!$I$3,ACHAT!$N$5:$N$34826,A8,ACHAT!$J$5:$J$34826,XML!$J$3)","v":0},{"$f":"SUMIFS(ACHAT!$E$5:$E$34826,ACHAT!$C$5:$C$34826,XML!$I$8,ACHAT!$N$5:$N$34826,A8,ACHAT!$J$5:$J$34826,XML!$J$8)","v":8564.5300000000007},{"$f":"SUMIFS(ACHAT!$E$5:$E$34826,ACHAT!$C$5:$C$34826,XML!$I$5,ACHAT!$N$5:$N$34826,A8,ACHAT!$J$5:$J$34826,XML!$J$5)","v":0},{"$f":"SUMIFS(ACHAT!$E$5:$E$34826,ACHAT!$C$5:$C$34826,XML!$I$6,ACHAT!$N$5:$N$34826,A8,ACHAT!$J$5:$J$34826,XML!$J$6)","v":0},{"$f":"SUMIFS(ACHAT!$E$5:$E$34826,ACHAT!$C$5:$C$34826,XML!$I$7,ACHAT!$N$5:$N$34826,A8,ACHAT!$J$5:$J$34826,XML!$J$7)","v":0},8564.5300000000007,-7041.1,15605.63,-565.63,null,{"$f":"\"Report Crédit Tva\"&\" \"&YEAR(X!$F$2)+2","v":"Report Crédit Tva 2018"},null,null,null,null,null,null,null,null,0.14000000000000001,"TRANSPORT"]
["2016-04-01",{"$f":"SUMIFS(VENTE!$D$4:$D$74974,VENTE!$J$4:$J$74974,A9)","v":72914.66},{"$f":"SUMIFS(VENTE!$F$4:$F$14982,VENTE!$E$4:$E$14982,\"0,07\",VENTE!$J$4:$J$14982,Tableau4[[#This Row],[Mois Décl]])","v":0},{"$f":"SUMIFS(VENTE!$F$4:$F$14982,VENTE!$E$4:$E$14982,\"0,10\",VENTE!$J$4:$J$14982,A9)","v":0},{"$f":"SUMIFS(VENTE!$F$4:$F$14982,VENTE!$E$4:$E$14982,\"0,14\",VENTE!$J$4:$J$14982,A9)","v":0},{"$f":"SUMIFS(VENTE!$F$4:$F$14982,VENTE!$E$4:$E$14982,\"0,30\",VENTE!$J$4:$J$14982,A9)","v":0},{"$f":"ROUNDUP(Tableau4[[#This Row],[Vente HT]],-1)*0.2","v":14584},{"$f":"SUMIFS(ACHAT!$E$5:$E$34826,ACHAT!$C$5:$C$34826,XML!$I$2,ACHAT!$N$5:$N$34826,A9,ACHAT!$J$5:$J$34826,XML!$J$2)","v":1190.5999999999999},{"$f":"SUMIFS(ACHAT!$E$5:$E$34826,ACHAT!$C$5:$C$34826,XML!$I$4,ACHAT!$N$5:$N$34826,A9,ACHAT!$J$5:$J$34826,XML!$J$4)","v":0},{"$f":"SUMIFS(ACHAT!$E$5:$E$34826,ACHAT!$C$5:$C$34826,XML!$I$3,ACHAT!$N$5:$N$34826,A9,ACHAT!$J$5:$J$34826,XML!$J$3)","v":0},{"$f":"SUMIFS(ACHAT!$E$5:$E$34826,ACHAT!$C$5:$C$34826,XML!$I$8,ACHAT!$N$5:$N$34826,A9,ACHAT!$J$5:$J$34826,XML!$J$8)","v":12722.69},{"$f":"SUMIFS(ACHAT!$E$5:$E$34826,ACHAT!$C$5:$C$34826,XML!$I$5,ACHAT!$N$5:$N$34826,A9,ACHAT!$J$5:$J$34826,XML!$J$5)","v":0},{"$f":"SUMIFS(ACHAT!$E$5:$E$34826,ACHAT!$C$5:$C$34826,XML!$I$6,ACHAT!$N$5:$N$34826,A9,ACHAT!$J$5:$J$34826,XML!$J$6)","v":133.03},{"$f":"SUMIFS(ACHAT!$E$5:$E$34826,ACHAT!$C$5:$C$34826,XML!$I$7,ACHAT!$N$5:$N$34826,A9,ACHAT!$J$5:$J$34826,XML!$J$7)","v":0},{"$f":"H9+I9+J9+K9+L9++M9+N9","v":14046.32},-565.63,14611.95,-27.95,null,{"$f":"\"Report Crédit Tva\"&\" \"&YEAR(X!$F$2)+3","v":"Report Crédit Tva 2019"},null,null,null,null,null,null,null,null,0.14000000000000001,"ELECTRICITE"]
["2016-05-01",{"$f":"SUMIFS(VENTE!$D$4:$D$74974,VENTE!$J$4:$J$74974,A10)","v":30270.5},{"$f":"SUMIFS(VENTE!$F$4:$F$14982,VENTE!$E$4:$E$14982,\"0,07\",VENTE!$J$4:$J$14982,Tableau4[[#This Row],[Mois Décl]])","v":0},{"$f":"SUMIFS(VENTE!$F$4:$F$14982,VENTE!$E$4:$E$14982,\"0,10\",VENTE!$J$4:$J$14982,A10)","v":0},{"$f":"SUMIFS(VENTE!$F$4:$F$14982,VENTE!$E$4:$E$14982,\"0,14\",VENTE!$J$4:$J$14982,A10)","v":0},{"$f":"SUMIFS(VENTE!$F$4:$F$14982,VENTE!$E$4:$E$14982,\"0,30\",VENTE!$J$4:$J$14982,A10)","v":0},{"$f":"ROUNDUP(Tableau4[[#This Row],[Vente HT]],-1)*0.2","v":6056},{"$f":"SUMIFS(ACHAT!$E$5:$E$34826,ACHAT!$C$5:$C$34826,XML!$I$2,ACHAT!$N$5:$N$34826,A10,ACHAT!$J$5:$J$34826,XML!$J$2)","v":0},{"$f":"SUMIFS(ACHAT!$E$5:$E$34826,ACHAT!$C$5:$C$34826,XML!$I$4,ACHAT!$N$5:$N$34826,A10,ACHAT!$J$5:$J$34826,XML!$J$4)","v":0},{"$f":"SUMIFS(ACHAT!$E$5:$E$34826,ACHAT!$C$5:$C$34826,XML!$I$3,ACHAT!$N$5:$N$34826,A10,ACHAT!$J$5:$J$34826,XML!$J$3)","v":0},{"$f":"SUMIFS(ACHAT!$E$5:$E$34826,ACHAT!$C$5:$C$34826,XML!$I$8,ACHAT!$N$5:$N$34826,A10,ACHAT!$J$5:$J$34826,XML!$J$8)","v":7130},{"$f":"SUMIFS(ACHAT!$E$5:$E$34826,ACHAT!$C$5:$C$34826,XML!$I$5,ACHAT!$N$5:$N$34826,A10,ACHAT!$J$5:$J$34826,XML!$J$5)","v":0},{"$f":"SUMIFS(ACHAT!$E$5:$E$34826,ACHAT!$C$5:$C$34826,XML!$I$6,ACHAT!$N$5:$N$34826,A10,ACHAT!$J$5:$J$34826,XML!$J$6)","v":0},{"$f":"SUMIFS(ACHAT!$E$5:$E$34826,ACHAT!$C$5:$C$34826,XML!$I$7,ACHAT!$N$5:$N$34826,A10,ACHAT!$J$5:$J$34826,XML!$J$7)","v":0},7130,-27.95,7157.95,-1101.95,null,{"$f":"\"Report Crédit Tva\"&\" \"&YEAR(X!$F$2)+4","v":"Report Crédit Tva 2020"},null,null,null,null,null,null,null,null,0.2,"MARCHANDISES"]
["2016-06-01",{"$f":"SUMIFS(VENTE!$D$4:$D$74974,VENTE!$J$4:$J$74974,A11)","v":44477.08},{"$f":"SUMIFS(VENTE!$F$4:$F$14982,VENTE!$E$4:$E$14982,\"0,07\",VENTE!$J$4:$J$14982,Tableau4[[#This Row],[Mois Décl]])","v":0},{"$f":"SUMIFS(VENTE!$F$4:$F$14982,VENTE!$E$4:$E$14982,\"0,10\",VENTE!$J$4:$J$14982,A11)","v":0},{"$f":"SUMIFS(VENTE!$F$4:$F$14982,VENTE!$E$4:$E$14982,\"0,14\",VENTE!$J$4:$J$14982,A11)","v":0},{"$f":"SUMIFS(VENTE!$F$4:$F$14982,VENTE!$E$4:$E$14982,\"0,30\",VENTE!$J$4:$J$14982,A11)","v":0},{"$f":"ROUNDUP(Tableau4[[#This Row],[Vente HT]],-1)*0.2","v":8896},{"$f":"SUMIFS(ACHAT!$E$5:$E$34826,ACHAT!$C$5:$C$34826,XML!$I$2,ACHAT!$N$5:$N$34826,A11,ACHAT!$J$5:$J$34826,XML!$J$2)","v":0},{"$f":"SUMIFS(ACHAT!$E$5:$E$34826,ACHAT!$C$5:$C$34826,XML!$I$4,ACHAT!$N$5:$N$34826,A11,ACHAT!$J$5:$J$34826,XML!$J$4)","v":0},{"$f":"SUMIFS(ACHAT!$E$5:$E$34826,ACHAT!$C$5:$C$34826,XML!$I$3,ACHAT!$N$5:$N$34826,A11,ACHAT!$J$5:$J$34826,XML!$J$3)","v":0},{"$f":"SUMIFS(ACHAT!$E$5:$E$34826,ACHAT!$C$5:$C$34826,XML!$I$8,ACHAT!$N$5:$N$34826,A11,ACHAT!$J$5:$J$34826,XML!$J$8)","v":10821.03},{"$f":"SUMIFS(ACHAT!$E$5:$E$34826,ACHAT!$C$5:$C$34826,XML!$I$5,ACHAT!$N$5:$N$34826,A11,ACHAT!$J$5:$J$34826,XML!$J$5)","v":0},{"$f":"SUMIFS(ACHAT!$E$5:$E$34826,ACHAT!$C$5:$C$34826,XML!$I$6,ACHAT!$N$5:$N$34826,A11,ACHAT!$J$5:$J$34826,XML!$J$6)","v":0},{"$f":"SUMIFS(ACHAT!$E$5:$E$34826,ACHAT!$C$5:$C$34826,XML!$I$7,ACHAT!$N$5:$N$34826,A11,ACHAT!$J$5:$J$34826,XML!$J$7)","v":0},10821.03,-1101.95,11922.98,-3026.98,null,null,null,null,null,null,null,null,null,null,0.2,"IMMOBILISATION"]
["2016-07-01",{"$f":"SUMIFS(VENTE!$D$4:$D$74974,VENTE!$J$4:$J$74974,A12)","v":78125.570000000007},{"$f":"SUMIFS(VENTE!$F$4:$F$14982,VENTE!$E$4:$E$14982,\"0,07\",VENTE!$J$4:$J$14982,Tableau4[[#This Row],[Mois Décl]])","v":0},{"$f":"SUMIFS(VENTE!$F$4:$F$14982,VENTE!$E$4:$E$14982,\"0,10\",VENTE!$J$4:$J$14982,A12)","v":0},{"$f":"SUMIFS(VENTE!$F$4:$F$14982,VENTE!$E$4:$E$14982,\"0,14\",VENTE!$J$4:$J$14982,A12)","v":0},{"$f":"SUMIFS(VENTE!$F$4:$F$14982,VENTE!$E$4:$E$14982,\"0,30\",VENTE!$J$4:$J$14982,A12)","v":0},{"$f":"ROUNDUP(Tableau4[[#This Row],[Vente HT]],-1)*0.2","v":15626},{"$f":"SUMIFS(ACHAT!$E$5:$E$34826,ACHAT!$C$5:$C$34826,XML!$I$2,ACHAT!$N$5:$N$34826,A12,ACHAT!$J$5:$J$34826,XML!$J$2)","v":0},{"$f":"SUMIFS(ACHAT!$E$5:$E$34826,ACHAT!$C$5:$C$34826,XML!$I$4,ACHAT!$N$5:$N$34826,A12,ACHAT!$J$5:$J$34826,XML!$J$4)","v":0},{"$f":"SUMIFS(ACHAT!$E$5:$E$34826,ACHAT!$C$5:$C$34826,XML!$I$3,ACHAT!$N$5:$N$34826,A12,ACHAT!$J$5:$J$34826,XML!$J$3)","v":0},{"$f":"SUMIFS(ACHAT!$E$5:$E$34826,ACHAT!$C$5:$C$34826,XML!$I$8,ACHAT!$N$5:$N$34826,A12,ACHAT!$J$5:$J$34826,XML!$J$8)","v":15089.01},{"$f":"SUMIFS(ACHAT!$E$5:$E$34826,ACHAT!$C$5:$C$34826,XML!$I$5,ACHAT!$N$5:$N$34826,A12,ACHAT!$J$5:$J$34826,XML!$J$5)","v":0},{"$f":"SUMIFS(ACHAT!$E$5:$E$34826,ACHAT!$C$5:$C$34826,XML!$I$6,ACHAT!$N$5:$N$34826,A12,ACHAT!$J$5:$J$34826,XML!$J$6)","v":0},{"$f":"SUMIFS(ACHAT!$E$5:$E$34826,ACHAT!$C$5:$C$34826,XML!$I$7,ACHAT!$N$5:$N$34826,A12,ACHAT!$J$5:$J$34826,XML!$J$7)","v":0},15089.01,-3026.98,18115.990000000002,-2489.9899999999998,null,null,null,null,null,null,null,null,null,null,0.2,"PRES DE SERVICES"]
["2016-08-01",{"$f":"SUMIFS(VENTE!$D$4:$D$74974,VENTE!$J$4:$J$74974,A13)","v":44609.43},{"$f":"SUMIFS(VENTE!$F$4:$F$14982,VENTE!$E$4:$E$14982,\"0,07\",VENTE!$J$4:$J$14982,Tableau4[[#This Row],[Mois Décl]])","v":0},{"$f":"SUMIFS(VENTE!$F$4:$F$14982,VENTE!$E$4:$E$14982,\"0,10\",VENTE!$J$4:$J$14982,A13)","v":0},{"$f":"SUMIFS(VENTE!$F$4:$F$14982,VENTE!$E$4:$E$14982,\"0,14\",VENTE!$J$4:$J$14982,A13)","v":0},{"$f":"SUMIFS(VENTE!$F$4:$F$14982,VENTE!$E$4:$E$14982,\"0,30\",VENTE!$J$4:$J$14982,A13)","v":0},{"$f":"ROUNDUP(Tableau4[[#This Row],[Vente HT]],-1)*0.2","v":8922},{"$f":"SUMIFS(ACHAT!$E$5:$E$34826,ACHAT!$C$5:$C$34826,XML!$I$2,ACHAT!$N$5:$N$34826,A13,ACHAT!$J$5:$J$34826,XML!$J$2)","v":0},{"$f":"SUMIFS(ACHAT!$E$5:$E$34826,ACHAT!$C$5:$C$34826,XML!$I$4,ACHAT!$N$5:$N$34826,A13,ACHAT!$J$5:$J$34826,XML!$J$4)","v":0},{"$f":"SUMIFS(ACHAT!$E$5:$E$34826,ACHAT!$C$5:$C$34826,XML!$I$3,ACHAT!$N$5:$N$34826,A13,ACHAT!$J$5:$J$34826,XML!$J$3)","v":0},{"$f":"SUMIFS(ACHAT!$E$5:$E$34826,ACHAT!$C$5:$C$34826,XML!$I$8,ACHAT!$N$5:$N$34826,A13,ACHAT!$J$5:$J$34826,XML!$J$8)","v":7483.01},{"$f":"SUMIFS(ACHAT!$E$5:$E$34826,ACHAT!$C$5:$C$34826,XML!$I$5,ACHAT!$N$5:$N$34826,A13,ACHAT!$J$5:$J$34826,XML!$J$5)","v":0},{"$f":"SUMIFS(ACHAT!$E$5:$E$34826,ACHAT!$C$5:$C$34826,XML!$I$6,ACHAT!$N$5:$N$34826,A13,ACHAT!$J$5:$J$34826,XML!$J$6)","v":0},{"$f":"SUMIFS(ACHAT!$E$5:$E$34826,ACHAT!$C$5:$C$34826,XML!$I$7,ACHAT!$N$5:$N$34826,A13,ACHAT!$J$5:$J$34826,XML!$J$7)","v":0},7483.01,-2489.9899999999998,9973,-1051]
["2016-09-01",{"$f":"SUMIFS(VENTE!$D$4:$D$74974,VENTE!$J$4:$J$74974,A14)","v":39823.06},{"$f":"SUMIFS(VENTE!$F$4:$F$14982,VENTE!$E$4:$E$14982,\"0,07\",VENTE!$J$4:$J$14982,Tableau4[[#This Row],[Mois Décl]])","v":0},{"$f":"SUMIFS(VENTE!$F$4:$F$14982,VENTE!$E$4:$E$14982,\"0,10\",VENTE!$J$4:$J$14982,A14)","v":0},{"$f":"SUMIFS(VENTE!$F$4:$F$14982,VENTE!$E$4:$E$14982,\"0,14\",VENTE!$J$4:$J$14982,A14)","v":0},{"$f":"SUMIFS(VENTE!$F$4:$F$14982,VENTE!$E$4:$E$14982,\"0,30\",VENTE!$J$4:$J$14982,A14)","v":0},{"$f":"ROUNDUP(Tableau4[[#This Row],[Vente HT]],-1)*0.2","v":7966},{"$f":"SUMIFS(ACHAT!$E$5:$E$34826,ACHAT!$C$5:$C$34826,XML!$I$2,ACHAT!$N$5:$N$34826,A14,ACHAT!$J$5:$J$34826,XML!$J$2)","v":0},{"$f":"SUMIFS(ACHAT!$E$5:$E$34826,ACHAT!$C$5:$C$34826,XML!$I$4,ACHAT!$N$5:$N$34826,A14,ACHAT!$J$5:$J$34826,XML!$J$4)","v":0},{"$f":"SUMIFS(ACHAT!$E$5:$E$34826,ACHAT!$C$5:$C$34826,XML!$I$3,ACHAT!$N$5:$N$34826,A14,ACHAT!$J$5:$J$34826,XML!$J$3)","v":0},{"$f":"SUMIFS(ACHAT!$E$5:$E$34826,ACHAT!$C$5:$C$34826,XML!$I$8,ACHAT!$N$5:$N$34826,A14,ACHAT!$J$5:$J$34826,XML!$J$8)","v":9207.4},{"$f":"SUMIFS(ACHAT!$E$5:$E$34826,ACHAT!$C$5:$C$34826,XML!$I$5,ACHAT!$N$5:$N$34826,A14,ACHAT!$J$5:$J$34826,XML!$J$5)","v":0},{"$f":"SUMIFS(ACHAT!$E$5:$E$34826,ACHAT!$C$5:$C$34826,XML!$I$6,ACHAT!$N$5:$N$34826,A14,ACHAT!$J$5:$J$34826,XML!$J$6)","v":0},{"$f":"SUMIFS(ACHAT!$E$5:$E$34826,ACHAT!$C$5:$C$34826,XML!$I$7,ACHAT!$N$5:$N$34826,A14,ACHAT!$J$5:$J$34826,XML!$J$7)","v":0},9207.4,-1051,10258.4,-2292.4]
["2016-10-01",{"$f":"SUMIFS(VENTE!$D$4:$D$74974,VENTE!$J$4:$J$74974,A15)","v":28713.52},{"$f":"SUMIFS(VENTE!$F$4:$F$14982,VENTE!$E$4:$E$14982,\"0,07\",VENTE!$J$4:$J$14982,Tableau4[[#This Row],[Mois Décl]])","v":0},{"$f":"SUMIFS(VENTE!$F$4:$F$14982,VENTE!$E$4:$E$14982,\"0,10\",VENTE!$J$4:$J$14982,A15)","v":0},{"$f":"SUMIFS(VENTE!$F$4:$F$14982,VENTE!$E$4:$E$14982,\"0,14\",VENTE!$J$4:$J$14982,A15)","v":0},{"$f":"SUMIFS(VENTE!$F$4:$F$14982,VENTE!$E$4:$E$14982,\"0,30\",VENTE!$J$4:$J$14982,A15)","v":0},{"$f":"ROUNDUP(Tableau4[[#This Row],[Vente HT]],-1)*0.2","v":5744},{"$f":"SUMIFS(ACHAT!$E$5:$E$34826,ACHAT!$C$5:$C$34826,XML!$I$2,ACHAT!$N$5:$N$34826,A15,ACHAT!$J$5:$J$34826,XML!$J$2)","v":0},{"$f":"SUMIFS(ACHAT!$E$5:$E$34826,ACHAT!$C$5:$C$34826,XML!$I$4,ACHAT!$N$5:$N$34826,A15,ACHAT!$J$5:$J$34826,XML!$J$4)","v":0},{"$f":"SUMIFS(ACHAT!$E$5:$E$34826,ACHAT!$C$5:$C$34826,XML!$I$3,ACHAT!$N$5:$N$34826,A15,ACHAT!$J$5:$J$34826,XML!$J$3)","v":0},{"$f":"SUMIFS(ACHAT!$E$5:$E$34826,ACHAT!$C$5:$C$34826,XML!$I$8,ACHAT!$N$5:$N$34826,A15,ACHAT!$J$5:$J$34826,XML!$J$8)","v":3661.17},{"$f":"SUMIFS(ACHAT!$E$5:$E$34826,ACHAT!$C$5:$C$34826,XML!$I$5,ACHAT!$N$5:$N$34826,A15,ACHAT!$J$5:$J$34826,XML!$J$5)","v":0},{"$f":"SUMIFS(ACHAT!$E$5:$E$34826,ACHAT!$C$5:$C$34826,XML!$I$6,ACHAT!$N$5:$N$34826,A15,ACHAT!$J$5:$J$34826,XML!$J$6)","v":0},{"$f":"SUMIFS(ACHAT!$E$5:$E$34826,ACHAT!$C$5:$C$34826,XML!$I$7,ACHAT!$N$5:$N$34826,A15,ACHAT!$J$5:$J$34826,XML!$J$7)","v":0},3661.17,{"$f":"IF(R14>=0,0,OFFSET(A10,4,17))","v":-2292.4},5953.57,-209.57]
["2016-11-01",{"$f":"SUMIFS(VENTE!$D$4:$D$74974,VENTE!$J$4:$J$74974,A16)","v":34386.83},{"$f":"SUMIFS(VENTE!$F$4:$F$14982,VENTE!$E$4:$E$14982,\"0,07\",VENTE!$J$4:$J$14982,Tableau4[[#This Row],[Mois Décl]])","v":0},{"$f":"SUMIFS(VENTE!$F$4:$F$14982,VENTE!$E$4:$E$14982,\"0,10\",VENTE!$J$4:$J$14982,A16)","v":0},{"$f":"SUMIFS(VENTE!$F$4:$F$14982,VENTE!$E$4:$E$14982,\"0,14\",VENTE!$J$4:$J$14982,A16)","v":0},{"$f":"SUMIFS(VENTE!$F$4:$F$14982,VENTE!$E$4:$E$14982,\"0,30\",VENTE!$J$4:$J$14982,A16)","v":0},{"$f":"ROUNDUP(Tableau4[[#This Row],[Vente HT]],-1)*0.2","v":6878},{"$f":"SUMIFS(ACHAT!$E$5:$E$34826,ACHAT!$C$5:$C$34826,XML!$I$2,ACHAT!$N$5:$N$34826,A16,ACHAT!$J$5:$J$34826,XML!$J$2)","v":0},{"$f":"SUMIFS(ACHAT!$E$5:$E$34826,ACHAT!$C$5:$C$34826,XML!$I$4,ACHAT!$N$5:$N$34826,A16,ACHAT!$J$5:$J$34826,XML!$J$4)","v":0},{"$f":"SUMIFS(ACHAT!$E$5:$E$34826,ACHAT!$C$5:$C$34826,XML!$I$3,ACHAT!$N$5:$N$34826,A16,ACHAT!$J$5:$J$34826,XML!$J$3)","v":0},{"$f":"SUMIFS(ACHAT!$E$5:$E$34826,ACHAT!$C$5:$C$34826,XML!$I$8,ACHAT!$N$5:$N$34826,A16,ACHAT!$J$5:$J$34826,XML!$J$8)","v":6895.16},{"$f":"SUMIFS(ACHAT!$E$5:$E$34826,ACHAT!$C$5:$C$34826,XML!$I$5,ACHAT!$N$5:$N$34826,A16,ACHAT!$J$5:$J$34826,XML!$J$5)","v":0},{"$f":"SUMIFS(ACHAT!$E$5:$E$34826,ACHAT!$C$5:$C$34826,XML!$I$6,ACHAT!$N$5:$N$34826,A16,ACHAT!$J$5:$J$34826,XML!$J$6)","v":0},{"$f":"SUMIFS(ACHAT!$E$5:$E$34826,ACHAT!$C$5:$C$34826,XML!$I$7,ACHAT!$N$5:$N$34826,A16,ACHAT!$J$5:$J$34826,XML!$J$7)","v":0},6895.16,-209.57,7104.73,-226.73]
["2016-12-01",{"$f":"SUMIFS(VENTE!$D$4:$D$74974,VENTE!$J$4:$J$74974,A17)","v":72656.479999999996},{"$f":"SUMIFS(VENTE!$F$4:$F$14982,VENTE!$E$4:$E$14982,\"0,07\",VENTE!$J$4:$J$14982,Tableau4[[#This Row],[Mois Décl]])","v":0},{"$f":"SUMIFS(VENTE!$F$4:$F$14982,VENTE!$E$4:$E$14982,\"0,10\",VENTE!$J$4:$J$14982,A17)","v":0},{"$f":"SUMIFS(VENTE!$F$4:$F$14982,VENTE!$E$4:$E$14982,\"0,14\",VENTE!$J$4:$J$14982,A17)","v":0},{"$f":"SUMIFS(VENTE!$F$4:$F$14982,VENTE!$E$4:$E$14982,\"0,30\",VENTE!$J$4:$J$14982,A17)","v":0},{"$f":"ROUNDUP(Tableau4[[#This Row],[Vente HT]],-1)*0.2","v":14532},{"$f":"SUMIFS(ACHAT!$E$5:$E$34826,ACHAT!$C$5:$C$34826,XML!$I$2,ACHAT!$N$5:$N$34826,A17,ACHAT!$J$5:$J$34826,XML!$J$2)","v":0},{"$f":"SUMIFS(ACHAT!$E$5:$E$34826,ACHAT!$C$5:$C$34826,XML!$I$4,ACHAT!$N$5:$N$34826,A17,ACHAT!$J$5:$J$34826,XML!$J$4)","v":0},{"$f":"SUMIFS(ACHAT!$E$5:$E$34826,ACHAT!$C$5:$C$34826,XML!$I$3,ACHAT!$N$5:$N$34826,A17,ACHAT!$J$5:$J$34826,XML!$J$3)","v":0},{"$f":"SUMIFS(ACHAT!$E$5:$E$34826,ACHAT!$C$5:$C$34826,XML!$I$8,ACHAT!$N$5:$N$34826,A17,ACHAT!$J$5:$J$34826,XML!$J$8)","v":12454.94},{"$f":"SUMIFS(ACHAT!$E$5:$E$34826,ACHAT!$C$5:$C$34826,XML!$I$5,ACHAT!$N$5:$N$34826,A17,ACHAT!$J$5:$J$34826,XML!$J$5)","v":0},{"$f":"SUMIFS(ACHAT!$E$5:$E$34826,ACHAT!$C$5:$C$34826,XML!$I$6,ACHAT!$N$5:$N$34826,A17,ACHAT!$J$5:$J$34826,XML!$J$6)","v":0},{"$f":"SUMIFS(ACHAT!$E$5:$E$34826,ACHAT!$C$5:$C$34826,XML!$I$7,ACHAT!$N$5:$N$34826,A17,ACHAT!$J$5:$J$34826,XML!$J$7)","v":1333.33},13788.27,-226.73,14015,517]
[{"$f":"\"RAD\"&\" \"&YEAR(A6)","v":"RAD 2016"},{"$f":"SUMIFS(VENTE!$D$4:$D$74974,VENTE!$J$4:$J$74974,A18)","v":0},{"$f":"SUMIFS(VENTE!$F$4:$F$14982,VENTE!$E$4:$E$14982,\"0,07\",VENTE!$J$4:$J$14982,Tableau4[[#This Row],[Mois Décl]])","v":0},{"$f":"SUMIFS(VENTE!$F$4:$F$14982,VENTE!$E$4:$E$14982,\"0,10\",VENTE!$J$4:$J$14982,A18)","v":0},{"$f":"SUMIFS(VENTE!$F$4:$F$14982,VENTE!$E$4:$E$14982,\"0,14\",VENTE!$J$4:$J$14982,A18)","v":0},{"$f":"SUMIFS(VENTE!$F$4:$F$14982,VENTE!$E$4:$E$14982,\"0,30\",VENTE!$J$4:$J$14982,A18)","v":0},{"$f":"SUMIFS(VENTE!$F$4:$F$74974,VENTE!$J$4:$J$74974,A18)","v":0},{"$f":"SUMIFS(ACHAT!$E$5:$E$34826,ACHAT!$C$5:$C$34826,XML!$I$2,ACHAT!$N$5:$N$34826,A18,ACHAT!$J$5:$J$34826,XML!$J$2)","v":0},{"$f":"SUMIFS(ACHAT!$E$5:$E$34826,ACHAT!$C$5:$C$34826,XML!$I$4,ACHAT!$N$5:$N$34826,A18,ACHAT!$J$5:$J$34826,XML!$J$4)","v":0},{"$f":"SUMIFS(ACHAT!$E$5:$E$34826,ACHAT!$C$5:$C$34826,XML!$I$3,ACHAT!$N$5:$N$34826,A18,ACHAT!$J$5:$J$34826,XML!$J$3)","v":0},{"$f":"SUMIFS(ACHAT!$E$5:$E$34826,ACHAT!$C$5:$C$34826,XML!$I$8,ACHAT!$N$5:$N$34826,A18,ACHAT!$J$5:$J$34826,XML!$J$8)","v":0},{"$f":"SUMIFS(ACHAT!$E$5:$E$34826,ACHAT!$C$5:$C$34826,XML!$I$5,ACHAT!$N$5:$N$34826,A18,ACHAT!$J$5:$J$34826,XML!$J$5)","v":0},{"$f":"SUMIFS(ACHAT!$E$5:$E$34826,ACHAT!$C$5:$C$34826,XML!$I$6,ACHAT!$N$5:$N$34826,A18,ACHAT!$J$5:$J$34826,XML!$J$6)","v":0},{"$f":"SUMIFS(ACHAT!$E$5:$E$34826,ACHAT!$C$5:$C$34826,XML!$I$7,ACHAT!$N$5:$N$34826,A18,ACHAT!$J$5:$J$34826,XML!$J$7)","v":0},0]
["Total",{"$f":"SUBTOTAL(109,[Vente HT])","v":639752.75},{"$f":"SUBTOTAL(109,[Tva Vente 7%])","v":0},{"$f":"SUBTOTAL(109,[Tva Vente 10%])","v":0},{"$f":"SUBTOTAL(109,[Tva Vente 14%])","v":0},{"$f":"SUBTOTAL(109,[Tva Vente 30%])","v":0},{"$f":"SUBTOTAL(109,[Tva Vente 20%])","v":127962},{"$f":"SUBTOTAL(109,[Pres serv 20%])","v":1190.5999999999999},{"$f":"SUBTOTAL(109,[Transp 14% ])","v":0},{"$f":"SUBTOTAL(107,[Op Bq 10%])","v":0},{"$f":"SUBTOTAL(109,[March 20%])","v":119252.77},{"$f":"SUBTOTAL(109,[Services 7%])","v":0},{"$f":"SUBTOTAL(109,[Elect 14%])","v":133.03},{"$f":"SUBTOTAL(109,[Immob 20%])","v":1333.33},{"$f":"SUBTOTAL(109,[Total TVA Mois Achat])","v":121909.73}]
["RAD = RESTE A DECLARER"]
[]
[]
[{"$f":"\"CONTRÔLE TVA FACTURE ANNEE\"&\" \"&YEAR(A6)","v":"CONTRÔLE TVA FACTURE ANNEE 2016"}]
[]
["Contrôle du calcul de la TVA collectée",null,null,null,null,null,"Récapitulation du chiffre d'affaires  déclaré",null,null,null,null,"Observations"]
["Chiffre d'affaires",null,"TVA correspondante",null,null,null,"Désignation",null,"Montant",null,null,"Situation des comptes",null,3456,4456]
["Taux","Montant",null,null,null,null,"Non taxable",null,null,null,null,"Suivant détail ci-dessus",null,{"$f":"IF(R17<0,-R17,0)","v":0},{"$f":"IF(R17>0,R17,0)","v":517}]
[7,{"$f":"Tableau4[[#Totals],[Tva Vente 7%]]-C18","v":0},{"$f":"B28*A28/100","v":0},null,null,null,"Taxable à    7%",null,null,null,null,"Suivant les comptes",null,null,506.78]
[10,{"$f":"Tableau4[[#Totals],[Tva Vente 10%]]-D18","v":0},{"$f":"B29*A29/100","v":0},null,null,null,"Taxable à 10%",null,null,null,null,"Ecart",null,{"$f":"N27-N28","v":0},{"$f":"O27-O28","v":10.220000000000001}]
[14,{"$f":"Tableau4[[#Totals],[Tva Vente 14%]]-E18","v":0},0,null,null,null,"Taxable à 14%",null,null,null,null,"Autres observations"]
[20,{"$f":"Tableau4[[#Totals],[Vente HT]]-B18","v":639752.75},127950.55,null,null,null,"Taxable à 20%",null,{"$f":"Tableau4[[#Totals],[Vente HT]]-B18","v":639752.75}]
[30,{"$f":"Tableau4[[#Totals],[Tva Vente 30%]]-F18","v":0},0,null,null,null,"Taxable à 30%",null,{"$f":"H21","v":0}]
["Total calculé",null,{"$f":"SUM(C28:C32)","v":127950.55},null,null,null,"Total hors taxe",null,{"$f":"SUM(I27:I31)","v":639752.75}]
["Total déclaré",null,{"$f":"Tableau4[[#Totals],[Tva Vente 20%]]-G18","v":127962},null,null,null,"TVA collectée",null,{"$f":"Tableau4[[#Totals],[Tva Vente 20%]]-G18","v":127962}]
["Ecart",null,{"$f":"C33-C34","v":-11.45},null,null,null,"Total TTC",null,{"$f":"SUM(I33:I34)","v":767714.75}]
[]
[]
["DESIGNATION",null,null,null,null,"MONTANT"]
["Situation au début de l'exercice"]
["* Clients et comptes rattachés ",null,null,"(poste 342)","+"]
["* Clients créditeurs, avances et acomptes                      ",null,null,"(poste 442)","-"]
["* Intérêts courus et non échus à percevoir",null,null,"(cpte 3493)","+"]
["* Créances rattachées aux cptes d'associés",null,null,"(cpte 3467)","+"]
["* Chèques à encaisser ou en portefeuille",null,null,"(cpte 5111)","+"]
["* Effets à encaisser ou en portefeuille",null,null,"(cpte 5113)","+"]
["Situation en fin d'exercice"]
["* Clients et comptes rattachés ",null,null,"(poste 342)","-"]
["* Clients créditeurs, avances et acomptes                      ",null,null,"(poste 442)","+"]
["* Intérêts courus et non échus à percevoir",null,null,"(cpte 3493)","-"]
["* Créances rattachées aux cptes d'associés",null,null,"(cpte 3467)","-"]
["* Chèques à encaisser ou en portefeuille",null,null,"(cpte 5111)","-"]
["* Effets à encaisser ou en portefeuille",null,null,"(cpte 5113)","-"]
["Chiffre d'affaires TTC de l'exercice ",null,null,null,"+",{"$f":"CA!D17","v":748853.94}]
["Régularisation comptables opérées"]
["* Clients passés en charges (TTC)",null,null,null,"-"]
["* Clients passés en produits (TTC)",null,null,null,"+"]
["Opérations en instance en rapprochements bancaires"]
["* Remises non encaissées au début de l'exercice",null,null,null,"+"]
["* Remises non encaissées en fin d'exercice",null,null,null,"-"]
["       CA TOTAL TTC ( encaissements théoriques)",null,null,null,null,{"$f":"F40-F41+F42+F43+F44+F45-F47+F48-F49-F50-F51-F52+F53-F55+F56+F58-F59","v":748853.94}]
["       CA DECLARE TTC",null,null,null,null,{"$f":"I35","v":767714.75}]
["       ECART ( 1 )",null,null,null,null,{"$f":"F60-F61","v":-18860.810000000001}]

{"sheet":"CA","index":3,"n_rows":17,"n_cols":15,"rows_kept":17,"cut":false,"hidden":false,"merged":[[1,0,1,14]]}
[]
[{"$f":"\"TABLEAU CHIFFRE D'AFFAIRE ET ACHATS ANNEE\"&\" \"&YEAR(A6)","v":"TABLEAU CHIFFRE D'AFFAIRE ET ACHATS ANNEE 2016"}]
[]
["Mois Décl","Vente HT","Tva Vente","Vente TTC","Pres serv 20%","Transp 14% ","Op Bq 10%","March 20%","Services 7%","Elect 14%","Immob 20%","Total Achat HT","Total Espéces","Total Chq Effet et Autres","Ventes Déclaré TTC"]
[{"$f":"RECAP!A6","v":"2016-01-01"},{"$f":"SUMIFS(VENTE!$D$4:$D$75000,X!$B$4:$B$75000,A5)","v":47505.17},{"$f":"SUMIFS(VENTE!$F$4:$F$75000,X!$B$4:$B$75000,A5)","v":9501.0300000000007},{"$f":"SUMIFS(VENTE!$G$4:$G$75000,X!$B$4:$B$75000,A5)","v":57006.2},{"$f":"SUMIFS(ACHAT!$D$5:$D$75000,ACHAT!$C$5:$C$75000,XML!$I$2,X!$D$5:$D$75000,A5,ACHAT!$J$5:$J$75000,XML!$J$2)","v":251.5},{"$f":"SUMIFS(ACHAT!$D$5:$D$75000,ACHAT!$C$5:$C$75000,XML!$I$4,X!$D$5:$D$75000,A5,ACHAT!$J$5:$J$75000,XML!$J$4)","v":0},{"$f":"SUMIFS(ACHAT!$D$5:$D$75000,ACHAT!$C$5:$C$75000,XML!$I$3,X!$D$5:$D$75000,A5,ACHAT!$J$5:$J$75000,XML!$J$3)","v":6},{"$f":"SUMIFS(ACHAT!$D$5:$D$75000,ACHAT!$C$5:$C$75000,XML!$I$8,X!$D$5:$D$75000,A5,ACHAT!$J$5:$J$75000,XML!$J$8)","v":41434.589999999997},{"$f":"SUMIFS(ACHAT!$D$5:$D$75000,ACHAT!$C$5:$C$75000,XML!$I$5,X!$D$5:$D$75000,A5,ACHAT!$J$5:$J$75000,XML!$J$5)","v":0},{"$f":"SUMIFS(ACHAT!$D$5:$D$75000,ACHAT!$C$5:$C$75000,XML!$I$6,X!$D$5:$D$75000,A5,ACHAT!$J$5:$J$75000,XML!$J$5)","v":0},{"$f":"SUMIFS(ACHAT!$D$5:$D$75000,ACHAT!$C$5:$C$75000,XML!$I$7,X!$D$5:$D$75000,A5,ACHAT!$J$5:$J$75000,XML!$J$7)","v":0},{"$f":"E5+F5++G5+H5+I5+J5+K5","v":41692.089999999997},{"$f":"SUMIFS(VENTE!$G$4:$G$75000,X!$C$4:$C$75000,A5,VENTE!$K$4:$K$75000,\"1\")","v":20498.8},{"$f":"SUMIFS(VENTE!$G$4:$G$75000,X!$C$4:$C$75000,A5,VENTE!$K$4:$K$75000,\"2\")+SUMIFS(VENTE!$G$4:$G$75000,X!$C$4:$C$75000,A5,VENTE!$K$4:$K$75000,\"3\")+SUMIFS(VENTE!$G$4:$G$75000,X!$C$4:$C$75000,A5,VENTE!$K$4:$K$75000,\"4\")+SUMIFS(VENTE!$G$4:$G$75000,X!$C$4:$C$75000,A5,VENTE!$K$4:$K$75000,\"5\")+SUMIFS(VENTE!$G$4:$G$75000,X!$C$4:$C$75000,A5,VENTE!$K$4:$K$75000,\"6\")+SUMIFS(VENTE!$G$4:$G$75000,X!$C$4:$C$75000,A5,VENTE!$K$4:$K$75000,\"7\")","v":66732.7},{"$f":"Tableau39[[#This Row],[Total Espéces]]+N5","v":87231.5}]
[{"$f":"RECAP!A7","v":"2016-02-01"},{"$f":"SUMIFS(VENTE!$D$4:$D$75000,X!$B$4:$B$75000,A6)","v":72116.58},{"$f":"SUMIFS(VENTE!$F$4:$F$75000,X!$B$4:$B$75000,A6)","v":14423.32},{"$f":"SUMIFS(VENTE!$G$4:$G$75000,X!$B$4:$B$75000,A6)","v":86539.9},{"$f":"SUMIFS(ACHAT!$D$5:$D$75000,ACHAT!$C$5:$C$75000,XML!$I$2,X!$D$5:$D$75000,A6,ACHAT!$J$5:$J$75000,XML!$J$2)","v":420.5},{"$f":"SUMIFS(ACHAT!$D$5:$D$75000,ACHAT!$C$5:$C$75000,XML!$I$4,X!$D$5:$D$75000,A6,ACHAT!$J$5:$J$75000,XML!$J$4)","v":0},{"$f":"SUMIFS(ACHAT!$D$5:$D$75000,ACHAT!$C$5:$C$75000,XML!$I$3,X!$D$5:$D$75000,A6,ACHAT!$J$5:$J$75000,XML!$J$3)","v":0},{"$f":"SUMIFS(ACHAT!$D$5:$D$75000,ACHAT!$C$5:$C$75000,XML!$I$8,X!$D$5:$D$75000,A6,ACHAT!$J$5:$J$75000,XML!$J$8)","v":68136.66},{"$f":"SUMIFS(ACHAT!$D$5:$D$75000,ACHAT!$C$5:$C$75000,XML!$I$5,X!$D$5:$D$75000,A6,ACHAT!$J$5:$J$75000,XML!$J$5)","v":0},{"$f":"SUMIFS(ACHAT!$D$5:$D$75000,ACHAT!$C$5:$C$75000,XML!$I$6,X!$D$5:$D$75000,A6,ACHAT!$J$5:$J$75000,XML!$J$5)","v":0},{"$f":"SUMIFS(ACHAT!$D$5:$D$75000,ACHAT!$C$5:$C$75000,XML!$I$7,X!$D$5:$D$75000,A6,ACHAT!$J$5:$J$75000,XML!$J$7)","v":0},68557.16,{"$f":"SUMIFS(VENTE!$G$4:$G$75000,X!$C$4:$C$75000,A6,VENTE!$K$4:$K$75000,\"1\")","v":46351.4},{"$f":"SUMIFS(VENTE!$G$4:$G$75000,X!$C$4:$C$75000,A6,VENTE!$K$4:$K$75000,\"2\")+SUMIFS(VENTE!$G$4:$G$75000,X!$C$4:$C$75000,A6,VENTE!$K$4:$K$75000,\"3\")+SUMIFS(VENTE!$G$4:$G$75000,X!$C$4:$C$75000,A6,VENTE!$K$4:$K$75000,\"4\")+SUMIFS(VENTE!$G$4:$G$75000,X!$C$4:$C$75000,A6,VENTE!$K$4:$K$75000,\"5\")+SUMIFS(VENTE!$G$4:$G$75000,X!$C$4:$C$75000,A6,VENTE!$K$4:$K$75000,\"6\")+SUMIFS(VENTE!$G$4:$G$75000,X!$C$4:$C$75000,A6,VENTE!$K$4:$K$75000,\"7\")","v":18716},{"$f":"Tableau39[[#This Row],[Total Espéces]]+N6","v":65067.4}]
[{"$f":"RECAP!A8","v":"2016-03-01"},{"$f":"SUMIFS(VENTE!$D$4:$D$75000,X!$B$4:$B$75000,A7)","v":93098.1},{"$f":"SUMIFS(VENTE!$F$4:$F$75000,X!$B$4:$B$75000,A7)","v":18619.599999999999},{"$f":"SUMIFS(VENTE!$G$4:$G$75000,X!$B$4:$B$75000,A7)","v":111717.7},{"$f":"SUMIFS(ACHAT!$D$5:$D$75000,ACHAT!$C$5:$C$75000,XML!$I$2,X!$D$5:$D$75000,A7,ACHAT!$J$5:$J$75000,XML!$J$2)","v":441.35},{"$f":"SUMIFS(ACHAT!$D$5:$D$75000,ACHAT!$C$5:$C$75000,XML!$I$4,X!$D$5:$D$75000,A7,ACHAT!$J$5:$J$75000,XML!$J$4)","v":0},{"$f":"SUMIFS(ACHAT!$D$5:$D$75000,ACHAT!$C$5:$C$75000,XML!$I$3,X!$D$5:$D$75000,A7,ACHAT!$J$5:$J$75000,XML!$J$3)","v":20},{"$f":"SUMIFS(ACHAT!$D$5:$D$75000,ACHAT!$C$5:$C$75000,XML!$I$8,X!$D$5:$D$75000,A7,ACHAT!$J$5:$J$75000,XML!$J$8)","v":91546.82},{"$f":"SUMIFS(ACHAT!$D$5:$D$75000,ACHAT!$C$5:$C$75000,XML!$I$5,X!$D$5:$D$75000,A7,ACHAT!$J$5:$J$75000,XML!$J$5)","v":0},{"$f":"SUMIFS(ACHAT!$D$5:$D$75000,ACHAT!$C$5:$C$75000,XML!$I$6,X!$D$5:$D$75000,A7,ACHAT!$J$5:$J$75000,XML!$J$5)","v":0},{"$f":"SUMIFS(ACHAT!$D$5:$D$75000,ACHAT!$C$5:$C$75000,XML!$I$7,X!$D$5:$D$75000,A7,ACHAT!$J$5:$J$75000,XML!$J$7)","v":0},92008.17,{"$f":"SUMIFS(VENTE!$G$4:$G$75000,X!$C$4:$C$75000,A7,VENTE!$K$4:$K$75000,\"1\")","v":26933.5},{"$f":"SUMIFS(VENTE!$G$4:$G$75000,X!$C$4:$C$75000,A7,VENTE!$K$4:$K$75000,\"2\")+SUMIFS(VENTE!$G$4:$G$75000,X!$C$4:$C$75000,A7,VENTE!$K$4:$K$75000,\"3\")+SUMIFS(VENTE!$G$4:$G$75000,X!$C$4:$C$75000,A7,VENTE!$K$4:$K$75000,\"4\")+SUMIFS(VENTE!$G$4:$G$75000,X!$C$4:$C$75000,A7,VENTE!$K$4:$K$75000,\"5\")+SUMIFS(VENTE!$G$4:$G$75000,X!$C$4:$C$75000,A7,VENTE!$K$4:$K$75000,\"6\")+SUMIFS(VENTE!$G$4:$G$75000,X!$C$4:$C$75000,A7,VENTE!$K$4:$K$75000,\"7\")","v":69815.3},{"$f":"Tableau39[[#This Row],[Total Espéces]]+N7","v":96748.800000000003}]
[{"$f":"RECAP!A9","v":"2016-04-01"},{"$f":"SUMIFS(VENTE!$D$4:$D$75000,X!$B$4:$B$75000,A8)","v":67223.75},{"$f":"SUMIFS(VENTE!$F$4:$F$75000,X!$B$4:$B$75000,A8)","v":13444.75},{"$f":"SUMIFS(VENTE!$G$4:$G$75000,X!$B$4:$B$75000,A8)","v":80668.5},{"$f":"SUMIFS(ACHAT!$D$5:$D$75000,ACHAT!$C$5:$C$75000,XML!$I$2,X!$D$5:$D$75000,A8,ACHAT!$J$5:$J$75000,XML!$J$2)","v":420.5},{"$f":"SUMIFS(ACHAT!$D$5:$D$75000,ACHAT!$C$5:$C$75000,XML!$I$4,X!$D$5:$D$75000,A8,ACHAT!$J$5:$J$75000,XML!$J$4)","v":0},{"$f":"SUMIFS(ACHAT!$D$5:$D$75000,ACHAT!$C$5:$C$75000,XML!$I$3,X!$D$5:$D$75000,A8,ACHAT!$J$5:$J$75000,XML!$J$3)","v":0},{"$f":"SUMIFS(ACHAT!$D$5:$D$75000,ACHAT!$C$5:$C$75000,XML!$I$8,X!$D$5:$D$75000,A8,ACHAT!$J$5:$J$75000,XML!$J$8)","v":34042.51},{"$f":"SUMIFS(ACHAT!$D$5:$D$75000,ACHAT!$C$5:$C$75000,XML!$I$5,X!$D$5:$D$75000,A8,ACHAT!$J$5:$J$75000,XML!$J$5)","v":0},{"$f":"SUMIFS(ACHAT!$D$5:$D$75000,ACHAT!$C$5:$C$75000,XML!$I$6,X!$D$5:$D$75000,A8,ACHAT!$J$5:$J$75000,XML!$J$5)","v":0},{"$f":"SUMIFS(ACHAT!$D$5:$D$75000,ACHAT!$C$5:$C$75000,XML!$I$7,X!$D$5:$D$75000,A8,ACHAT!$J$5:$J$75000,XML!$J$7)","v":0},34463.01,{"$f":"SUMIFS(VENTE!$G$4:$G$75000,X!$C$4:$C$75000,A8,VENTE!$K$4:$K$75000,\"1\")","v":11080.5},{"$f":"SUMIFS(VENTE!$G$4:$G$75000,X!$C$4:$C$75000,A8,VENTE!$K$4:$K$75000,\"2\")+SUMIFS(VENTE!$G$4:$G$75000,X!$C$4:$C$75000,A8,VENTE!$K$4:$K$75000,\"3\")+SUMIFS(VENTE!$G$4:$G$75000,X!$C$4:$C$75000,A8,VENTE!$K$4:$K$75000,\"4\")+SUMIFS(VENTE!$G$4:$G$75000,X!$C$4:$C$75000,A8,VENTE!$K$4:$K$75000,\"5\")+SUMIFS(VENTE!$G$4:$G$75000,X!$C$4:$C$75000,A8,VENTE!$K$4:$K$75000,\"6\")+SUMIFS(VENTE!$G$4:$G$75000,X!$C$4:$C$75000,A8,VENTE!$K$4:$K$75000,\"7\")","v":75915.100000000006},{"$f":"Tableau39[[#This Row],[Total Espéces]]+N8","v":86995.6}]
[{"$f":"RECAP!A10","v":"2016-05-01"},{"$f":"SUMIFS(VENTE!$D$4:$D$75000,X!$B$4:$B$75000,A9)","v":30045.69},{"$f":"SUMIFS(VENTE!$F$4:$F$75000,X!$B$4:$B$75000,A9)","v":6009.11},{"$f":"SUMIFS(VENTE!$G$4:$G$75000,X!$B$4:$B$75000,A9)","v":36054.800000000003},{"$f":"SUMIFS(ACHAT!$D$5:$D$75000,ACHAT!$C$5:$C$75000,XML!$I$2,X!$D$5:$D$75000,A9,ACHAT!$J$5:$J$75000,XML!$J$2)","v":251.5},{"$f":"SUMIFS(ACHAT!$D$5:$D$75000,ACHAT!$C$5:$C$75000,XML!$I$4,X!$D$5:$D$75000,A9,ACHAT!$J$5:$J$75000,XML!$J$4)","v":0},{"$f":"SUMIFS(ACHAT!$D$5:$D$75000,ACHAT!$C$5:$C$75000,XML!$I$3,X!$D$5:$D$75000,A9,ACHAT!$J$5:$J$75000,XML!$J$3)","v":30},{"$f":"SUMIFS(ACHAT!$D$5:$D$75000,ACHAT!$C$5:$C$75000,XML!$I$8,X!$D$5:$D$75000,A9,ACHAT!$J$5:$J$75000,XML!$J$8)","v":60986.26},{"$f":"SUMIFS(ACHAT!$D$5:$D$75000,ACHAT!$C$5:$C$75000,XML!$I$5,X!$D$5:$D$75000,A9,ACHAT!$J$5:$J$75000,XML!$J$5)","v":0},{"$f":"SUMIFS(ACHAT!$D$5:$D$75000,ACHAT!$C$5:$C$75000,XML!$I$6,X!$D$5:$D$75000,A9,ACHAT!$J$5:$J$75000,XML!$J$5)","v":0},{"$f":"SUMIFS(ACHAT!$D$5:$D$75000,ACHAT!$C$5:$C$75000,XML!$I$7,X!$D$5:$D$75000,A9,ACHAT!$J$5:$J$75000,XML!$J$7)","v":0},61267.76,{"$f":"SUMIFS(VENTE!$G$4:$G$75000,X!$C$4:$C$75000,A9,VENTE!$K$4:$K$75000,\"1\")","v":9482.4},{"$f":"SUMIFS(VENTE!$G$4:$G$75000,X!$C$4:$C$75000,A9,VENTE!$K$4:$K$75000,\"2\")+SUMIFS(VENTE!$G$4:$G$75000,X!$C$4:$C$75000,A9,VENTE!$K$4:$K$75000,\"3\")+SUMIFS(VENTE!$G$4:$G$75000,X!$C$4:$C$75000,A9,VENTE!$K$4:$K$75000,\"4\")+SUMIFS(VENTE!$G$4:$G$75000,X!$C$4:$C$75000,A9,VENTE!$K$4:$K$75000,\"5\")+SUMIFS(VENTE!$G$4:$G$75000,X!$C$4:$C$75000,A9,VENTE!$K$4:$K$75000,\"6\")+SUMIFS(VENTE!$G$4:$G$75000,X!$C$4:$C$75000,A9,VENTE!$K$4:$K$75000,\"7\")","v":25785.1},{"$f":"Tableau39[[#This Row],[Total Espéces]]+N9","v":35267.5}]
[{"$f":"RECAP!A11","v":"2016-06-01"},{"$f":"SUMIFS(VENTE!$D$4:$D$75000,X!$B$4:$B$75000,A10)","v":37841.67},{"$f":"SUMIFS(VENTE!$F$4:$F$75000,X!$B$4:$B$75000,A10)","v":7568.33},{"$f":"SUMIFS(VENTE!$G$4:$G$75000,X!$B$4:$B$75000,A10)","v":45410},{"$f":"SUMIFS(ACHAT!$D$5:$D$75000,ACHAT!$C$5:$C$75000,XML!$I$2,X!$D$5:$D$75000,A10,ACHAT!$J$5:$J$75000,XML!$J$2)","v":334},{"$f":"SUMIFS(ACHAT!$D$5:$D$75000,ACHAT!$C$5:$C$75000,XML!$I$4,X!$D$5:$D$75000,A10,ACHAT!$J$5:$J$75000,XML!$J$4)","v":0},{"$f":"SUMIFS(ACHAT!$D$5:$D$75000,ACHAT!$C$5:$C$75000,XML!$I$3,X!$D$5:$D$75000,A10,ACHAT!$J$5:$J$75000,XML!$J$3)","v":0},{"$f":"SUMIFS(ACHAT!$D$5:$D$75000,ACHAT!$C$5:$C$75000,XML!$I$8,X!$D$5:$D$75000,A10,ACHAT!$J$5:$J$75000,XML!$J$8)","v":32853.33},{"$f":"SUMIFS(ACHAT!$D$5:$D$75000,ACHAT!$C$5:$C$75000,XML!$I$5,X!$D$5:$D$75000,A10,ACHAT!$J$5:$J$75000,XML!$J$5)","v":0},{"$f":"SUMIFS(ACHAT!$D$5:$D$75000,ACHAT!$C$5:$C$75000,XML!$I$6,X!$D$5:$D$75000,A10,ACHAT!$J$5:$J$75000,XML!$J$5)","v":0},{"$f":"SUMIFS(ACHAT!$D$5:$D$75000,ACHAT!$C$5:$C$75000,XML!$I$7,X!$D$5:$D$75000,A10,ACHAT!$J$5:$J$75000,XML!$J$7)","v":0},33187.33,{"$f":"SUMIFS(VENTE!$G$4:$G$75000,X!$C$4:$C$75000,A10,VENTE!$K$4:$K$75000,\"1\")","v":26486.5},{"$f":"SUMIFS(VENTE!$G$4:$G$75000,X!$C$4:$C$75000,A10,VENTE!$K$4:$K$75000,\"2\")+SUMIFS(VENTE!$G$4:$G$75000,X!$C$4:$C$75000,A10,VENTE!$K$4:$K$75000,\"3\")+SUMIFS(VENTE!$G$4:$G$75000,X!$C$4:$C$75000,A10,VENTE!$K$4:$K$75000,\"4\")+SUMIFS(VENTE!$G$4:$G$75000,X!$C$4:$C$75000,A10,VENTE!$K$4:$K$75000,\"5\")+SUMIFS(VENTE!$G$4:$G$75000,X!$C$4:$C$75000,A10,VENTE!$K$4:$K$75000,\"6\")+SUMIFS(VENTE!$G$4:$G$75000,X!$C$4:$C$75000,A10,VENTE!$K$4:$K$75000,\"7\")","v":13484},{"$f":"Tableau39[[#This Row],[Total Espéces]]+N10","v":39970.5}]
[{"$f":"RECAP!A12","v":"2016-07-01"},{"$f":"SUMIFS(VENTE!$D$4:$D$75000,X!$B$4:$B$75000,A11)","v":51891.82},{"$f":"SUMIFS(VENTE!$F$4:$F$75000,X!$B$4:$B$75000,A11)","v":10378.379999999999},{"$f":"SUMIFS(VENTE!$G$4:$G$75000,X!$B$4:$B$75000,A11)","v":62270.2},{"$f":"SUMIFS(ACHAT!$D$5:$D$75000,ACHAT!$C$5:$C$75000,XML!$I$2,X!$D$5:$D$75000,A11,ACHAT!$J$5:$J$75000,XML!$J$2)","v":334},{"$f":"SUMIFS(ACHAT!$D$5:$D$75000,ACHAT!$C$5:$C$75000,XML!$I$4,X!$D$5:$D$75000,A11,ACHAT!$J$5:$J$75000,XML!$J$4)","v":0},{"$f":"SUMIFS(ACHAT!$D$5:$D$75000,ACHAT!$C$5:$C$75000,XML!$I$3,X!$D$5:$D$75000,A11,ACHAT!$J$5:$J$75000,XML!$J$3)","v":0},{"$f":"SUMIFS(ACHAT!$D$5:$D$75000,ACHAT!$C$5:$C$75000,XML!$I$8,X!$D$5:$D$75000,A11,ACHAT!$J$5:$J$75000,XML!$J$8)","v":32110.84},{"$f":"SUMIFS(ACHAT!$D$5:$D$75000,ACHAT!$C$5:$C$75000,XML!$I$5,X!$D$5:$D$75000,A11,ACHAT!$J$5:$J$75000,XML!$J$5)","v":0},{"$f":"SUMIFS(ACHAT!$D$5:$D$75000,ACHAT!$C$5:$C$75000,XML!$I$6,X!$D$5:$D$75000,A11,ACHAT!$J$5:$J$75000,XML!$J$5)","v":0},{"$f":"SUMIFS(ACHAT!$D$5:$D$75000,ACHAT!$C$5:$C$75000,XML!$I$7,X!$D$5:$D$75000,A11,ACHAT!$J$5:$J$75000,XML!$J$7)","v":0},32444.84,{"$f":"SUMIFS(VENTE!$G$4:$G$75000,X!$C$4:$C$75000,A11,VENTE!$K$4:$K$75000,\"1\")","v":6677.7},{"$f":"SUMIFS(VENTE!$G$4:$G$75000,X!$C$4:$C$75000,A11,VENTE!$K$4:$K$75000,\"2\")+SUMIFS(VENTE!$G$4:$G$75000,X!$C$4:$C$75000,A11,VENTE!$K$4:$K$75000,\"3\")+SUMIFS(VENTE!$G$4:$G$75000,X!$C$4:$C$75000,A11,VENTE!$K$4:$K$75000,\"4\")+SUMIFS(VENTE!$G$4:$G$75000,X!$C$4:$C$75000,A11,VENTE!$K$4:$K$75000,\"5\")+SUMIFS(VENTE!$G$4:$G$75000,X!$C$4:$C$75000,A11,VENTE!$K$4:$K$75000,\"6\")+SUMIFS(VENTE!$G$4:$G$75000,X!$C$4:$C$75000,A11,VENTE!$K$4:$K$75000,\"7\")","v":100275},{"$f":"Tableau39[[#This Row],[Total Espéces]]+N11","v":106952.7}]
[{"$f":"RECAP!A13","v":"2016-08-01"},{"$f":"SUMIFS(VENTE!$D$4:$D$75000,X!$B$4:$B$75000,A12)","v":37299.83},{"$f":"SUMIFS(VENTE!$F$4:$F$75000,X!$B$4:$B$75000,A12)","v":7459.97},{"$f":"SUMIFS(VENTE!$G$4:$G$75000,X!$B$4:$B$75000,A12)","v":44759.8},{"$f":"SUMIFS(ACHAT!$D$5:$D$75000,ACHAT!$C$5:$C$75000,XML!$I$2,X!$D$5:$D$75000,A12,ACHAT!$J$5:$J$75000,XML!$J$2)","v":350.65},{"$f":"SUMIFS(ACHAT!$D$5:$D$75000,ACHAT!$C$5:$C$75000,XML!$I$4,X!$D$5:$D$75000,A12,ACHAT!$J$5:$J$75000,XML!$J$4)","v":0},{"$f":"SUMIFS(ACHAT!$D$5:$D$75000,ACHAT!$C$5:$C$75000,XML!$I$3,X!$D$5:$D$75000,A12,ACHAT!$J$5:$J$75000,XML!$J$3)","v":0},{"$f":"SUMIFS(ACHAT!$D$5:$D$75000,ACHAT!$C$5:$C$75000,XML!$I$8,X!$D$5:$D$75000,A12,ACHAT!$J$5:$J$75000,XML!$J$8)","v":61062.67},{"$f":"SUMIFS(ACHAT!$D$5:$D$75000,ACHAT!$C$5:$C$75000,XML!$I$5,X!$D$5:$D$75000,A12,ACHAT!$J$5:$J$75000,XML!$J$5)","v":0},{"$f":"SUMIFS(ACHAT!$D$5:$D$75000,ACHAT!$C$5:$C$75000,XML!$I$6,X!$D$5:$D$75000,A12,ACHAT!$J$5:$J$75000,XML!$J$5)","v":0},{"$f":"SUMIFS(ACHAT!$D$5:$D$75000,ACHAT!$C$5:$C$75000,XML!$I$7,X!$D$5:$D$75000,A12,ACHAT!$J$5:$J$75000,XML!$J$7)","v":0},61413.32,{"$f":"SUMIFS(VENTE!$G$4:$G$75000,X!$C$4:$C$75000,A12,VENTE!$K$4:$K$75000,\"1\")","v":15312.3},{"$f":"SUMIFS(VENTE!$G$4:$G$75000,X!$C$4:$C$75000,A12,VENTE!$K$4:$K$75000,\"2\")+SUMIFS(VENTE!$G$4:$G$75000,X!$C$4:$C$75000,A12,VENTE!$K$4:$K$75000,\"3\")+SUMIFS(VENTE!$G$4:$G$75000,X!$C$4:$C$75000,A12,VENTE!$K$4:$K$75000,\"4\")+SUMIFS(VENTE!$G$4:$G$75000,X!$C$4:$C$75000,A12,VENTE!$K$4:$K$75000,\"5\")+SUMIFS(VENTE!$G$4:$G$75000,X!$C$4:$C$75000,A12,VENTE!$K$4:$K$75000,\"6\")+SUMIFS(VENTE!$G$4:$G$75000,X!$C$4:$C$75000,A12,VENTE!$K$4:$K$75000,\"7\")","v":38219},{"$f":"Tableau39[[#This Row],[Total Espéces]]+N12","v":53531.3}]
[{"$f":"RECAP!A14","v":"2016-09-01"},{"$f":"SUMIFS(VENTE!$D$4:$D$75000,X!$B$4:$B$75000,A13)","v":45777.3},{"$f":"SUMIFS(VENTE!$F$4:$F$75000,X!$B$4:$B$75000,A13)","v":9155.4599999999991},{"$f":"SUMIFS(VENTE!$G$4:$G$75000,X!$B$4:$B$75000,A13)","v":54932.76},{"$f":"SUMIFS(ACHAT!$D$5:$D$75000,ACHAT!$C$5:$C$75000,XML!$I$2,X!$D$5:$D$75000,A13,ACHAT!$J$5:$J$75000,XML!$J$2)","v":334},{"$f":"SUMIFS(ACHAT!$D$5:$D$75000,ACHAT!$C$5:$C$75000,XML!$I$4,X!$D$5:$D$75000,A13,ACHAT!$J$5:$J$75000,XML!$J$4)","v":0},{"$f":"SUMIFS(ACHAT!$D$5:$D$75000,ACHAT!$C$5:$C$75000,XML!$I$3,X!$D$5:$D$75000,A13,ACHAT!$J$5:$J$75000,XML!$J$3)","v":0},{"$f":"SUMIFS(ACHAT!$D$5:$D$75000,ACHAT!$C$5:$C$75000,XML!$I$8,X!$D$5:$D$75000,A13,ACHAT!$J$5:$J$75000,XML!$J$8)","v":33328.339999999997},{"$f":"SUMIFS(ACHAT!$D$5:$D$75000,ACHAT!$C$5:$C$75000,XML!$I$5,X!$D$5:$D$75000,A13,ACHAT!$J$5:$J$75000,XML!$J$5)","v":0},{"$f":"SUMIFS(ACHAT!$D$5:$D$75000,ACHAT!$C$5:$C$75000,XML!$I$6,X!$D$5:$D$75000,A13,ACHAT!$J$5:$J$75000,XML!$J$5)","v":0},{"$f":"SUMIFS(ACHAT!$D$5:$D$75000,ACHAT!$C$5:$C$75000,XML!$I$7,X!$D$5:$D$75000,A13,ACHAT!$J$5:$J$75000,XML!$J$7)","v":0},33662.339999999997,{"$f":"SUMIFS(VENTE!$G$4:$G$75000,X!$C$4:$C$75000,A13,VENTE!$K$4:$K$75000,\"1\")","v":22239.8},{"$f":"SUMIFS(VENTE!$G$4:$G$75000,X!$C$4:$C$75000,A13,VENTE!$K$4:$K$75000,\"2\")+SUMIFS(VENTE!$G$4:$G$75000,X!$C$4:$C$75000,A13,VENTE!$K$4:$K$75000,\"3\")+SUMIFS(VENTE!$G$4:$G$75000,X!$C$4:$C$75000,A13,VENTE!$K$4:$K$75000,\"4\")+SUMIFS(VENTE!$G$4:$G$75000,X!$C$4:$C$75000,A13,VENTE!$K$4:$K$75000,\"5\")+SUMIFS(VENTE!$G$4:$G$75000,X!$C$4:$C$75000,A13,VENTE!$K$4:$K$75000,\"6\")+SUMIFS(VENTE!$G$4:$G$75000,X!$C$4:$C$75000,A13,VENTE!$K$4:$K$75000,\"7\")","v":20789.96},{"$f":"Tableau39[[#This Row],[Total Espéces]]+N13","v":43029.760000000002}]
[{"$f":"RECAP!A15","v":"2016-10-01"},{"$f":"SUMIFS(VENTE!$D$4:$D$75000,X!$B$4:$B$75000,A14)","v":38570.6},{"$f":"SUMIFS(VENTE!$F$4:$F$75000,X!$B$4:$B$75000,A14)","v":7714.12},{"$f":"SUMIFS(VENTE!$G$4:$G$75000,X!$B$4:$B$75000,A14)","v":46284.71},{"$f":"SUMIFS(ACHAT!$D$5:$D$75000,ACHAT!$C$5:$C$75000,XML!$I$2,X!$D$5:$D$75000,A14,ACHAT!$J$5:$J$75000,XML!$J$2)","v":334},{"$f":"SUMIFS(ACHAT!$D$5:$D$75000,ACHAT!$C$5:$C$75000,XML!$I$4,X!$D$5:$D$75000,A14,ACHAT!$J$5:$J$75000,XML!$J$4)","v":0},{"$f":"SUMIFS(ACHAT!$D$5:$D$75000,ACHAT!$C$5:$C$75000,XML!$I$3,X!$D$5:$D$75000,A14,ACHAT!$J$5:$J$75000,XML!$J$3)","v":0},{"$f":"SUMIFS(ACHAT!$D$5:$D$75000,ACHAT!$C$5:$C$75000,XML!$I$8,X!$D$5:$D$75000,A14,ACHAT!$J$5:$J$75000,XML!$J$8)","v":52873.22},{"$f":"SUMIFS(ACHAT!$D$5:$D$75000,ACHAT!$C$5:$C$75000,XML!$I$5,X!$D$5:$D$75000,A14,ACHAT!$J$5:$J$75000,XML!$J$5)","v":0},{"$f":"SUMIFS(ACHAT!$D$5:$D$75000,ACHAT!$C$5:$C$75000,XML!$I$6,X!$D$5:$D$75000,A14,ACHAT!$J$5:$J$75000,XML!$J$5)","v":0},{"$f":"SUMIFS(ACHAT!$D$5:$D$75000,ACHAT!$C$5:$C$75000,XML!$I$7,X!$D$5:$D$75000,A14,ACHAT!$J$5:$J$75000,XML!$J$7)","v":0},53207.22,{"$f":"SUMIFS(VENTE!$G$4:$G$75000,X!$C$4:$C$75000,A14,VENTE!$K$4:$K$75000,\"1\")","v":21494.41},{"$f":"SUMIFS(VENTE!$G$4:$G$75000,X!$C$4:$C$75000,A14,VENTE!$K$4:$K$75000,\"2\")+SUMIFS(VENTE!$G$4:$G$75000,X!$C$4:$C$75000,A14,VENTE!$K$4:$K$75000,\"3\")+SUMIFS(VENTE!$G$4:$G$75000,X!$C$4:$C$75000,A14,VENTE!$K$4:$K$75000,\"4\")+SUMIFS(VENTE!$G$4:$G$75000,X!$C$4:$C$75000,A14,VENTE!$K$4:$K$75000,\"5\")+SUMIFS(VENTE!$G$4:$G$75000,X!$C$4:$C$75000,A14,VENTE!$K$4:$K$75000,\"6\")+SUMIFS(VENTE!$G$4:$G$75000,X!$C$4:$C$75000,A14,VENTE!$K$4:$K$75000,\"7\")","v":12961.8},{"$f":"Tableau39[[#This Row],[Total Espéces]]+N14","v":34456.21}]
[{"$f":"RECAP!A16","v":"2016-11-01"},{"$f":"SUMIFS(VENTE!$D$4:$D$75000,X!$B$4:$B$75000,A15)","v":41107.58},{"$f":"SUMIFS(VENTE!$F$4:$F$75000,X!$B$4:$B$75000,A15)","v":8221.52},{"$f":"SUMIFS(VENTE!$G$4:$G$75000,X!$B$4:$B$75000,A15)","v":49329.1},{"$f":"SUMIFS(ACHAT!$D$5:$D$75000,ACHAT!$C$5:$C$75000,XML!$I$2,X!$D$5:$D$75000,A15,ACHAT!$J$5:$J$75000,XML!$J$2)","v":334},{"$f":"SUMIFS(ACHAT!$D$5:$D$75000,ACHAT!$C$5:$C$75000,XML!$I$4,X!$D$5:$D$75000,A15,ACHAT!$J$5:$J$75000,XML!$J$4)","v":0},{"$f":"SUMIFS(ACHAT!$D$5:$D$75000,ACHAT!$C$5:$C$75000,XML!$I$3,X!$D$5:$D$75000,A15,ACHAT!$J$5:$J$75000,XML!$J$3)","v":0},{"$f":"SUMIFS(ACHAT!$D$5:$D$75000,ACHAT!$C$5:$C$75000,XML!$I$8,X!$D$5:$D$75000,A15,ACHAT!$J$5:$J$75000,XML!$J$8)","v":32169.25},{"$f":"SUMIFS(ACHAT!$D$5:$D$75000,ACHAT!$C$5:$C$75000,XML!$I$5,X!$D$5:$D$75000,A15,ACHAT!$J$5:$J$75000,XML!$J$5)","v":0},{"$f":"SUMIFS(ACHAT!$D$5:$D$75000,ACHAT!$C$5:$C$75000,XML!$I$6,X!$D$5:$D$75000,A15,ACHAT!$J$5:$J$75000,XML!$J$5)","v":0},{"$f":"SUMIFS(ACHAT!$D$5:$D$75000,ACHAT!$C$5:$C$75000,XML!$I$7,X!$D$5:$D$75000,A15,ACHAT!$J$5:$J$75000,XML!$J$7)","v":0},32503.25,{"$f":"SUMIFS(VENTE!$G$4:$G$75000,X!$C$4:$C$75000,A15,VENTE!$K$4:$K$75000,\"1\")","v":18000.8},{"$f":"SUMIFS(VENTE!$G$4:$G$75000,X!$C$4:$C$75000,A15,VENTE!$K$4:$K$75000,\"2\")+SUMIFS(VENTE!$G$4:$G$75000,X!$C$4:$C$75000,A15,VENTE!$K$4:$K$75000,\"3\")+SUMIFS(VENTE!$G$4:$G$75000,X!$C$4:$C$75000,A15,VENTE!$K$4:$K$75000,\"4\")+SUMIFS(VENTE!$G$4:$G$75000,X!$C$4:$C$75000,A15,VENTE!$K$4:$K$75000,\"5\")+SUMIFS(VENTE!$G$4:$G$75000,X!$C$4:$C$75000,A15,VENTE!$K$4:$K$75000,\"6\")+SUMIFS(VENTE!$G$4:$G$75000,X!$C$4:$C$75000,A15,VENTE!$K$4:$K$75000,\"7\")","v":13263.4},{"$f":"Tableau39[[#This Row],[Total Espéces]]+N15","v":31264.2}]
[{"$f":"RECAP!A17","v":"2016-12-01"},{"$f":"SUMIFS(VENTE!$D$4:$D$75000,X!$B$4:$B$75000,A16)","v":61566.9},{"$f":"SUMIFS(VENTE!$F$4:$F$75000,X!$B$4:$B$75000,A16)","v":12313.38},{"$f":"SUMIFS(VENTE!$G$4:$G$75000,X!$B$4:$B$75000,A16)","v":73880.27},{"$f":"SUMIFS(ACHAT!$D$5:$D$75000,ACHAT!$C$5:$C$75000,XML!$I$2,X!$D$5:$D$75000,A16,ACHAT!$J$5:$J$75000,XML!$J$2)","v":165},{"$f":"SUMIFS(ACHAT!$D$5:$D$75000,ACHAT!$C$5:$C$75000,XML!$I$4,X!$D$5:$D$75000,A16,ACHAT!$J$5:$J$75000,XML!$J$4)","v":0},{"$f":"SUMIFS(ACHAT!$D$5:$D$75000,ACHAT!$C$5:$C$75000,XML!$I$3,X!$D$5:$D$75000,A16,ACHAT!$J$5:$J$75000,XML!$J$3)","v":0},{"$f":"SUMIFS(ACHAT!$D$5:$D$75000,ACHAT!$C$5:$C$75000,XML!$I$8,X!$D$5:$D$75000,A16,ACHAT!$J$5:$J$75000,XML!$J$8)","v":39700.18},{"$f":"SUMIFS(ACHAT!$D$5:$D$75000,ACHAT!$C$5:$C$75000,XML!$I$5,X!$D$5:$D$75000,A16,ACHAT!$J$5:$J$75000,XML!$J$5)","v":0},{"$f":"SUMIFS(ACHAT!$D$5:$D$75000,ACHAT!$C$5:$C$75000,XML!$I$6,X!$D$5:$D$75000,A16,ACHAT!$J$5:$J$75000,XML!$J$5)","v":0},{"$f":"SUMIFS(ACHAT!$D$5:$D$75000,ACHAT!$C$5:$C$75000,XML!$I$7,X!$D$5:$D$75000,A16,ACHAT!$J$5:$J$75000,XML!$J$7)","v":6666.67},46531.85,{"$f":"SUMIFS(VENTE!$G$4:$G$75000,X!$C$4:$C$75000,A16,VENTE!$K$4:$K$75000,\"1\")","v":37025.269999999997},{"$f":"SUMIFS(VENTE!$G$4:$G$75000,X!$C$4:$C$75000,A16,VENTE!$K$4:$K$75000,\"2\")+SUMIFS(VENTE!$G$4:$G$75000,X!$C$4:$C$75000,A16,VENTE!$K$4:$K$75000,\"3\")+SUMIFS(VENTE!$G$4:$G$75000,X!$C$4:$C$75000,A16,VENTE!$K$4:$K$75000,\"4\")+SUMIFS(VENTE!$G$4:$G$75000,X!$C$4:$C$75000,A16,VENTE!$K$4:$K$75000,\"5\")+SUMIFS(VENTE!$G$4:$G$75000,X!$C$4:$C$75000,A16,VENTE!$K$4:$K$75000,\"6\")+SUMIFS(VENTE!$G$4:$G$75000,X!$C$4:$C$75000,A16,VENTE!$K$4:$K$75000,\"7\")","v":50162.5},{"$f":"Tableau39[[#This Row],[Total Espéces]]+N16","v":87187.77}]
["Total",{"$f":"SUBTOTAL(109,[Vente HT])","v":624044.99},{"$f":"SUBTOTAL(109,[Tva Vente])","v":124808.97},{"$f":"SUBTOTAL(109,[Vente TTC])","v":748853.94},{"$f":"SUBTOTAL(109,[Pres serv 20%])","v":3971},{"$f":"SUBTOTAL(109,[Transp 14% ])","v":0},{"$f":"SUBTOTAL(109,[Op Bq 10%])","v":56},{"$f":"SUBTOTAL(109,[March 20%])","v":580244.67000000004},{"$f":"SUBTOTAL(109,[Services 7%])","v":0},{"$f":"SUBTOTAL(109,[Elect 14%])","v":0},{"$f":"SUBTOTAL(109,[Immob 20%])","v":6666.67},{"$f":"SUBTOTAL(109,[Total Achat HT])","v":590938.34},{"$f":"SUBTOTAL(109,[Total Espéces])","v":261583.38},{"$f":"SUBTOTAL(109,[Total Chq Effet et Autres])","v":506119.86},{"$f":"SUBTOTAL(109,[Ventes Déclaré TTC])","v":767703.24}]

{"sheet":"XML","index":4,"n_rows":1028,"n_cols":649,"rows_kept":1028,"cut":false,"hidden":false,"merged":[[5,3,5,7],[8,0,8,2],[5,0,5,1],[2,0,2,1],[3,0,3,1],[4,0,4,1],[6,0,6,1],[7,0,7,1]]}
[null,null,null,null,null,null,null,null,"Designation","Taux","T.HT","T.TVA","T.TTC",null,null,null,null,null,null,null,null,null,null,null,null,null,null,null,null,null,null,null,null,null,null,null,null,null,null,null,null,null,null,null,null,null,null,null,null,null,null,null,null,null,null,null,null,null,null,null,null,null,null,null,null,null,null,null,null,null,null,null,null,null,null,null,null,null,null,null,null,null,null,null,null,null,null,null,null,null,null,null,null,null,null,null,null,null,null,null,null,null,null,null,null,null,null,null,null,null,null,null,null,null,null,null,null,null,null,null,null,null,null,null,null,null,null,null,null,null,null,null,null,null,null,null,null,null,null,null,null,null,null,null,null,null,null,null,null,null,null,null,null,null,null,null,null,null,null,null,null,null,null,null,null,null,null,null,null,null,null,null,null,null,null,null,null,null,null,null,null,null,null,null,null,null,null,null,null,null,null,null,null,null,null,null,null,null,null,null,null,null,null,null,null,null,null,null,null,null,null,null,null,null,null,null,null,null,null,null,null,null,null,null,null,null,null,null,null,null,null,null,null,null,null,null,null,null,null,null,null,null,null,null,null,null,null,null,null,null,null,null,null,null,null,null,null,null,null,null,null,null,null,null,null,null,null,null,null,null,null,null,null,null,null,null,null,null,null,null,null,null,null,null,null,null,null,null,null,null,null,null,null,null,null,null,null,null,null,null,null,null,null,null,null,null,null,null,null,null,null,null,null,null,null,null,null,null,null,null,null,null,null,null,null,null,null,null,null,null,null,null,null,null,null,null,null,null,null,null,null,null,null,null,null,null,null,null,null,null,null,null,null,null,null,null,null,null,null,null,null,null,null,null,null,null,null,null,null,null,null,null,null,null,null,null,null,null,null,null,null,null,null,null,null,null,null,null,null,null,null,null,null,null,null,null,null,null,null,null,null,null,null,null,null,null,null,null,null,null,null,null,null,null,null,null,null,null,null,null,null,null,null,null,null,null,null,null,null,null,null,null,null,null,null,null,null,null,null,null,null,null,null,null,null,null,null,null,null,null,null,null,null,null,null,null,null,null,null,null,null,null,null,null,null,null,null,null,null,null,null,null,null,null,null,null,null,null,null,null,null,null,null,null,null,null,null,null,null,null,null,null,null,null,null,null,null,null,null,null,null,null,null,null,null,null,null,null,null,null,null,null,null,null,null,null,null,null,null,null,null,null,null,null,null,null,null,null,null,null,null,null,null,null,null,null,null,null,null,null,null,null,null,null,null,null,null,null,null,null,null,null,null,null,null,null,null,null,null,null,null,null,null,null,null,null,null,null,null,null,null,null,null,null,null,null,null,null,null,null,null,null,null,null,null,null,null,null,null,null,null,null,null,null,null,null,null,null,null,null,null,null,null,null,null,null,null,null,null,null,null,null,null,null,null,null,null,null,null,null,null,null,null,null,null,null,null,null,null,null,null,null,null,null,null,null,null,null,null,null,null,null,null,null,null,null,null,4,{"$f":"INDEX(RECAP!$A$6:$A$17,XX1)","v":"2016-04-01"}]
[null,null,null,null,null,null,null,null,"PRES DE SERVICES",0.2,{"$f":"SUMIFS($D$11:$D$42577,$J$11:$J$42577,$J2,$C$11:$C$42577,$I2)","v":5952.99},{"$f":"SUMIFS($E$11:$E$42577,$J$11:$J$42577,$J2,$C$11:$C$42577,$I2)","v":1190.5999999999999},{"$f":"SUMIFS($F$11:$F$42577,$J$11:$J$42577,$J2,$C$11:$C$42577,$I2)","v":7143.59}]
["MOIS DE DECLARATION",null,null,null,null,null,null,null,"OP DE BANQUE",0.1,0,0,0]
["RAISON SOCIAL",null,null,null,null,null,null,null,"TRANSPORT",0.14000000000000001,0,0,0]
["ID_FISCAL",null,65760124,null,null,null,null,null,"EAU ",7.0000000000000007E-2,0,0,0]
["ANNEE",null,{"$f":"YEAR(XY1)","v":2016},"TABLEAU DE DEDUCTION TVA",null,null,null,null,"ELECTRICITE",0.14000000000000001,843.06,133.03,1011.66]
["PERIODE(Mens)",null,{"$f":"MONTH(XY1)","v":4},null,null,null,null,null,"IMMOBILISATION",0.2,0,0,0]
["REGIME(Encais-1)",null,1,null,null,null,null,null,"MARCHANDISES",0.2,63613.51,12722.69,76336.2]
["Total",null,null,{"$f":"SUBTOTAL(9,D11:D13012)","v":70409.56},{"$f":"VLOOKUP($XY$1,Tableau4[#All],15)","v":14046.32},{"$f":"SUBTOTAL(9,F11:F13323)","v":84491.45},"Nbre ligne",{"$f":"COUNT(A11:A13780)","v":60},{"$f":"IF(L9=E9,\"Résultat Exact\",\"Résultat Faux\")","v":"Résultat Exact"},"TOTAL",{"$f":"SUM(K2:K8)","v":70409.56},{"$f":"SUM(L2:L8)","v":14046.32},{"$f":"SUM(M2:M8)","v":84491.45}]
["OR","FACT_NUM","DESIGNATION","M_HT","TVA","M_TTC","IF","LIB_FRSS","ICE_FRS","TAUX","ID_PAIE","DATE_PAIE","DATE_FAC"]
[{"$f":"IF(B11=\"\",\"\",1)","v":1},{"$f":"IFERROR(INDEX(Nom_choisis,ROW()-10,1),\"\")","v":"FF562978022015"},{"$f":"IFERROR(INDEX(Nom_choisis,ROW()-10,2),\"\")","v":"PRES DE SERVICES"},{"$f":"IFERROR(INDEX(Nom_choisis,ROW()-10,3),\"\")","v":169},{"$f":"IFERROR(INDEX(Nom_choisis,ROW()-10,4),\"\")","v":33.799999999999997},{"$f":"IFERROR(INDEX(Nom_choisis,ROW()-10,5),\"\")","v":202.8},{"$f":"IFERROR(INDEX(Nom_choisis,ROW()-10,6),\"\")","v":1009300},{"$f":"IFERROR(INDEX(Nom_choisis,ROW()-10,7),\"\")","v":"FOURNISSEUR 0025"},{"$f":"IFERROR(INDEX(Nom_choisis,ROW()-10,8),\"\")","v":"00241111004000079"},{"$f":"IFERROR(INDEX(Nom_choisis,ROW()-10,9),\"\")","v":0.2},{"$f":"IFERROR(INDEX(Nom_choisis,ROW()-10,14),\"\")","v":2},{"$f":"IFERROR(INDEX(Nom_choisis,ROW()-10,11),\"\")","v":"2015-01-10"},{"$f":"IFERROR(INDEX(Nom_choisis,ROW()-10,12),\"\")","v":"2015-01-01"}]
[{"$f":"IF(B12=\"\",\"\",A11+1)","v":2},"FF562979022015","PRES DE SERVICES",82.5,16.5,99,1009300,"FOURNISSEUR 0025","00241111004000079",0.2,2,"2015-01-10","2015-01-01"]
[{"$f":"IF(B13=\"\",\"\",A12+1)","v":3},"379548032015","PRES DE SERVICES",264,52.8,316.8,1009300,"FOURNISSEUR 0025","00241111004000079",0.2,2,"2015-01-10","2015-02-01"]
[4,"16F0313","MARCHANDISES",4725,945,5670,1009552,"FOURNISSEUR 0029","00281111004000083",0.2,5,"2015-03-30","2016-03-17"]
[5,"793419032015","PRES DE SERVICES",169,33.799999999999997,202.8,1009300,"FOURNISSEUR 0025","00241111004000079",0.2,2,"2015-04-01","2015-02-01"]
[6,"793420032015","PRES DE SERVICES",82.5,16.5,99,1009300,"FOURNISSEUR 0025","00241111004000079",0.2,2,"2015-04-01","2015-02-01"]
[7,"379548032015","PRES DE SERVICES",264,52.8,316.8,1009300,"FOURNISSEUR 0025","00241111004000079",0.2,2,"2015-04-01","2015-03-11"]
[8,120150506599,"ELECTRICITE",83.58,16.72,100.3,1008040,"FOURNISSEUR 0005","00041111004000059",0.14000000000000001,1,"2015-04-07","2015-03-15"]
[9,"425569042015","PRES DE SERVICES",264,52.8,316.8,1009300,"FOURNISSEUR 0025","00241111004000079",0.2,1,"2015-04-30","2015-04-08"]
[10,"813820042015","PRES DE SERVICES",169,33.799999999999997,202.8,1009300,"FOURNISSEUR 0025","00241111004000079",0.2,2,"2015-06-02","2015-03-01"]
[11,"813821042015","PRES DE SERVICES",82.5,16.5,99,1009300,"FOURNISSEUR 0025","00241111004000079",0.2,2,"2015-06-02","2015-03-01"]
[12,"448052052015","PRES DE SERVICES",264,52.8,316.8,1009300,"FOURNISSEUR 0025","00241111004000079",0.2,2,"2015-06-02","2015-05-12"]
[13,220150506599,"ELECTRICITE",69.48,10.64,83.37,1008040,"FOURNISSEUR 0005","00041111004000059",0.14000000000000001,1,"2015-06-15","2015-04-14"]
[14,"812247052015","PRES DE SERVICES",169,33.799999999999997,202.8,1009300,"FOURNISSEUR 0025","00241111004000079",0.2,2,"2015-07-02","2015-04-01"]
[15,"812248052015","PRES DE SERVICES",82.5,16.5,99,1009300,"FOURNISSEUR 0025","00241111004000079",0.2,2,"2015-07-02","2015-04-01"]
[16,"321934062015","PRES DE SERVICES",264,52.8,316.8,1009300,"FOURNISSEUR 0025","00241111004000079",0.2,2,"2015-07-02","2015-06-13"]
[17,"1962584062015","PRES DE SERVICES",169,33.799999999999997,202.8,1009300,"FOURNISSEUR 0025","00241111004000079",0.2,2,"2015-08-03","2015-05-01"]
[18,"1962585062015","PRES DE SERVICES",82.5,16.5,99,1009300,"FOURNISSEUR 0025","00241111004000079",0.2,2,"2015-08-03","2015-05-01"]
[19,"941024072015","PRES DE SERVICES",264,52.8,316.8,1009300,"FOURNISSEUR 0025","00241111004000079",0.2,2,"2015-08-03","2015-07-13"]
[20,320150506599,"ELECTRICITE",71.83,10.98,86.2,1008040,"FOURNISSEUR 0005","00041111004000059",0.14000000000000001,1,"2015-08-24","2015-05-11"]
[21,420150506599,"ELECTRICITE",67.11,10.29,80.53,1008040,"FOURNISSEUR 0005","00041111004000059",0.14000000000000001,1,"2015-08-24","2015-06-10"]
[22,520150506599,"ELECTRICITE",73.02,11.16,87.62,1008040,"FOURNISSEUR 0005","00041111004000059",0.14000000000000001,1,"2015-08-24","2015-07-14"]
[23,"809693072015","PRES DE SERVICES",169,33.799999999999997,202.8,1009300,"FOURNISSEUR 0025","00241111004000079",0.2,2,"2015-09-08","2015-06-01"]
[24,"809694072015","PRES DE SERVICES",82.5,16.5,99,1009300,"FOURNISSEUR 0025","00241111004000079",0.2,2,"2015-09-08","2015-06-01"]
[25,"805387082015","PRES DE SERVICES",169,33.799999999999997,202.8,1009300,"FOURNISSEUR 0025","00241111004000079",0.2,2,"2015-09-08","2015-07-01"]
[26,"805388082015","PRES DE SERVICES",82.5,16.5,99,1009300,"FOURNISSEUR 0025","00241111004000079",0.2,2,"2015-09-08","2015-07-01"]
[27,"417730082015","PRES DE SERVICES",264,52.8,316.8,1009300,"FOURNISSEUR 0025","00241111004000079",0.2,2,"2015-09-08","2015-08-10"]
[28,"979561092015","PRES DE SERVICES",390,78,468,1009300,"FOURNISSEUR 0025","00241111004000079",0.2,1,"2015-10-15","2015-09-15"]
[29,"530269102015","PRES DE SERVICES",174,34.799999999999997,208.8,1009300,"FOURNISSEUR 0025","00241111004000079",0.2,7,"2015-11-04","2015-10-12"]
[30,620150506599,"ELECTRICITE",76.56,11.68,91.87,1008040,"FOURNISSEUR 0005","00041111004000059",0.14000000000000001,1,"2015-11-30","2015-08-18"]
[31,720150506599,"ELECTRICITE",55.3,8.5500000000000007,66.36,1008040,"FOURNISSEUR 0005","00041111004000059",0.14000000000000001,1,"2015-11-30","2015-09-14"]
[32,"820150506599","ELECTRICITE",94.28,14.28,113.14,1008040,"FOURNISSEUR 0005","00041111004000059",0.14000000000000001,1,"2015-11-30","2015-10-14"]
[33,"796946092015","PRES DE SERVICES",169,33.799999999999997,202.8,1009300,"FOURNISSEUR 0025","00241111004000079",0.2,2,"2015-12-10","2015-08-01"]
[34,"796947092015","PRES DE SERVICES",82.5,16.5,99,1009300,"FOURNISSEUR 0025","00241111004000079",0.2,2,"2015-12-10","2015-08-01"]
[35,"790540102015","PRES DE SERVICES",169,33.799999999999997,202.8,1009300,"FOURNISSEUR 0025","00241111004000079",0.2,2,"2015-12-10","2015-09-01"]
[36,"790541102015","PRES DE SERVICES",82.5,16.5,99,1009300,"FOURNISSEUR 0025","00241111004000079",0.2,2,"2015-12-10","2015-09-01"]
[37,"780753112015","PRES DE SERVICES",169,33.799999999999997,202.8,1009300,"FOURNISSEUR 0025","00241111004000079",0.2,2,"2015-12-10","2015-10-01"]
[38,"780754112015","PRES DE SERVICES",82.5,16.5,99,1009300,"FOURNISSEUR 0025","00241111004000079",0.2,2,"2015-12-10","2015-10-01"]
[39,"773963122015","PRES DE SERVICES",169,33.799999999999997,202.8,1009300,"FOURNISSEUR 0025","00241111004000079",0.2,2,"2015-12-10","2015-11-01"]
[40,"028/12/HB2015","MARCHANDISES",5250,1050,6300,1009363,"FOURNISSEUR 0026","00251111004000080",0.2,1,"2015-12-21","2015-12-21"]
[41,"004/1/1HB2016","MARCHANDISES",941.67,188.33,1130,1009363,"FOURNISSEUR 0026","00251111004000080",0.2,2,"2016-01-12","2016-01-05"]
[42,"454439122015","PRES DE SERVICES",189.83,37.97,227.8,1009300,"FOURNISSEUR 0025","00241111004000079",0.2,2,"2016-01-15","2015-12-11"]
[43,"61402102016","PRES DE SERVICES",169,33.799999999999997,202.8,1009300,"FOURNISSEUR 0025","00241111004000079",0.2,2,"2016-01-15","2015-12-31"]
[44,"920150506599","ELECTRICITE",80.11,12.2,96.13,1008040,"FOURNISSEUR 0005","00041111004000059",0.14000000000000001,1,"2016-02-10","2015-11-12"]
[45,"1020150506599","ELECTRICITE",51.74,8.0299999999999994,62.09,1008040,"FOURNISSEUR 0005","00041111004000059",0.14000000000000001,1,"2016-02-10","2015-12-30"]
[46,"1120150506599","ELECTRICITE",63.57,9.77,76.28,1008040,"FOURNISSEUR 0005","00041111004000059",0.14000000000000001,1,"2016-02-10","2015-12-31"]
[47,"1220150506599","ELECTRICITE",56.48,8.73,67.77,1008040,"FOURNISSEUR 0005","00041111004000059",0.14000000000000001,1,"2016-02-10","2015-12-31"]
[48,"773964122015","PRES DE SERVICES",82.5,16.5,99,1009300,"FOURNISSEUR 0025","00241111004000079",0.2,2,"2016-02-15","2015-11-01"]
[49,"588640112015","PRES DE SERVICES",169,33.799999999999997,202.8,1009300,"FOURNISSEUR 0025","00241111004000079",0.2,2,"2016-02-15","2015-11-10"]
[50,"766859012016","PRES DE SERVICES",164.16,32.83,196.99,1009300,"FOURNISSEUR 0025","00241111004000079",0.2,2,"2016-02-15","2015-12-01"]
[51,"766860012016","PRES DE SERVICES",82.5,16.5,99,1009300,"FOURNISSEUR 0025","00241111004000079",0.2,2,"2016-02-15","2015-12-01"]
[52,"016/02/HB2016","MARCHANDISES",1575,315,1890,1009363,"FOURNISSEUR 0026","00251111004000080",0.2,2,"2016-02-28","2016-02-10"]
[53,"512 82","MARCHANDISES",3304.75,660.95,3965.7,1009678,"FOURNISSEUR 0031","00301111004000085",0.2,5,"2016-03-30","2015-12-31"]
[54,15124668,"MARCHANDISES",2075.42,415.08,2490.5,1008922,"FOURNISSEUR 0019","00181111004000073",0.2,5,"2016-03-30","2015-12-31"]
[55,15124428,"MARCHANDISES",14929.17,2985.83,17915,1008922,"FOURNISSEUR 0019","00181111004000073",0.2,5,"2016-03-30","2015-12-31"]
[56,160000241,"MARCHANDISES",768,153.6,921.6,1009426,"FOURNISSEUR 0027","00261111004000081",0.2,5,"2016-03-30","2016-01-30"]
[57,"0023/16","MARCHANDISES",6513.33,1302.67,7816,1008670,"FOURNISSEUR 0015","00141111004000069",0.2,5,"2016-04-01","2016-03-18"]
[58,"FA2530","MARCHANDISES",6500,1300,7800,1009237,"FOURNISSEUR 0024","00231111004000078",0.2,5,"2016-04-15","2016-04-20"]
[59,"AVOIR16000001","MARCHANDISES",-583.33000000000004,-116.67,-700,1008922,"FOURNISSEUR 0019","00181111004000073",0.2,5,"2016-04-25","2016-01-07"]
[60,16010055,"MARCHANDISES",17614.5,3522.9,21137.4,1008922,"FOURNISSEUR 0019","00181111004000073",0.2,5,"2016-04-25","2016-01-31"]
["","","","","","","","","","","","",""]
["","","","","","","","","","","","",""]
["","","","","","","","","","","","",""]
["","","","","","","","","","","","",""]
["",{"$f":"IFERROR(INDEX(Nom_choisis,ROW()-10,1),\"\")","v":""},{"$f":"IFERROR(INDEX(Nom_choisis,ROW()-10,2),\"\")","v":""},{"$f":"IFERROR(INDEX(Nom_choisis,ROW()-10,3),\"\")","v":""},{"$f":"IFERROR(INDEX(Nom_choisis,ROW()-10,4),\"\")","v":""},{"$f":"IFERROR(INDEX(Nom_choisis,ROW()-10,5),\"\")","v":""},{"$f":"IFERROR(INDEX(Nom_choisis,ROW()-10,6),\"\")","v":""},{"$f":"IFERROR(INDEX(Nom_choisis,ROW()-10,7),\"\")","v":""},{"$f":"IFERROR(INDEX(Nom_choisis,ROW()-10,8),\"\")","v":""},{"$f":"IFERROR(INDEX(Nom_choisis,ROW()-10,9),\"\")","v":""},{"$f":"IFERROR(INDEX(Nom_choisis,ROW()-10,14),\"\")","v":""},{"$f":"IFERROR(INDEX(Nom_choisis,ROW()-10,11),\"\")","v":""},{"$f":"IFERROR(INDEX(Nom_choisis,ROW()-10,12),\"\")","v":""}]
["","","","","","","","","","","","",""]
[{"$f":"IF(B77=\"\",\"\",A76+1)","v":""},"","","","","","","","","","","",""]
["","","","","","","","","","","","",""]
["","","","","","","","","","","","",""]
["","","","","","","","","","","","",""]
["","","","","","","","","","","","",""]
["","","","","","","","","","","","",""]
["","","","","","","","","","","","",""]
["","","","","","","","","","","","",""]
["","","","","","","","","","","","",""]
["","","","","","","","","","","","",""]
["","","","","","","","","","","","",""]
["","","","","","","","","","","","",""]
["","","","","","","","","","","","",""]
["","","","","","","","","","","","",""]
["","","","","","","","","","","","",""]
["","","","","","","","","","","","",""]
["","","","","","","","","","","","",""]
["","","","","","","","","","","","",""]
["","","","","","","","","","","","",""]
["","","","","","","","","","","","",""]
["","","","","","","","","","","","",""]
["","","","","","","","","","","","",""]
["","","","","","","","","","","","",""]
["","","","","","","","","","","","",""]
["","","","","","","","","","","","",""]
["","","","","","","","","","","","",""]
["","","","","","","","","","","","",""]
["","","","","","","","","","","","",""]
["","","","","","","","","","","","",""]
["","","","","","","","","","","","",""]
["","","","","","","","","","","","",""]
["","","","","","","","","","","","",""]
["","","","","","","","","","","","",""]
["","","","","","","","","","","","",""]
["","","","","","","","","","","","",""]
["","","","","","","","","","","","",""]
["","","","","","","","","","","","",""]
["","","","","","","","","","","","",""]
["","","","","","","","","","","","",""]
["","","","","","","","","","","","",""]
["","","","","","","","","","","","",""]
["","","","","","","","","","","","",""]
["","","","","","","","","","","","","",null,null,null,null,{"$f":"IFERROR(INDEX(Nom_choisis,ROW()-10,3),\"\")","v":""},{"$f":"IFERROR(INDEX(Nom_choisis,ROW()-10,4),\"\")","v":""},{"$f":"IFERROR(INDEX(Nom_choisis,ROW()-10,3),\"\")","v":""}]
["","","","","","","","","","","","","",null,null,null,null,"","",""]
["","","","","","","","","","","","","",null,null,null,null,"","",""]
["","","","","","","","","","","","","",null,null,null,null,"","",""]
["","","","","","","","","","","","","",null,null,null,null,"","",""]
["","","","","","","","","","","","","",null,null,null,null,"","",""]
["","","","","","","","","","","","","",null,null,null,null,"","",""]
["","","","","","","","","","","","","",null,null,null,null,"","",""]
["","","","","","","","","","","","","",null,null,null,null,"","",""]
["","","","","","","","","","","","","",null,null,null,null,"","",""]
["","","","","","","","","","","","","",null,null,null,null,"","",""]
["","","","","","","","","","","","","",null,null,null,null,"","",""]
["","","","","","","","","","","","","",null,null,null,null,"","",""]
["","","","","","","","","","","","","",null,{"$f":"IF(B1095=\"\",\"\",A1094+1)","v":""},null,null,"","",""]
["","","","","","","","","","","","","",null,"",null,null,"","",""]
["","","","","","","","","","","","","",null,"",null,null,"","",""]
["","","","","","","","","","","","","",null,"",null,null,"","",""]
["","","","","","","","","","","","","",null,"",null,null,"","",""]
["","","","","","","","","","","","","",null,"",null,null,"","",""]
["","","","","","","","","","","","","",null,"",null,null,"","",""]
["",{"$f":"IFERROR(INDEX(Nom_choisis,ROW()-10,1),\"\")","v":""},{"$f":"IFERROR(INDEX(Nom_choisis,ROW()-10,2),\"\")","v":""},{"$f":"IFERROR(INDEX(Nom_choisis,ROW()-10,3),\"\")","v":""},{"$f":"IFERROR(INDEX(Nom_choisis,ROW()-10,4),\"\")","v":""},{"$f":"IFERROR(INDEX(Nom_choisis,ROW()-10,5),\"\")","v":""},{"$f":"IFERROR(INDEX(Nom_choisis,ROW()-10,6),\"\")","v":""},{"$f":"IFERROR(INDEX(Nom_choisis,ROW()-10,7),\"\")","v":""},{"$f":"IFERROR(INDEX(Nom_choisis,ROW()-10,8),\"\")","v":""},{"$f":"IFERROR(INDEX(Nom_choisis,ROW()-10,9),\"\")","v":""},{"$f":"IFERROR(INDEX(Nom_choisis,ROW()-10,14),\"\")","v":""},{"$f":"IFERROR(INDEX(Nom_choisis,ROW()-10,11),\"\")","v":""},{"$f":"IFERROR(INDEX(Nom_choisis,ROW()-10,12),\"\")","v":""},null,null,null,null,"","",""]
["","","","","","","","","","","","","",null,null,null,null,"","",""]
[{"$f":"IF(B141=\"\",\"\",A140+1)","v":""},"","","","","","","","","","","","",null,null,null,null,"","",""]
["","","","","","","","","","","","","",null,null,null,null,"","",""]
["","","","","","","","","","","","","",null,null,null,null,"","",""]
["","","","","","","","","","","","","",null,null,null,null,"","",""]
["","","","","","","","","","","","","",null,null,null,null,{"$f":"IFERROR(INDEX(Nom_choisis,ROW()-10,3),\"\")","v":""},{"$f":"IFERROR(INDEX(Nom_choisis,ROW()-10,4),\"\")","v":""},{"$f":"IFERROR(INDEX(Nom_choisis,ROW()-10,3),\"\")","v":""}]
["","","","","","","","","","","","","",null,null,null,null,"","",""]
["","","","","","","","","","","","","",null,null,null,null,"","",""]
["","","","","","","","","","","","","",null,null,null,null,"","",""]
["","","","","","","","","","","","","",null,null,null,null,"","",""]
["","","","","","","","","","","","","",null,null,null,null,"","",""]
["","","","","","","","","","","","","",null,null,null,null,"","",""]
["","","","","","","","","","","","","",null,null,null,null,"","",""]
["","","","","","","","","","","","","",null,null,null,null,"","",""]
["","","","","","","","","","","","","",null,null,null,null,"","",""]
["","","","","","","","","","","","","",null,null,null,null,"","",""]
["","","","","","","","","","","","","",null,null,null,null,"","",""]
["","","","","","","","","","","","","",null,null,null,null,"","",""]
["","","","","","","","","","","","","",null,null,null,null,"","",""]
["","","","","","","","","","","","","",null,null,null,null,"","",""]
["","","","","","","","","","","","","",null,null,null,null,"","",""]
["","","","","","","","","","","","","",null,null,null,null,"","",""]
["","","","","","","","","","","","","",null,null,null,null,"","",""]
["","","","","","","","","","","","","",null,null,null,null,"","",""]
["","","","","","","","","","","","","",null,null,null,null,"","",""]
["","","","","","","","","","","","","",null,null,null,null,"","",""]
["","","","","","","","","","","","","",null,null,null,null,"","",""]
["","","","","","","","","","","","",""]
["","","","","","","","","","","","",""]
["","","","","","","","","","","","",""]
["","","","","","","","","","","","",""]
["","","","","","","","","","","","",""]
["","","","","","","","","","","","",""]
["","","","","","","","","","","","",""]
["","","","","","","","","","","","",""]
["","","","","","","","","","","","",""]
["","","","","","","","","","","","",""]
["","","","","","","","","","","","",""]
["","","","","","","","","","","","",""]
["","","","","","","","","","","","",""]
["","","","","","","","","","","","",""]
["","","","","","","","","","","","",""]
["","","","","","","","","","","","",""]
["","","","","","","","","","","","",""]
["","","","","","","","","","","","",""]
["","","","","","","","","","","","",""]
["","","","","","","","","","","","",""]
["","","","","","","","","","","","",""]
["","","","","","","","","","","","",""]
["","","","","","","","","","","","",""]
["","","","","","","","","","","","",""]
["","","","","","","","","","","","",""]
["","","","","","","","","","","","",""]
["","","","","","","","","","","","",""]
["","","","","","","","","","","","",""]
["","","","","","","","","","","","",""]
["","","","","","","","","","","","",""]
["","","","","","","","","","","","",""]
["","","","","","","","","","","","",""]
["","","","","","","","","","","","",""]
["","","","","","","","","","","","",""]
["","","","","","","","","","","","",""]
["","","","","","","","","","","","",""]
["",{"$f":"IFERROR(INDEX(Nom_choisis,ROW()-10,1),\"\")","v":""},{"$f":"IFERROR(INDEX(Nom_choisis,ROW()-10,2),\"\")","v":""},{"$f":"IFERROR(INDEX(Nom_choisis,ROW()-10,3),\"\")","v":""},{"$f":"IFERROR(INDEX(Nom_choisis,ROW()-10,4),\"\")","v":""},{"$f":"IFERROR(INDEX(Nom_choisis,ROW()-10,5),\"\")","v":""},{"$f":"IFERROR(INDEX(Nom_choisis,ROW()-10,6),\"\")","v":""},{"$f":"IFERROR(INDEX(Nom_choisis,ROW()-10,7),\"\")","v":""},{"$f":"IFERROR(INDEX(Nom_choisis,ROW()-10,8),\"\")","v":""},{"$f":"IFERROR(INDEX(Nom_choisis,ROW()-10,9),\"\")","v":""},{"$f":"IFERROR(INDEX(Nom_choisis,ROW()-10,14),\"\")","v":""},{"$f":"IFERROR(INDEX(Nom_choisis,ROW()-10,11),\"\")","v":""},{"$f":"IFERROR(INDEX(Nom_choisis,ROW()-10,12),\"\")","v":""}]
["","","","","","","","","","","","",""]
[{"$f":"IF(B205=\"\",\"\",A204+1)","v":""},"","","","","","","","","","","",""]
["","","","","","","","","","","","",""]
["","","","","","","","","","","","",""]
["","","","","","","","","","","","",""]
["","","","","","","","","","","","",""]
["","","","","","","","","","","","",""]
["","","","","","","","","","","","",""]
["","","","","","","","","","","","",""]
["","","","","","","","","","","","",""]
["","","","","","","","","","","","",""]
["","","","","","","","","","","","",""]
["","","","","","","","","","","","",""]
["","","","","","","","","","","","",""]
["","","","","","","","","","","","",""]
["","","","","","","","","","","","",""]
["","","","","","","","","","","","",""]
["","","","","","","","","","","","",""]
["","","","","","","","","","","","",""]
["","","","","","","","","","","","",""]
["","","","","","","","","","","","",""]
["","","","","","","","","","","","",""]
["","","","","","","","","","","","",""]
["","","","","","","","","","","","",""]
["","","","","","","","","","","","",""]
["","","","","","","","","","","","",""]
["","","","","","","","","","","","",""]
["","","","","","","","","","","","",""]
["","","","","","","","","","","","",""]
["","","","","","","","","","","","",""]
["","","","","","","","","","","","",""]
["","","","","","","","","","","","",""]
["","","","","","","","","","","","",""]
["","","","","","","","","","","","",""]
["","","","","","","","","","","","",""]
["","","","","","","","","","","","",""]
["","","","","","","","","","","","",""]
["","","","","","","","","","","","",""]
["","","","","","","","","","","","",""]
["","","","","","","","","","","","",""]
["","","","","","","","","","","","",""]
["","","","","","","","","","","","",""]
["","","","","","","","","","","","",""]
["","","","","","","","","","","","",""]
["","","","","","","","","","","","",""]
["","","","","","","","","","","","",""]
["","","","","","","","","","","","",""]
["","","","","","","","","","","","",""]
["","","","","","","","","","","","",""]
["","","","","","","","","","","","",""]
["","","","","","","","","","","","",""]
["","","","","","","","","","","","",""]
["","","","","","","","","","","","",""]
["","","","","","","","","","","","",""]
["","","","","","","","","","","","",""]
["","","","","","","","","","","","",""]
["","","","","","","","","","","","",""]
["","","","","","","","","","","","",""]
["","","","","","","","","","","","",""]
["","","","","","","","","","","","",""]
["","","","","","","","","","","","",""]
["","","","","","","","","","","","",""]
["","","","","","","","","","","","",""]
["",{"$f":"IFERROR(INDEX(Nom_choisis,ROW()-10,1),\"\")","v":""},{"$f":"IFERROR(INDEX(Nom_choisis,ROW()-10,2),\"\")","v":""},{"$f":"IFERROR(INDEX(Nom_choisis,ROW()-10,3),\"\")","v":""},{"$f":"IFERROR(INDEX(Nom_choisis,ROW()-10,4),\"\")","v":""},{"$f":"IFERROR(INDEX(Nom_choisis,ROW()-10,5),\"\")","v":""},{"$f":"IFERROR(INDEX(Nom_choisis,ROW()-10,6),\"\")","v":""},{"$f":"IFERROR(INDEX(Nom_choisis,ROW()-10,7),\"\")","v":""},{"$f":"IFERROR(INDEX(Nom_choisis,ROW()-10,8),\"\")","v":""},{"$f":"IFERROR(INDEX(Nom_choisis,ROW()-10,9),\"\")","v":""},{"$f":"IFERROR(INDEX(Nom_choisis,ROW()-10,14),\"\")","v":""},{"$f":"IFERROR(INDEX(Nom_choisis,ROW()-10,11),\"\")","v":""},{"$f":"IFERROR(INDEX(Nom_choisis,ROW()-10,12),\"\")","v":""}]
["","","","","","","","","","","","",""]
[{"$f":"IF(B269=\"\",\"\",A268+1)","v":""},"","","","","","","","","","","",""]
["","","","","","","","","","","","",""]
["","","","","","","","","","","","",""]
["","","","","","","","","","","","",""]
["","","","","","","","","","","","",""]
["","","","","","","","","","","","",""]
["","","","","","","","","","","","",""]
["","","","","","","","","","","","",""]
["","","","","","","","","","","","",""]
["","","","","","","","","","","","",""]
["","","","","","","","","","","","",""]
["","","","","","","","","","","","",""]
["","","","","","","","","","","","",""]
["","","","","","","","","","","","",""]
["","","","","","","","","","","","",""]
["","","","","","","","","","","","",""]
["","","","","","","","","","","","",""]
["","","","","","","","","","","","",""]
["","","","","","","","","","","","",""]
["","","","","","","","","","","","",""]
["","","","","","","","","","","","",""]
["","","","","","","","","","","","",""]
["","","","","","","","","","","","",""]
["","","","","","","","","","","","",""]
["","","","","","","","","","","","",""]
["","","","","","","","","","","","",""]
["","","","","","","","","","","","",""]
["","","","","","","","","","","","",""]
["","","","","","","","","","","","",""]
["","","","","","","","","","","","",""]
["","","","","","","","","","","","",""]
["","","","","","","","","","","","",""]
["","","","","","","","","","","","",""]
["","","","","","","","","","","","",""]
["","","","","","","","","","","","",""]
["","","","","","","","","","","","",""]
["","","","","","","","","","","","",""]
["","","","","","","","","","","","",""]
["","","","","","","","","","","","",""]
["","","","","","","","","","","","",""]
["","","","","","","","","","","","",""]
["","","","","","","","","","","","",""]
["","","","","","","","","","","","",""]
["","","","","","","","","","","","",""]
["","","","","","","","","","","","",""]
["","","","","","","","","","","","",""]
["","","","","","","","","","","","",""]
["","","","","","","","","","","","",""]
["","","","","","","","","","","","",""]
["","","","","","","","","","","","",""]
["","","","","","","","","","","","",""]
["","","","","","","","","","","","",""]
["","","","","","","","","","","","",""]
["","","","","","","","","","","","",""]
["","","","","","","","","","","","",""]
["","","","","","","","","","","","",""]
["","","","","","","","","","","","",""]
["","","","","","","","","","","","",""]
["","","","","","","","","","","","",""]
["","","","","","","","","","","","",""]
["","","","","","","","","","","","",""]
["","","","","","","","","","","","",""]
["",{"$f":"IFERROR(INDEX(Nom_choisis,ROW()-10,1),\"\")","v":""},{"$f":"IFERROR(INDEX(Nom_choisis,ROW()-10,2),\"\")","v":""},{"$f":"IFERROR(INDEX(Nom_choisis,ROW()-10,3),\"\")","v":""},{"$f":"IFERROR(INDEX(Nom_choisis,ROW()-10,4),\"\")","v":""},{"$f":"IFERROR(INDEX(Nom_choisis,ROW()-10,5),\"\")","v":""},{"$f":"IFERROR(INDEX(Nom_choisis,ROW()-10,6),\"\")","v":""},{"$f":"IFERROR(INDEX(Nom_choisis,ROW()-10,7),\"\")","v":""},{"$f":"IFERROR(INDEX(Nom_choisis,ROW()-10,8),\"\")","v":""},{"$f":"IFERROR(INDEX(Nom_choisis,ROW()-10,9),\"\")","v":""},{"$f":"IFERROR(INDEX(Nom_choisis,ROW()-10,14),\"\")","v":""},{"$f":"IFERROR(INDEX(Nom_choisis,ROW()-10,11),\"\")","v":""},{"$f":"IFERROR(INDEX(Nom_choisis,ROW()-10,12),\"\")","v":""}]
["","","","","","","","","","","","",""]
[{"$f":"IF(B333=\"\",\"\",A332+1)","v":""},"","","","","","","","","","","",""]
["","","","","","","","","","","","",""]
["","","","","","","","","","","","",""]
["","","","","","","","","","","","",""]
["","","","","","","","","","","","",""]
["","","","","","","","","","","","",""]
["","","","","","","","","","","","",""]
["","","","","","","","","","","","",""]
["","","","","","","","","","","","",""]
["","","","","","","","","","","","",""]
["","","","","","","","","","","","",""]
["","","","","","","","","","","","",""]
["","","","","","","","","","","","",""]
["","","","","","","","","","","","",""]
["","","","","","","","","","","","",""]
["","","","","","","","","","","","",""]
["","","","","","","","","","","","",""]
["","","","","","","","","","","","",""]
["","","","","","","","","","","","",""]
["","","","","","","","","","","","",""]
["","","","","","","","","","","","",""]
["","","","","","","","","","","","",""]
["","","","","","","","","","","","",""]
["","","","","","","","","","","","",""]
["","","","","","","","","","","","",""]
["","","","","","","","","","","","",""]
["","","","","","","","","","","","",""]
["","","","","","","","","","","","",""]
["","","","","","","","","","","","",""]
["","","","","","","","","","","","",""]
["","","","","","","","","","","","",""]
["","","","","","","","","","","","",""]
["","","","","","","","","","","","",""]
["","","","","","","","","","","","",""]
["","","","","","","","","","","","",""]
["","","","","","","","","","","","",""]
["","","","","","","","","","","","",""]
["","","","","","","","","","","","",""]
["","","","","","","","","","","","",""]
["","","","","","","","","","","","",""]
["","","","","","","","","","","","",""]
["","","","","","","","","","","","",""]
["","","","","","","","","","","","",""]
["","","","","","","","","","","","",""]
["","","","","","","","","","","","",""]
["","","","","","","","","","","","",""]
["","","","","","","","","","","","",""]
["","","","","","","","","","","","",""]
["","","","","","","","","","","","",""]
["","","","","","","","","","","","",""]
["","","","","","","","","","","","",""]
["","","","","","","","","","","","",""]
["","","","","","","","","","","","",""]
["","","","","","","","","","","","",""]
["","","","","","","","","","","","",""]
["","","","","","","","","","","","",""]
["","","","","","","","","","","","",""]
["","","","","","","","","","","","",""]
["","","","","","","","","","","","",""]
["","","","","","","","","","","","",""]
["","","","","","","","","","","","",""]
["","","","","","","","","","","","",""]
["",{"$f":"IFERROR(INDEX(Nom_choisis,ROW()-10,1),\"\")","v":""},{"$f":"IFERROR(INDEX(Nom_choisis,ROW()-10,2),\"\")","v":""},{"$f":"IFERROR(INDEX(Nom_choisis,ROW()-10,3),\"\")","v":""},{"$f":"IFERROR(INDEX(Nom_choisis,ROW()-10,4),\"\")","v":""},{"$f":"IFERROR(INDEX(Nom_choisis,ROW()-10,5),\"\")","v":""},{"$f":"IFERROR(INDEX(Nom_choisis,ROW()-10,6),\"\")","v":""},{"$f":"IFERROR(INDEX(Nom_choisis,ROW()-10,7),\"\")","v":""},{"$f":"IFERROR(INDEX(Nom_choisis,ROW()-10,8),\"\")","v":""},{"$f":"IFERROR(INDEX(Nom_choisis,ROW()-10,9),\"\")","v":""},{"$f":"IFERROR(INDEX(Nom_choisis,ROW()-10,14),\"\")","v":""},{"$f":"IFERROR(INDEX(Nom_choisis,ROW()-10,11),\"\")","v":""},{"$f":"IFERROR(INDEX(Nom_choisis,ROW()-10,12),\"\")","v":""}]
["","","","","","","","","","","","",""]
[{"$f":"IF(B397=\"\",\"\",A396+1)","v":""},"","","","","","","","","","","",""]
["","","","","","","","","","","","",""]
["","","","","","","","","","","","",""]
["","","","","","","","","","","","",""]
["","","","","","","","","","","","",""]
["","","","","","","","","","","","",""]
["","","","","","","","","","","","",""]
["","","","","","","","","","","","",""]
["","","","","","","","","","","","",""]
["","","","","","","","","","","","",""]
["","","","","","","","","","","","",""]
["","","","","","","","","","","","",""]
["","","","","","","","","","","","",""]
["","","","","","","","","","","","",""]
["","","","","","","","","","","","",""]
["","","","","","","","","","","","",""]
["","","","","","","","","","","","",""]
["","","","","","","","","","","","",""]
["","","","","","","","","","","","",""]
["","","","","","","","","","","","",""]
["","","","","","","","","","","","",""]
["","","","","","","","","","","","",""]
["","","","","","","","","","","","",""]
["","","","","","","","","","","","",""]
["","","","","","","","","","","","",""]
["","","","","","","","","","","","",""]
["","","","","","","","","","","","",""]
["","","","","","","","","","","","",""]
["","","","","","","","","","","","",""]
["","","","","","","","","","","","",""]
["","","","","","","","","","","","",""]
["","","","","","","","","","","","",""]
["","","","","","","","","","","","",""]
["","","","","","","","","","","","",""]
["","","","","","","","","","","","",""]
["","","","","","","","","","","","",""]
["","","","","","","","","","","","",""]
["","","","","","","","","","","","",""]
["","","","","","","","","","","","",""]
["","","","","","","","","","","","",""]
["","","","","","","","","","","","",""]
["","","","","","","","","","","","",""]
["","","","","","","","","","","","",""]
["","","","","","","","","","","","",""]
["","","","","","","","","","","","",""]
["","","","","","","","","","","","",""]
["","","","","","","","","","","","",""]
["","","","","","","","","","","","",""]
["","","","","","","","","","","","",""]
["","","","","","","","","","","","",""]
["","","","","","","","","","","","",""]
["","","","","","","","","","","","",""]
["","","","","","","","","","","","",""]
["","","","","","","","","","","","",""]
["","","","","","","","","","","","",""]
["","","","","","","","","","","","",""]
["","","","","","","","","","","","",""]
["","","","","","","","","","","","",""]
["","","","","","","","","","","","",""]
["","","","","","","","","","","","",""]
["","","","","","","","","","","","",""]
["","","","","","","","","","","","",""]
["",{"$f":"IFERROR(INDEX(Nom_choisis,ROW()-10,1),\"\")","v":""},{"$f":"IFERROR(INDEX(Nom_choisis,ROW()-10,2),\"\")","v":""},{"$f":"IFERROR(INDEX(Nom_choisis,ROW()-10,3),\"\")","v":""},{"$f":"IFERROR(INDEX(Nom_choisis,ROW()-10,4),\"\")","v":""},{"$f":"IFERROR(INDEX(Nom_choisis,ROW()-10,5),\"\")","v":""},{"$f":"IFERROR(INDEX(Nom_choisis,ROW()-10,6),\"\")","v":""},{"$f":"IFERROR(INDEX(Nom_choisis,ROW()-10,7),\"\")","v":""},{"$f":"IFERROR(INDEX(Nom_choisis,ROW()-10,8),\"\")","v":""},{"$f":"IFERROR(INDEX(Nom_choisis,ROW()-10,9),\"\")","v":""},{"$f":"IFERROR(INDEX(Nom_choisis,ROW()-10,14),\"\")","v":""},{"$f":"IFERROR(INDEX(Nom_choisis,ROW()-10,11),\"\")","v":""},{"$f":"IFERROR(INDEX(Nom_choisis,ROW()-10,12),\"\")","v":""}]
["","","","","","","","","","","","",""]
[{"$f":"IF(B461=\"\",\"\",A460+1)","v":""},"","","","","","","","","","","",""]
["","","","","","","","","","","","",""]
["","","","","","","","","","","","",""]
["","","","","","","","","","","","",""]
["","","","","","","","","","","","",""]
["","","","","","","","","","","","",""]
["","","","","","","","","","","","",""]
["","","","","","","","","","","","",""]
["","","","","","","","","","","","",""]
["","","","","","","","","","","","",""]
["","","","","","","","","","","","",""]
["","","","","","","","","","","","",""]
["","","","","","","","","","","","",""]
["","","","","","","","","","","","",""]
["","","","","","","","","","","","",""]
["","","","","","","","","","","","",""]
["","","","","","","","","","","","",""]
["","","","","","","","","","","","",""]
["","","","","","","","","","","","",""]
["","","","","","","","","","","","",""]
["","","","","","","","","","","","",""]
["","","","","","","","","","","","",""]
["","","","","","","","","","","","",""]
["","","","","","","","","","","","",""]
["","","","","","","","","","","","",""]
["","","","","","","","","","","","",""]
["","","","","","","","","","","","",""]
["","","","","","","","","","","","",""]
["","","","","","","","","","","","",""]
["","","","","","","","","","","","",""]
["","","","","","","","","","","","",""]
["","","","","","","","","","","","",""]
["","","","","","","","","","","","",""]
["","","","","","","","","","","","",""]
["","","","","","","","","","","","",""]
["","","","","","","","","","","","",""]
["","","","","","","","","","","","",""]
["","","","","","","","","","","","",""]
["","","","","","","","","","","","",""]
["","","","","","","","","","","","",""]
["","","","","","","","","","","","",""]
["","","","","","","","","","","","",""]
["","","","","","","","","","","","",""]
["","","","","","","","","","","","",""]
["","","","","","","","","","","","",""]
["","","","","","","","","","","","",""]
["","","","","","","","","","","","",""]
["","","","","","","","","","","","",""]
["","","","","","","","","","","","",""]
["","","","","","","","","","","","",""]
["","","","","","","","","","","","",""]
["","","","","","","","","","","","",""]
["","","","","","","","","","","","",""]
["","","","","","","","","","","","",""]
["","","","","","","","","","","","",""]
["","","","","","","","","","","","",""]
["","","","","","","","","","","","",""]
["","","","","","","","","","","","",""]
["","","","","","","","","","","","",""]
["","","","","","","","","","","","",""]
["","","","","","","","","","","","",""]
["","","","","","","","","","","","",""]
["",{"$f":"IFERROR(INDEX(Nom_choisis,ROW()-10,1),\"\")","v":""},{"$f":"IFERROR(INDEX(Nom_choisis,ROW()-10,2),\"\")","v":""},{"$f":"IFERROR(INDEX(Nom_choisis,ROW()-10,3),\"\")","v":""},{"$f":"IFERROR(INDEX(Nom_choisis,ROW()-10,4),\"\")","v":""},{"$f":"IFERROR(INDEX(Nom_choisis,ROW()-10,5),\"\")","v":""},{"$f":"IFERROR(INDEX(Nom_choisis,ROW()-10,6),\"\")","v":""},{"$f":"IFERROR(INDEX(Nom_choisis,ROW()-10,7),\"\")","v":""},{"$f":"IFERROR(INDEX(Nom_choisis,ROW()-10,8),\"\")","v":""},{"$f":"IFERROR(INDEX(Nom_choisis,ROW()-10,9),\"\")","v":""},{"$f":"IFERROR(INDEX(Nom_choisis,ROW()-10,14),\"\")","v":""},{"$f":"IFERROR(INDEX(Nom_choisis,ROW()-10,11),\"\")","v":""},{"$f":"IFERROR(INDEX(Nom_choisis,ROW()-10,12),\"\")","v":""}]
["","","","","","","","","","","","",""]
[{"$f":"IF(B525=\"\",\"\",A524+1)","v":""},"","","","","","","","","","","",""]
["","","","","","","","","","","","",""]
["","","","","","","","","","","","",""]
["","","","","","","","","","","","",""]
["","","","","","","","","","","","",""]
["","","","","","","","","","","","",""]
["","","","","","","","","","","","",""]
["","","","","","","","","","","","",""]
["","","","","","","","","","","","",""]
["","","","","","","","","","","","",""]
["","","","","","","","","","","","",""]
["","","","","","","","","","","","",""]
["","","","","","","","","","","","",""]
["","","","","","","","","","","","",""]
["","","","","","","","","","","","",""]
["","","","","","","","","","","","",""]
["","","","","","","","","","","","",""]
["","","","","","","","","","","","",""]
["","","","","","","","","","","","",""]
["","","","","","","","","","","","",""]
["","","","","","","","","","","","",""]
["","","","","","","","","","","","",""]
["","","","","","","","","","","","",""]
["","","","","","","","","","","","",""]
["","","","","","","","","","","","",""]
["","","","","","","","","","","","",""]
["","","","","","","","","","","","",""]
["","","","","","","","","","","","",""]
["","","","","","","","","","","","",""]
["","","","","","","","","","","","",""]
["","","","","","","","","","","","",""]
["","","","","","","","","","","","",""]
["","","","","","","","","","","","",""]
["","","","","","","","","","","","",""]
["","","","","","","","","","","","",""]
["","","","","","","","","","","","",""]
["","","","","","","","","","","","",""]
["","","","","","","","","","","","",""]
["","","","","","","","","","","","",""]
["","","","","","","","","","","","",""]
["","","","","","","","","","","","",""]
["","","","","","","","","","","","",""]
["","","","","","","","","","","","",""]
["","","","","","","","","","","","",""]
["","","","","","","","","","","","",""]
["","","","","","","","","","","","",""]
["","","","","","","","","","","","",""]
["","","","","","","","","","","","",""]
["","","","","","","","","","","","",""]
["","","","","","","","","","","","",""]
["","","","","","","","","","","","",""]
["","","","","","","","","","","","",""]
["","","","","","","","","","","","",""]
["","","","","","","","","","","","",""]
["","","","","","","","","","","","",""]
["","","","","","","","","","","","",""]
["","","","","","","","","","","","",""]
["","","","","","","","","","","","",""]
["","","","","","","","","","","","",""]
["","","","","","","","","","","","",""]
["","","","","","","","","","","","",""]
["","","","","","","","","","","","",""]
["",{"$f":"IFERROR(INDEX(Nom_choisis,ROW()-10,1),\"\")","v":""},{"$f":"IFERROR(INDEX(Nom_choisis,ROW()-10,2),\"\")","v":""},{"$f":"IFERROR(INDEX(Nom_choisis,ROW()-10,3),\"\")","v":""},{"$f":"IFERROR(INDEX(Nom_choisis,ROW()-10,4),\"\")","v":""},{"$f":"IFERROR(INDEX(Nom_choisis,ROW()-10,5),\"\")","v":""},{"$f":"IFERROR(INDEX(Nom_choisis,ROW()-10,6),\"\")","v":""},{"$f":"IFERROR(INDEX(Nom_choisis,ROW()-10,7),\"\")","v":""},{"$f":"IFERROR(INDEX(Nom_choisis,ROW()-10,8),\"\")","v":""},{"$f":"IFERROR(INDEX(Nom_choisis,ROW()-10,9),\"\")","v":""},{"$f":"IFERROR(INDEX(Nom_choisis,ROW()-10,14),\"\")","v":""},{"$f":"IFERROR(INDEX(Nom_choisis,ROW()-10,11),\"\")","v":""},{"$f":"IFERROR(INDEX(Nom_choisis,ROW()-10,12),\"\")","v":""}]
["","","","","","","","","","","","",""]
[{"$f":"IF(B589=\"\",\"\",A588+1)","v":""},"","","","","","","","","","","",""]
["","","","","","","","","","","","",""]
["","","","","","","","","","","","",""]
["","","","","","","","","","","","",""]
["","","","","","","","","","","","",""]
["","","","","","","","","","","","",""]
["","","","","","","","","","","","",""]
["","","","","","","","","","","","",""]
["","","","","","","","","","","","",""]
["","","","","","","","","","","","",""]
["","","","","","","","","","","","",""]
["","","","","","","","","","","","",""]
["","","","","","","","","","","","",""]
["","","","","","","","","","","","",""]
["","","","","","","","","","","","",""]
["","","","","","","","","","","","",""]
["","","","","","","","","","","","",""]
["","","","","","","","","","","","",""]
["","","","","","","","","","","","",""]
["","","","","","","","","","","","",""]
["","","","","","","","","","","","",""]
["","","","","","","","","","","","",""]
["","","","","","","","","","","","",""]
["","","","","","","","","","","","",""]
["","","","","","","","","","","","",""]
["","","","","","","","","","","","",""]
["","","","","","","","","","","","",""]
["","","","","","","","","","","","",""]
["","","","","","","","","","","","",""]
["","","","","","","","","","","","",""]
["","","","","","","","","","","","",""]
["","","","","","","","","","","","",""]
["","","","","","","","","","","","",""]
["","","","","","","","","","","","",""]
["","","","","","","","","","","","",""]
["","","","","","","","","","","","",""]
["","","","","","","","","","","","",""]
["","","","","","","","","","","","",""]
["","","","","","","","","","","","",""]
["","","","","","","","","","","","",""]
["","","","","","","","","","","","",""]
["","","","","","","","","","","","",""]
["","","","","","","","","","","","",""]
["","","","","","","","","","","","",""]
["","","","","","","","","","","","",""]
["","","","","","","","","","","","",""]
["","","","","","","","","","","","",""]
["","","","","","","","","","","","",""]
["","","","","","","","","","","","",""]
["","","","","","","","","","","","",""]
["","","","","","","","","","","","",""]
["","","","","","","","","","","","",""]
["","","","","","","","","","","","",""]
["","","","","","","","","","","","",""]
["","","","","","","","","","","","",""]
["","","","","","","","","","","","",""]
["","","","","","","","","","","","",""]
["","","","","","","","","","","","",""]
["","","","","","","","","","","","",""]
["","","","","","","","","","","","",""]
["","","","","","","","","","","","",""]
["","","","","","","","","","","","",""]
["",{"$f":"IFERROR(INDEX(Nom_choisis,ROW()-10,1),\"\")","v":""},{"$f":"IFERROR(INDEX(Nom_choisis,ROW()-10,2),\"\")","v":""},{"$f":"IFERROR(INDEX(Nom_choisis,ROW()-10,3),\"\")","v":""},{"$f":"IFERROR(INDEX(Nom_choisis,ROW()-10,4),\"\")","v":""},{"$f":"IFERROR(INDEX(Nom_choisis,ROW()-10,5),\"\")","v":""},{"$f":"IFERROR(INDEX(Nom_choisis,ROW()-10,6),\"\")","v":""},{"$f":"IFERROR(INDEX(Nom_choisis,ROW()-10,7),\"\")","v":""},{"$f":"IFERROR(INDEX(Nom_choisis,ROW()-10,8),\"\")","v":""},{"$f":"IFERROR(INDEX(Nom_choisis,ROW()-10,9),\"\")","v":""},{"$f":"IFERROR(INDEX(Nom_choisis,ROW()-10,14),\"\")","v":""},{"$f":"IFERROR(INDEX(Nom_choisis,ROW()-10,11),\"\")","v":""},{"$f":"IFERROR(INDEX(Nom_choisis,ROW()-10,12),\"\")","v":""}]
["","","","","","","","","","","","",""]
[{"$f":"IF(B653=\"\",\"\",A652+1)","v":""},"","","","","","","","","","","",""]
["","","","","","","","","","","","",""]
["","","","","","","","","","","","",""]
["","","","","","","","","","","","",""]
["","","","","","","","","","","","",""]
["","","","","","","","","","","","",""]
["","","","","","","","","","","","",""]
["","","","","","","","","","","","",""]
["","","","","","","","","","","","",""]
["","","","","","","","","","","","",""]
["","","","","","","","","","","","",""]
["","","","","","","","","","","","",""]
["","","","","","","","","","","","",""]
["","","","","","","","","","","","",""]
["","","","","","","","","","","","",""]
["","","","","","","","","","","","",""]
["","","","","","","","","","","","",""]
["","","","","","","","","","","","",""]
["","","","","","","","","","","","",""]
["","","","","","","","","","","","",""]
["","","","","","","","","","","","",""]
["","","","","","","","","","","","",""]
["","","","","","","","","","","","",""]
["","","","","","","","","","","","",""]
["","","","","","","","","","","","",""]
["","","","","","","","","","","","",""]
["","","","","","","","","","","","",""]
["","","","","","","","","","","","",""]
["","","","","","","","","","","","",""]
["","","","","","","","","","","","",""]
["","","","","","","","","","","","",""]
["","","","","","","","","","","","",""]
["","","","","","","","","","","","",""]
["","","","","","","","","","","","",""]
["","","","","","","","","","","","",""]
["","","","","","","","","","","","",""]
["","","","","","","","","","","","",""]
["","","","","","","","","","","","",""]
["","","","","","","","","","","","",""]
["","","","","","","","","","","","",""]
["","","","","","","","","","","","",""]
["","","","","","","","","","","","",""]
["","","","","","","","","","","","",""]
["","","","","","","","","","","","",""]
["","","","","","","","","","","","",""]
["","","","","","","","","","","","",""]
["","","","","","","","","","","","",""]
["","","","","","","","","","","","",""]
["","","","","","","","","","","","",""]
["","","","","","","","","","","","",""]
["","","","","","","","","","","","",""]
["","","","","","","","","","","","",""]
["","","","","","","","","","","","",""]
["","","","","","","","","","","","",""]
["","","","","","","","","","","","",""]
["","","","","","","","","","","","",""]
["","","","","","","","","","","","",""]
["","","","","","","","","","","","",""]
["","","","","","","","","","","","",""]
["","","","","","","","","","","","",""]
["","","","","","","","","","","","",""]
["","","","","","","","","","","","",""]
["",{"$f":"IFERROR(INDEX(Nom_choisis,ROW()-10,1),\"\")","v":""},{"$f":"IFERROR(INDEX(Nom_choisis,ROW()-10,2),\"\")","v":""},{"$f":"IFERROR(INDEX(Nom_choisis,ROW()-10,3),\"\")","v":""},{"$f":"IFERROR(INDEX(Nom_choisis,ROW()-10,4),\"\")","v":""},{"$f":"IFERROR(INDEX(Nom_choisis,ROW()-10,5),\"\")","v":""},{"$f":"IFERROR(INDEX(Nom_choisis,ROW()-10,6),\"\")","v":""},{"$f":"IFERROR(INDEX(Nom_choisis,ROW()-10,7),\"\")","v":""},{"$f":"IFERROR(INDEX(Nom_choisis,ROW()-10,8),\"\")","v":""},{"$f":"IFERROR(INDEX(Nom_choisis,ROW()-10,9),\"\")","v":""},{"$f":"IFERROR(INDEX(Nom_choisis,ROW()-10,14),\"\")","v":""},{"$f":"IFERROR(INDEX(Nom_choisis,ROW()-10,11),\"\")","v":""},{"$f":"IFERROR(INDEX(Nom_choisis,ROW()-10,12),\"\")","v":""}]
["","","","","","","","","","","","",""]
[{"$f":"IF(B717=\"\",\"\",A716+1)","v":""},"","","","","","","","","","","",""]
["","","","","","","","","","","","",""]
["","","","","","","","","","","","",""]
["","","","","","","","","","","","",""]
["","","","","","","","","","","","",""]
["","","","","","","","","","","","",""]
["","","","","","","","","","","","",""]
["","","","","","","","","","","","",""]
["","","","","","","","","","","","",""]
["","","","","","","","","","","","",""]
["","","","","","","","","","","","",""]
["","","","","","","","","","","","",""]
["","","","","","","","","","","","",""]
["","","","","","","","","","","","",""]
["","","","","","","","","","","","",""]
["","","","","","","","","","","","",""]
["","","","","","","","","","","","",""]
["","","","","","","","","","","","",""]
["","","","","","","","","","","","",""]
["","","","","","","","","","","","",""]
["","","","","","","","","","","","",""]
["","","","","","","","","","","","",""]
["","","","","","","","","","","","",""]
["","","","","","","","","","","","",""]
["","","","","","","","","","","","",""]
["","","","","","","","","","","","",""]
["","","","","","","","","","","","",""]
["","","","","","","","","","","","",""]
["","","","","","","","","","","","",""]
["","","","","","","","","","","","",""]
["","","","","","","","","","","","",""]
["","","","","","","","","","","","",""]
["","","","","","","","","","","","",""]
["","","","","","","","","","","","",""]
["","","","","","","","","","","","",""]
["","","","","","","","","","","","",""]
["","","","","","","","","","","","",""]
["","","","","","","","","","","","",""]
["","","","","","","","","","","","",""]
["","","","","","","","","","","","",""]
["","","","","","","","","","","","",""]
["","","","","","","","","","","","",""]
["","","","","","","","","","","","",""]
["","","","","","","","","","","","",""]
["","","","","","","","","","","","",""]
["","","","","","","","","","","","",""]
["","","","","","","","","","","","",""]
["","","","","","","","","","","","",""]
["","","","","","","","","","","","",""]
["","","","","","","","","","","","",""]
["","","","","","","","","","","","",""]
["","","","","","","","","","","","",""]
["","","","","","","","","","","","",""]
["","","","","","","","","","","","",""]
["","","","","","","","","","","","",""]
["","","","","","","","","","","","",""]
["","","","","","","","","","","","",""]
["","","","","","","","","","","","",""]
["","","","","","","","","","","","",""]
["","","","","","","","","","","","",""]
["","","","","","","","","","","","",""]
["","","","","","","","","","","","",""]
["",{"$f":"IFERROR(INDEX(Nom_choisis,ROW()-10,1),\"\")","v":""},{"$f":"IFERROR(INDEX(Nom_choisis,ROW()-10,2),\"\")","v":""},{"$f":"IFERROR(INDEX(Nom_choisis,ROW()-10,3),\"\")","v":""},{"$f":"IFERROR(INDEX(Nom_choisis,ROW()-10,4),\"\")","v":""},{"$f":"IFERROR(INDEX(Nom_choisis,ROW()-10,5),\"\")","v":""},{"$f":"IFERROR(INDEX(Nom_choisis,ROW()-10,6),\"\")","v":""},{"$f":"IFERROR(INDEX(Nom_choisis,ROW()-10,7),\"\")","v":""},{"$f":"IFERROR(INDEX(Nom_choisis,ROW()-10,8),\"\")","v":""},{"$f":"IFERROR(INDEX(Nom_choisis,ROW()-10,9),\"\")","v":""},{"$f":"IFERROR(INDEX(Nom_choisis,ROW()-10,14),\"\")","v":""},{"$f":"IFERROR(INDEX(Nom_choisis,ROW()-10,11),\"\")","v":""},{"$f":"IFERROR(INDEX(Nom_choisis,ROW()-10,12),\"\")","v":""}]
["","","","","","","","","","","","",""]
[{"$f":"IF(B781=\"\",\"\",A780+1)","v":""},"","","","","","","","","","","",""]
["","","","","","","","","","","","",""]
["","","","","","","","","","","","",""]
["","","","","","","","","","","","",""]
["","","","","","","","","","","","",""]
["","","","","","","","","","","","",""]
["","","","","","","","","","","","",""]
["","","","","","","","","","","","",""]
["","","","","","","","","","","","",""]
["","","","","","","","","","","","",""]
["","","","","","","","","","","","",""]
["","","","","","","","","","","","",""]
["","","","","","","","","","","","",""]
["","","","","","","","","","","","",""]
["","","","","","","","","","","","",""]
["","","","","","","","","","","","",""]
["","","","","","","","","","","","",""]
["","","","","","","","","","","","",""]
["","","","","","","","","","","","",""]
["","","","","","","","","","","","",""]
["","","","","","","","","","","","",""]
["","","","","","","","","","","","",""]
["","","","","","","","","","","","",""]
["","","","","","","","","","","","",""]
["","","","","","","","","","","","",""]
["","","","","","","","","","","","",""]
["","","","","","","","","","","","",""]
["","","","","","","","","","","","",""]
["","","","","","","","","","","","",""]
["","","","","","","","","","","","",""]
["","","","","","","","","","","","",""]
["","","","","","","","","","","","",""]
["","","","","","","","","","","","",""]
["","","","","","","","","","","","",""]
["","","","","","","","","","","","",""]
["","","","","","","","","","","","",""]
["","","","","","","","","","","","",""]
["","","","","","","","","","","","",""]
["","","","","","","","","","","","",""]
["","","","","","","","","","","","",""]
["","","","","","","","","","","","",""]
["","","","","","","","","","","","",""]
["","","","","","","","","","","","",""]
["","","","","","","","","","","","",""]
["","","","","","","","","","","","",""]
["","","","","","","","","","","","",""]
["","","","","","","","","","","","",""]
["","","","","","","","","","","","",""]
["","","","","","","","","","","","",""]
["","","","","","","","","","","","",""]
["","","","","","","","","","","","",""]
["","","","","","","","","","","","",""]
["","","","","","","","","","","","",""]
["","","","","","","","","","","","",""]
["","","","","","","","","","","","",""]
["","","","","","","","","","","","",""]
["","","","","","","","","","","","",""]
["","","","","","","","","","","","",""]
["","","","","","","","","","","","",""]
["","","","","","","","","","","","",""]
["","","","","","","","","","","","",""]
["","","","","","","","","","","","",""]
["",{"$f":"IFERROR(INDEX(Nom_choisis,ROW()-10,1),\"\")","v":""},{"$f":"IFERROR(INDEX(Nom_choisis,ROW()-10,2),\"\")","v":""},{"$f":"IFERROR(INDEX(Nom_choisis,ROW()-10,3),\"\")","v":""},{"$f":"IFERROR(INDEX(Nom_choisis,ROW()-10,4),\"\")","v":""},{"$f":"IFERROR(INDEX(Nom_choisis,ROW()-10,5),\"\")","v":""},{"$f":"IFERROR(INDEX(Nom_choisis,ROW()-10,6),\"\")","v":""},{"$f":"IFERROR(INDEX(Nom_choisis,ROW()-10,7),\"\")","v":""},{"$f":"IFERROR(INDEX(Nom_choisis,ROW()-10,8),\"\")","v":""},{"$f":"IFERROR(INDEX(Nom_choisis,ROW()-10,9),\"\")","v":""},{"$f":"IFERROR(INDEX(Nom_choisis,ROW()-10,14),\"\")","v":""},{"$f":"IFERROR(INDEX(Nom_choisis,ROW()-10,11),\"\")","v":""},{"$f":"IFERROR(INDEX(Nom_choisis,ROW()-10,12),\"\")","v":""}]
["","","","","","","","","","","","",""]
[{"$f":"IF(B845=\"\",\"\",A844+1)","v":""},"","","","","","","","","","","",""]
["","","","","","","","","","","","",""]
["","","","","","","","","","","","",""]
["","","","","","","","","","","","",""]
["","","","","","","","","","","","",""]
["","","","","","","","","","","","",""]
["","","","","","","","","","","","",""]
["","","","","","","","","","","","",""]
["","","","","","","","","","","","",""]
["","","","","","","","","","","","",""]
["","","","","","","","","","","","",""]
["","","","","","","","","","","","",""]
["","","","","","","","","","","","",""]
["","","","","","","","","","","","",""]
["","","","","","","","","","","","",""]
["","","","","","","","","","","","",""]
["","","","","","","","","","","","",""]
["","","","","","","","","","","","",""]
["","","","","","","","","","","","",""]
["","","","","","","","","","","","",""]
["","","","","","","","","","","","",""]
["","","","","","","","","","","","",""]
["","","","","","","","","","","","",""]
["","","","","","","","","","","","",""]
["","","","","","","","","","","","",""]
["","","","","","","","","","","","",""]
["","","","","","","","","","","","",""]
["","","","","","","","","","","","",""]
["","","","","","","","","","","","",""]
["","","","","","","","","","","","",""]
["","","","","","","","","","","","",""]
["","","","","","","","","","","","",""]
["","","","","","","","","","","","",""]
["","","","","","","","","","","","",""]
["","","","","","","","","","","","",""]
["","","","","","","","","","","","",""]
["","","","","","","","","","","","",""]
["","","","","","","","","","","","",""]
["","","","","","","","","","","","",""]
["","","","","","","","","","","","",""]
["","","","","","","","","","","","",""]
["","","","","","","","","","","","",""]
["","","","","","","","","","","","",""]
["","","","","","","","","","","","",""]
["","","","","","","","","","","","",""]
["","","","","","","","","","","","",""]
["","","","","","","","","","","","",""]
["","","","","","","","","","","","",""]
["","","","","","","","","","","","",""]
["","","","","","","","","","","","",""]
["","","","","","","","","","","","",""]
["","","","","","","","","","","","",""]
["","","","","","","","","","","","",""]
["","","","","","","","","","","","",""]
["","","","","","","","","","","","",""]
["","","","","","","","","","","","",""]
["","","","","","","","","","","","",""]
["","","","","","","","","","","","",""]
["","","","","","","","","","","","",""]
["","","","","","","","","","","","",""]
["","","","","","","","","","","","",""]
["","","","","","","","","","","","",""]
["",{"$f":"IFERROR(INDEX(Nom_choisis,ROW()-10,1),\"\")","v":""},{"$f":"IFERROR(INDEX(Nom_choisis,ROW()-10,2),\"\")","v":""},{"$f":"IFERROR(INDEX(Nom_choisis,ROW()-10,3),\"\")","v":""},{"$f":"IFERROR(INDEX(Nom_choisis,ROW()-10,4),\"\")","v":""},{"$f":"IFERROR(INDEX(Nom_choisis,ROW()-10,5),\"\")","v":""},{"$f":"IFERROR(INDEX(Nom_choisis,ROW()-10,6),\"\")","v":""},{"$f":"IFERROR(INDEX(Nom_choisis,ROW()-10,7),\"\")","v":""},{"$f":"IFERROR(INDEX(Nom_choisis,ROW()-10,8),\"\")","v":""},{"$f":"IFERROR(INDEX(Nom_choisis,ROW()-10,9),\"\")","v":""},{"$f":"IFERROR(INDEX(Nom_choisis,ROW()-10,14),\"\")","v":""},{"$f":"IFERROR(INDEX(Nom_choisis,ROW()-10,11),\"\")","v":""},{"$f":"IFERROR(INDEX(Nom_choisis,ROW()-10,12),\"\")","v":""}]
["","","","","","","","","","","","",""]
[{"$f":"IF(B909=\"\",\"\",A908+1)","v":""},"","","","","","","","","","","",""]
["","","","","","","","","","","","",""]
["","","","","","","","","","","","",""]
["","","","","","","","","","","","",""]
["","","","","","","","","","","","",""]
["","","","","","","","","","","","",""]
["","","","","","","","","","","","",""]
["","","","","","","","","","","","",""]
["","","","","","","","","","","","",""]
["","","","","","","","","","","","",""]
["","","","","","","","","","","","",""]
["","","","","","","","","","","","",""]
["","","","","","","","","","","","",""]
["","","","","","","","","","","","",""]
["","","","","","","","","","","","",""]
["","","","","","","","","","","","",""]
["","","","","","","","","","","","",""]
["","","","","","","","","","","","",""]
["","","","","","","","","","","","",""]
["","","","","","","","","","","","",""]
["","","","","","","","","","","","",""]
["","","","","","","","","","","","",""]
["","","","","","","","","","","","",""]
["","","","","","","","","","","","",""]
["","","","","","","","","","","","",""]
["","","","","","","","","","","","",""]
["","","","","","","","","","","","",""]
["","","","","","","","","","","","",""]
["","","","","","","","","","","","",""]
["","","","","","","","","","","","",""]
["","","","","","","","","","","","",""]
["","","","","","","","","","","","",""]
["","","","","","","","","","","","",""]
["","","","","","","","","","","","",""]
["","","","","","","","","","","","",""]
["","","","","","","","","","","","",""]
["","","","","","","","","","","","",""]
["","","","","","","","","","","","",""]
["","","","","","","","","","","","",""]
["","","","","","","","","","","","",""]
["","","","","","","","","","","","",""]
["","","","","","","","","","","","",""]
["","","","","","","","","","","","",""]
["","","","","","","","","","","","",""]
["","","","","","","","","","","","",""]
["","","","","","","","","","","","",""]
["","","","","","","","","","","","",""]
["","","","","","","","","","","","",""]
["","","","","","","","","","","","",""]
["","","","","","","","","","","","",""]
["","","","","","","","","","","","",""]
["","","","","","","","","","","","",""]
["","","","","","","","","","","","",""]
["","","","","","","","","","","","",""]
["","","","","","","","","","","","",""]
["","","","","","","","","","","","",""]
["","","","","","","","","","","","",""]
["","","","","","","","","","","","",""]
["","","","","","","","","","","","",""]
["","","","","","","","","","","","",""]
["","","","","","","","","","","","",""]
["","","","","","","","","","","","",""]
["",{"$f":"IFERROR(INDEX(Nom_choisis,ROW()-10,1),\"\")","v":""},{"$f":"IFERROR(INDEX(Nom_choisis,ROW()-10,2),\"\")","v":""},{"$f":"IFERROR(INDEX(Nom_choisis,ROW()-10,3),\"\")","v":""},{"$f":"IFERROR(INDEX(Nom_choisis,ROW()-10,4),\"\")","v":""},{"$f":"IFERROR(INDEX(Nom_choisis,ROW()-10,5),\"\")","v":""},{"$f":"IFERROR(INDEX(Nom_choisis,ROW()-10,6),\"\")","v":""},{"$f":"IFERROR(INDEX(Nom_choisis,ROW()-10,7),\"\")","v":""},{"$f":"IFERROR(INDEX(Nom_choisis,ROW()-10,8),\"\")","v":""},{"$f":"IFERROR(INDEX(Nom_choisis,ROW()-10,9),\"\")","v":""},{"$f":"IFERROR(INDEX(Nom_choisis,ROW()-10,14),\"\")","v":""},{"$f":"IFERROR(INDEX(Nom_choisis,ROW()-10,11),\"\")","v":""},{"$f":"IFERROR(INDEX(Nom_choisis,ROW()-10,12),\"\")","v":""}]
["","","","","","","","","","","","",""]
[{"$f":"IF(B973=\"\",\"\",A972+1)","v":""},"","","","","","","","","","","",""]
["","","","","","","","","","","","",""]
["","","","","","","","","","","","",""]
["","","","","","","","","","","","",""]
["","","","","","","","","","","","",""]
["","","","","","","","","","","","",""]
["","","","","","","","","","","","",""]
["","","","","","","","","","","","",""]
["","","","","","","","","","","","",""]
["","","","","","","","","","","","",""]
["","","","","","","","","","","","",""]
["","","","","","","","","","","","",""]
["","","","","","","","","","","","",""]
["","","","","","","","","","","","",""]
["","","","","","","","","","","","",""]
["","","","","","","","","","","","",""]
["","","","","","","","","","","","",""]
["","","","","","","","","","","","",""]
["","","","","","","","","","","","",""]
["","","","","","","","","","","","",""]
["","","","","","","","","","","","",""]
["","","","","","","","","","","","",""]
["","","","","","","","","","","","",""]
["","","","","","","","","","","","",""]
["","","","","","","","","","","","",""]
["","","","","","","","","","","","",""]
["","","","","","","","","","","","",""]
["","","","","","","","","","","","",""]
["","","","","","","","","","","","",""]
["","","","","","","","","","","","",""]
["","","","","","","","","","","","",""]
["","","","","","","","","","","","",""]
["","","","","","","","","","","","",""]
["","","","","","","","","","","","",""]
["","","","","","","","","","","","",""]
["","","","","","","","","","","","",""]
["","","","","","","","","","","","",""]
["","","","","","","","","","","","",""]
["","","","","","","","","","","","",""]
["","","","","","","","","","","","",""]
["","","","","","","","","","","","",""]
["","","","","","","","","","","","",""]
["","","","","","","","","","","","",""]
["","","","","","","","","","","","",""]
["","","","","","","","","","","","",""]
["","","","","","","","","","","","",""]
["","","","","","","","","","","","",""]
["","","","","","","","","","","","",""]
["","","","","","","","","","","","",""]
["","","","","","","","","","","","",""]
["","","","","","","","","","","","",""]
["","","","","","","","","","","","",""]
["","","","","","","","","","","","",""]
["","","","","","","","","","","","",""]
["","","","","","","","","","","","",""]
["","","","","","","","","","","","",""]

{"sheet":"X","index":5,"n_rows":1000,"n_cols":10,"rows_kept":1000,"cut":false,"hidden":true,"merged":[]}
[null,"date Fac vente","Date Reg vente","date Fac achat","Date Reg achat","Années"]
[null,null,null,null,null,"2016-01-01",null,"IF","RAISON SOCIAL","ICE"]
[null,null,null,null,null,"2017-01-01",null,1007788,"FOURNISSEUR 0001","00001111004000055"]
[null,{"$f":"EOMONTH(VENTE!A4,-1)+1","v":"2015-05-01"},{"$f":"EOMONTH(VENTE!I4,-1)+1","v":"2016-01-01"},null,null,"2018-01-01",null,1007851,"FOURNISSEUR 0002","00011111004000056"]
[null,{"$f":"EOMONTH(VENTE!A5,-1)+1","v":"2015-05-01"},{"$f":"EOMONTH(VENTE!I5,-1)+1","v":"2016-01-01"},{"$f":"EOMONTH(ACHAT!M5,-1)+1","v":"2014-11-01"},{"$f":"EOMONTH(ACHAT!L5,-1)+1","v":"2014-11-01"},"2019-01-01",null,1007914,"FOURNISSEUR 0003","00021111004000057"]
[null,{"$f":"EOMONTH(VENTE!A6,-1)+1","v":"2015-07-01"},{"$f":"EOMONTH(VENTE!I6,-1)+1","v":"2016-01-01"},{"$f":"EOMONTH(ACHAT!M6,-1)+1","v":"2015-01-01"},{"$f":"EOMONTH(ACHAT!L6,-1)+1","v":"2015-01-01"},"2020-01-01",null,1007977,"FOURNISSEUR 0004","00031111004000058"]
[null,{"$f":"EOMONTH(VENTE!A7,-1)+1","v":"2015-08-01"},{"$f":"EOMONTH(VENTE!I7,-1)+1","v":"2016-01-01"},{"$f":"EOMONTH(ACHAT!M7,-1)+1","v":"2014-10-01"},{"$f":"EOMONTH(ACHAT!L7,-1)+1","v":"2015-01-01"},null,null,1008040,"FOURNISSEUR 0005","00041111004000059"]
[null,{"$f":"EOMONTH(VENTE!A8,-1)+1","v":"2015-09-01"},{"$f":"EOMONTH(VENTE!I8,-1)+1","v":"2016-01-01"},{"$f":"EOMONTH(ACHAT!M8,-1)+1","v":"2014-10-01"},{"$f":"EOMONTH(ACHAT!L8,-1)+1","v":"2015-01-01"},null,null,1008103,"FOURNISSEUR 0006","00051111004000060"]
[null,{"$f":"EOMONTH(VENTE!A9,-1)+1","v":"2015-09-01"},{"$f":"EOMONTH(VENTE!I9,-1)+1","v":"2016-01-01"},{"$f":"EOMONTH(ACHAT!M9,-1)+1","v":"2015-01-01"},{"$f":"EOMONTH(ACHAT!L9,-1)+1","v":"2015-01-01"},null,null,1008166,"FOURNISSEUR 0007","00061111004000061"]
[null,{"$f":"EOMONTH(VENTE!A10,-1)+1","v":"2015-09-01"},{"$f":"EOMONTH(VENTE!I10,-1)+1","v":"2016-01-01"},{"$f":"EOMONTH(ACHAT!M10,-1)+1","v":"2015-01-01"},{"$f":"EOMONTH(ACHAT!L10,-1)+1","v":"2015-01-01"},null,null,1008229,"FOURNISSEUR 0008","00071111004000062"]
[null,{"$f":"EOMONTH(VENTE!A11,-1)+1","v":"2015-11-01"},{"$f":"EOMONTH(VENTE!I11,-1)+1","v":"2016-01-01"},{"$f":"EOMONTH(ACHAT!M11,-1)+1","v":"2015-02-01"},{"$f":"EOMONTH(ACHAT!L11,-1)+1","v":"2015-02-01"},null,null,1008292,"FOURNISSEUR 0009","00081111004000063"]
[null,{"$f":"EOMONTH(VENTE!A12,-1)+1","v":"2015-11-01"},{"$f":"EOMONTH(VENTE!I12,-1)+1","v":"2016-01-01"},{"$f":"EOMONTH(ACHAT!M12,-1)+1","v":"2014-11-01"},{"$f":"EOMONTH(ACHAT!L12,-1)+1","v":"2015-02-01"},null,null,1008355,"FOURNISSEUR 0010","00091111004000064"]
[null,{"$f":"EOMONTH(VENTE!A13,-1)+1","v":"2016-01-01"},{"$f":"EOMONTH(VENTE!I13,-1)+1","v":"2016-01-01"},{"$f":"EOMONTH(ACHAT!M13,-1)+1","v":"2015-02-01"},{"$f":"EOMONTH(ACHAT!L13,-1)+1","v":"2015-03-01"},null,null,1008418,"FOURNISSEUR 0011","00101111004000065"]
[null,{"$f":"EOMONTH(VENTE!A14,-1)+1","v":"2016-01-01"},{"$f":"EOMONTH(VENTE!I14,-1)+1","v":"2016-01-01"},{"$f":"EOMONTH(ACHAT!M14,-1)+1","v":"2015-02-01"},{"$f":"EOMONTH(ACHAT!L14,-1)+1","v":"2015-03-01"},null,null,1008481,"FOURNISSEUR 0012","00111111004000066"]
[null,{"$f":"EOMONTH(VENTE!A15,-1)+1","v":"2016-01-01"},{"$f":"EOMONTH(VENTE!I15,-1)+1","v":"2016-01-01"},{"$f":"EOMONTH(ACHAT!M15,-1)+1","v":"2014-10-01"},{"$f":"EOMONTH(ACHAT!L15,-1)+1","v":"2015-03-01"},null,null,1008544,"FOURNISSEUR 0013","00121111004000067"]
[null,{"$f":"EOMONTH(VENTE!A16,-1)+1","v":"2016-01-01"},{"$f":"EOMONTH(VENTE!I16,-1)+1","v":"2016-01-01"},{"$f":"EOMONTH(ACHAT!M16,-1)+1","v":"2014-10-01"},{"$f":"EOMONTH(ACHAT!L16,-1)+1","v":"2015-03-01"},null,null,1008607,"FOURNISSEUR 0014","00131111004000068"]
[null,{"$f":"EOMONTH(VENTE!A17,-1)+1","v":"2016-01-01"},{"$f":"EOMONTH(VENTE!I17,-1)+1","v":"2016-01-01"},{"$f":"EOMONTH(ACHAT!M17,-1)+1","v":"2014-11-01"},{"$f":"EOMONTH(ACHAT!L17,-1)+1","v":"2015-03-01"},null,null,1008670,"FOURNISSEUR 0015","00141111004000069"]
[null,{"$f":"EOMONTH(VENTE!A18,-1)+1","v":"2016-01-01"},{"$f":"EOMONTH(VENTE!I18,-1)+1","v":"2016-01-01"},{"$f":"EOMONTH(ACHAT!M18,-1)+1","v":"2014-11-01"},{"$f":"EOMONTH(ACHAT!L18,-1)+1","v":"2015-03-01"},null,null,1008733,"FOURNISSEUR 0016","00151111004000070"]
[null,{"$f":"EOMONTH(VENTE!A19,-1)+1","v":"2016-01-01"},{"$f":"EOMONTH(VENTE!I19,-1)+1","v":"2016-01-01"},{"$f":"EOMONTH(ACHAT!M19,-1)+1","v":"2014-11-01"},{"$f":"EOMONTH(ACHAT!L19,-1)+1","v":"2015-03-01"},null,null,1008796,"FOURNISSEUR 0017","00161111004000071"]
[null,{"$f":"EOMONTH(VENTE!A20,-1)+1","v":"2016-01-01"},{"$f":"EOMONTH(VENTE!I20,-1)+1","v":"2016-01-01"},{"$f":"EOMONTH(ACHAT!M20,-1)+1","v":"2014-11-01"},{"$f":"EOMONTH(ACHAT!L20,-1)+1","v":"2015-03-01"},null,null,1008859,"FOURNISSEUR 0016","00171111004000072"]
[null,{"$f":"EOMONTH(VENTE!A21,-1)+1","v":"2016-01-01"},{"$f":"EOMONTH(VENTE!I21,-1)+1","v":"2016-01-01"},{"$f":"EOMONTH(ACHAT!M21,-1)+1","v":"2014-12-01"},{"$f":"EOMONTH(ACHAT!L21,-1)+1","v":"2015-03-01"},null,null,1008922,"FOURNISSEUR 0019","00181111004000073"]
[null,{"$f":"EOMONTH(VENTE!A22,-1)+1","v":"2016-01-01"},{"$f":"EOMONTH(VENTE!I22,-1)+1","v":"2016-01-01"},{"$f":"EOMONTH(ACHAT!M22,-1)+1","v":"2014-12-01"},{"$f":"EOMONTH(ACHAT!L22,-1)+1","v":"2015-03-01"},null,null,1008985,"FOURNISSEUR 0020","00191111004000074"]
[null,{"$f":"EOMONTH(VENTE!A23,-1)+1","v":"2016-01-01"},{"$f":"EOMONTH(VENTE!I23,-1)+1","v":"2016-01-01"},{"$f":"EOMONTH(ACHAT!M23,-1)+1","v":"2014-12-01"},{"$f":"EOMONTH(ACHAT!L23,-1)+1","v":"2015-03-01"},null,null,1009048,"FOURNISSEUR 0021","00201111004000075"]
[null,{"$f":"EOMONTH(VENTE!A24,-1)+1","v":"2016-01-01"},{"$f":"EOMONTH(VENTE!I24,-1)+1","v":"2016-01-01"},{"$f":"EOMONTH(ACHAT!M24,-1)+1","v":"2014-12-01"},{"$f":"EOMONTH(ACHAT!L24,-1)+1","v":"2015-03-01"},null,null,1009111,"FOURNISSEUR 0022","00211111004000076"]
[null,{"$f":"EOMONTH(VENTE!A25,-1)+1","v":"2016-01-01"},{"$f":"EOMONTH(VENTE!I25,-1)+1","v":"2016-01-01"},{"$f":"EOMONTH(ACHAT!M25,-1)+1","v":"2015-02-01"},{"$f":"EOMONTH(ACHAT!L25,-1)+1","v":"2015-03-01"},null,null,1009174,"FOURNISSEUR 0023","00221111004000077"]
[null,{"$f":"EOMONTH(VENTE!A26,-1)+1","v":"2016-01-01"},{"$f":"EOMONTH(VENTE!I26,-1)+1","v":"2016-01-01"},{"$f":"EOMONTH(ACHAT!M26,-1)+1","v":"2015-03-01"},{"$f":"EOMONTH(ACHAT!L26,-1)+1","v":"2015-03-01"},null,null,1009237,"FOURNISSEUR 0024","00231111004000078"]
[null,{"$f":"EOMONTH(VENTE!A27,-1)+1","v":"2016-01-01"},{"$f":"EOMONTH(VENTE!I27,-1)+1","v":"2016-01-01"},{"$f":"EOMONTH(ACHAT!M27,-1)+1","v":"2015-03-01"},{"$f":"EOMONTH(ACHAT!L27,-1)+1","v":"2015-03-01"},null,null,1009300,"FOURNISSEUR 0025","00241111004000079"]
[null,{"$f":"EOMONTH(VENTE!A28,-1)+1","v":"2016-01-01"},{"$f":"EOMONTH(VENTE!I28,-1)+1","v":"2016-01-01"},{"$f":"EOMONTH(ACHAT!M28,-1)+1","v":"2015-03-01"},{"$f":"EOMONTH(ACHAT!L28,-1)+1","v":"2015-03-01"},null,null,1009363,"FOURNISSEUR 0026","00251111004000080"]
[null,{"$f":"EOMONTH(VENTE!A29,-1)+1","v":"2016-01-01"},{"$f":"EOMONTH(VENTE!I29,-1)+1","v":"2016-01-01"},{"$f":"EOMONTH(ACHAT!M29,-1)+1","v":"2015-03-01"},{"$f":"EOMONTH(ACHAT!L29,-1)+1","v":"2015-03-01"},null,null,1009426,"FOURNISSEUR 0027","00261111004000081"]
[null,{"$f":"EOMONTH(VENTE!A30,-1)+1","v":"2016-01-01"},{"$f":"EOMONTH(VENTE!I30,-1)+1","v":"2016-01-01"},{"$f":"EOMONTH(ACHAT!M30,-1)+1","v":"2015-03-01"},{"$f":"EOMONTH(ACHAT!L30,-1)+1","v":"2015-04-01"},null,null,1009489,"FOURNISSEUR 0028","00271111004000082"]
[null,{"$f":"EOMONTH(VENTE!A31,-1)+1","v":"2016-01-01"},{"$f":"EOMONTH(VENTE!I31,-1)+1","v":"2016-01-01"},{"$f":"EOMONTH(ACHAT!M31,-1)+1","v":"2015-02-01"},{"$f":"EOMONTH(ACHAT!L31,-1)+1","v":"2015-03-01"},null,null,1009552,"FOURNISSEUR 0029","00281111004000083"]
[null,{"$f":"EOMONTH(VENTE!A32,-1)+1","v":"2016-01-01"},{"$f":"EOMONTH(VENTE!I32,-1)+1","v":"2016-01-01"},{"$f":"EOMONTH(ACHAT!M32,-1)+1","v":"2015-03-01"},{"$f":"EOMONTH(ACHAT!L32,-1)+1","v":"2015-03-01"},null,null,1009615,"FOURNISSEUR 0030","00291111004000084"]
[null,{"$f":"EOMONTH(VENTE!A33,-1)+1","v":"2016-01-01"},{"$f":"EOMONTH(VENTE!I33,-1)+1","v":"2016-01-01"},{"$f":"EOMONTH(ACHAT!M33,-1)+1","v":"2015-03-01"},{"$f":"EOMONTH(ACHAT!L33,-1)+1","v":"2015-03-01"},null,null,1009678,"FOURNISSEUR 0031","00301111004000085"]
[null,{"$f":"EOMONTH(VENTE!A34,-1)+1","v":"2015-10-01"},{"$f":"EOMONTH(VENTE!I34,-1)+1","v":"2016-02-01"},{"$f":"EOMONTH(ACHAT!M34,-1)+1","v":"2015-04-01"},{"$f":"EOMONTH(ACHAT!L34,-1)+1","v":"2015-04-01"},null,null,1009741,"FOURNISSEUR 0032","00311111004000086"]
[null,{"$f":"EOMONTH(VENTE!A35,-1)+1","v":"2015-12-01"},{"$f":"EOMONTH(VENTE!I35,-1)+1","v":"2016-02-01"},{"$f":"EOMONTH(ACHAT!M35,-1)+1","v":"2015-04-01"},{"$f":"EOMONTH(ACHAT!L35,-1)+1","v":"2015-04-01"},null,null,1009804,"FOURNISSEUR 0033","00321111004000087"]
[null,{"$f":"EOMONTH(VENTE!A36,-1)+1","v":"2016-02-01"},{"$f":"EOMONTH(VENTE!I36,-1)+1","v":"2016-02-01"},{"$f":"EOMONTH(ACHAT!M36,-1)+1","v":"2015-01-01"},{"$f":"EOMONTH(ACHAT!L36,-1)+1","v":"2015-04-01"}]
[null,{"$f":"EOMONTH(VENTE!A37,-1)+1","v":"2016-02-01"},{"$f":"EOMONTH(VENTE!I37,-1)+1","v":"2016-02-01"},{"$f":"EOMONTH(ACHAT!M37,-1)+1","v":"2015-04-01"},{"$f":"EOMONTH(ACHAT!L37,-1)+1","v":"2015-04-01"}]
[null,{"$f":"EOMONTH(VENTE!A38,-1)+1","v":"2016-02-01"},{"$f":"EOMONTH(VENTE!I38,-1)+1","v":"2016-02-01"},{"$f":"EOMONTH(ACHAT!M38,-1)+1","v":"2015-01-01"},{"$f":"EOMONTH(ACHAT!L38,-1)+1","v":"2015-05-01"}]
[null,{"$f":"EOMONTH(VENTE!A39,-1)+1","v":"2016-02-01"},{"$f":"EOMONTH(VENTE!I39,-1)+1","v":"2016-02-01"},{"$f":"EOMONTH(ACHAT!M39,-1)+1","v":"2015-01-01"},{"$f":"EOMONTH(ACHAT!L39,-1)+1","v":"2015-05-01"}]
[null,{"$f":"EOMONTH(VENTE!A40,-1)+1","v":"2016-02-01"},{"$f":"EOMONTH(VENTE!I40,-1)+1","v":"2016-02-01"},{"$f":"EOMONTH(ACHAT!M40,-1)+1","v":"2015-02-01"},{"$f":"EOMONTH(ACHAT!L40,-1)+1","v":"2015-05-01"}]
[null,{"$f":"EOMONTH(VENTE!A41,-1)+1","v":"2016-02-01"},{"$f":"EOMONTH(VENTE!I41,-1)+1","v":"2016-02-01"},{"$f":"EOMONTH(ACHAT!M41,-1)+1","v":"2015-04-01"},{"$f":"EOMONTH(ACHAT!L41,-1)+1","v":"2015-05-01"}]
[null,{"$f":"EOMONTH(VENTE!A42,-1)+1","v":"2016-02-01"},{"$f":"EOMONTH(VENTE!I42,-1)+1","v":"2016-02-01"},{"$f":"EOMONTH(ACHAT!M42,-1)+1","v":"2015-05-01"},{"$f":"EOMONTH(ACHAT!L42,-1)+1","v":"2015-05-01"}]
[null,{"$f":"EOMONTH(VENTE!A43,-1)+1","v":"2016-02-01"},{"$f":"EOMONTH(VENTE!I43,-1)+1","v":"2016-02-01"},{"$f":"EOMONTH(ACHAT!M43,-1)+1","v":"2015-05-01"},{"$f":"EOMONTH(ACHAT!L43,-1)+1","v":"2015-05-01"}]
[null,{"$f":"EOMONTH(VENTE!A44,-1)+1","v":"2016-02-01"},{"$f":"EOMONTH(VENTE!I44,-1)+1","v":"2016-02-01"},{"$f":"EOMONTH(ACHAT!M44,-1)+1","v":"2015-06-01"},{"$f":"EOMONTH(ACHAT!L44,-1)+1","v":"2015-05-01"}]
[null,{"$f":"EOMONTH(VENTE!A45,-1)+1","v":"2016-02-01"},{"$f":"EOMONTH(VENTE!I45,-1)+1","v":"2016-02-01"},{"$f":"EOMONTH(ACHAT!M45,-1)+1","v":"2015-02-01"},{"$f":"EOMONTH(ACHAT!L45,-1)+1","v":"2015-06-01"}]
[null,{"$f":"EOMONTH(VENTE!A46,-1)+1","v":"2016-02-01"},{"$f":"EOMONTH(VENTE!I46,-1)+1","v":"2016-02-01"},{"$f":"EOMONTH(ACHAT!M46,-1)+1","v":"2015-02-01"},{"$f":"EOMONTH(ACHAT!L46,-1)+1","v":"2015-06-01"}]
[null,{"$f":"EOMONTH(VENTE!A47,-1)+1","v":"2016-02-01"},{"$f":"EOMONTH(VENTE!I47,-1)+1","v":"2016-02-01"},{"$f":"EOMONTH(ACHAT!M47,-1)+1","v":"2015-02-01"},{"$f":"EOMONTH(ACHAT!L47,-1)+1","v":"2015-06-01"}]
[null,{"$f":"EOMONTH(VENTE!A48,-1)+1","v":"2016-02-01"},{"$f":"EOMONTH(VENTE!I48,-1)+1","v":"2016-02-01"},{"$f":"EOMONTH(ACHAT!M48,-1)+1","v":"2015-02-01"},{"$f":"EOMONTH(ACHAT!L48,-1)+1","v":"2015-06-01"}]
[null,{"$f":"EOMONTH(VENTE!A49,-1)+1","v":"2016-02-01"},{"$f":"EOMONTH(VENTE!I49,-1)+1","v":"2016-02-01"},{"$f":"EOMONTH(ACHAT!M49,-1)+1","v":"2015-05-01"},{"$f":"EOMONTH(ACHAT!L49,-1)+1","v":"2015-06-01"}]
[null,{"$f":"EOMONTH(VENTE!A50,-1)+1","v":"2016-02-01"},{"$f":"EOMONTH(VENTE!I50,-1)+1","v":"2016-02-01"},{"$f":"EOMONTH(ACHAT!M50,-1)+1","v":"2015-06-01"},{"$f":"EOMONTH(ACHAT!L50,-1)+1","v":"2015-06-01"}]
[null,{"$f":"EOMONTH(VENTE!A51,-1)+1","v":"2016-02-01"},{"$f":"EOMONTH(VENTE!I51,-1)+1","v":"2016-02-01"},{"$f":"EOMONTH(ACHAT!M51,-1)+1","v":"2015-06-01"},{"$f":"EOMONTH(ACHAT!L51,-1)+1","v":"2015-06-01"}]
[null,{"$f":"EOMONTH(VENTE!A52,-1)+1","v":"2016-02-01"},{"$f":"EOMONTH(VENTE!I52,-1)+1","v":"2016-02-01"},{"$f":"EOMONTH(ACHAT!M52,-1)+1","v":"2015-03-01"},{"$f":"EOMONTH(ACHAT!L52,-1)+1","v":"2015-06-01"}]
[null,{"$f":"EOMONTH(VENTE!A53,-1)+1","v":"2016-02-01"},{"$f":"EOMONTH(VENTE!I53,-1)+1","v":"2016-02-01"},{"$f":"EOMONTH(ACHAT!M53,-1)+1","v":"2015-03-01"},{"$f":"EOMONTH(ACHAT!L53,-1)+1","v":"2015-06-01"}]
[null,{"$f":"EOMONTH(VENTE!A54,-1)+1","v":"2016-02-01"},{"$f":"EOMONTH(VENTE!I54,-1)+1","v":"2016-02-01"},{"$f":"EOMONTH(ACHAT!M54,-1)+1","v":"2015-06-01"},{"$f":"EOMONTH(ACHAT!L54,-1)+1","v":"2015-06-01"}]
[null,{"$f":"EOMONTH(VENTE!A55,-1)+1","v":"2016-02-01"},{"$f":"EOMONTH(VENTE!I55,-1)+1","v":"2016-02-01"},{"$f":"EOMONTH(ACHAT!M55,-1)+1","v":"2015-03-01"},{"$f":"EOMONTH(ACHAT!L55,-1)+1","v":"2015-07-01"}]
[null,{"$f":"EOMONTH(VENTE!A56,-1)+1","v":"2016-02-01"},{"$f":"EOMONTH(VENTE!I56,-1)+1","v":"2016-02-01"},{"$f":"EOMONTH(ACHAT!M56,-1)+1","v":"2015-03-01"},{"$f":"EOMONTH(ACHAT!L56,-1)+1","v":"2015-07-01"}]
[null,{"$f":"EOMONTH(VENTE!A57,-1)+1","v":"2016-02-01"},{"$f":"EOMONTH(VENTE!I57,-1)+1","v":"2016-02-01"},{"$f":"EOMONTH(ACHAT!M57,-1)+1","v":"2015-03-01"},{"$f":"EOMONTH(ACHAT!L57,-1)+1","v":"2015-07-01"}]
[null,{"$f":"EOMONTH(VENTE!A58,-1)+1","v":"2016-02-01"},{"$f":"EOMONTH(VENTE!I58,-1)+1","v":"2016-02-01"},{"$f":"EOMONTH(ACHAT!M58,-1)+1","v":"2015-03-01"},{"$f":"EOMONTH(ACHAT!L58,-1)+1","v":"2015-07-01"}]
[null,{"$f":"EOMONTH(VENTE!A59,-1)+1","v":"2016-02-01"},{"$f":"EOMONTH(VENTE!I59,-1)+1","v":"2016-02-01"},{"$f":"EOMONTH(ACHAT!M59,-1)+1","v":"2015-07-01"},{"$f":"EOMONTH(ACHAT!L59,-1)+1","v":"2015-07-01"}]
[null,{"$f":"EOMONTH(VENTE!A60,-1)+1","v":"2016-02-01"},{"$f":"EOMONTH(VENTE!I60,-1)+1","v":"2016-02-01"},{"$f":"EOMONTH(ACHAT!M60,-1)+1","v":"2015-07-01"},{"$f":"EOMONTH(ACHAT!L60,-1)+1","v":"2015-06-01"}]
[null,{"$f":"EOMONTH(VENTE!A61,-1)+1","v":"2016-02-01"},{"$f":"EOMONTH(VENTE!I61,-1)+1","v":"2016-02-01"},{"$f":"EOMONTH(ACHAT!M61,-1)+1","v":"2015-03-01"},{"$f":"EOMONTH(ACHAT!L61,-1)+1","v":"2015-07-01"}]
[null,{"$f":"EOMONTH(VENTE!A62,-1)+1","v":"2016-02-01"},{"$f":"EOMONTH(VENTE!I62,-1)+1","v":"2016-02-01"},{"$f":"EOMONTH(ACHAT!M62,-1)+1","v":"2015-04-01"},{"$f":"EOMONTH(ACHAT!L62,-1)+1","v":"2015-07-01"}]
[null,{"$f":"EOMONTH(VENTE!A63,-1)+1","v":"2016-02-01"},{"$f":"EOMONTH(VENTE!I63,-1)+1","v":"2016-02-01"},{"$f":"EOMONTH(ACHAT!M63,-1)+1","v":"2015-07-01"},{"$f":"EOMONTH(ACHAT!L63,-1)+1","v":"2015-07-01"}]
[null,{"$f":"EOMONTH(VENTE!A64,-1)+1","v":"2016-02-01"},{"$f":"EOMONTH(VENTE!I64,-1)+1","v":"2016-02-01"},{"$f":"EOMONTH(ACHAT!M64,-1)+1","v":"2015-04-01"},{"$f":"EOMONTH(ACHAT!L64,-1)+1","v":"2015-07-01"}]
[null,{"$f":"EOMONTH(VENTE!A65,-1)+1","v":"2016-02-01"},{"$f":"EOMONTH(VENTE!I65,-1)+1","v":"2016-02-01"},{"$f":"EOMONTH(ACHAT!M65,-1)+1","v":"2015-04-01"},{"$f":"EOMONTH(ACHAT!L65,-1)+1","v":"2015-07-01"}]
[null,{"$f":"EOMONTH(VENTE!A66,-1)+1","v":"2016-02-01"},{"$f":"EOMONTH(VENTE!I66,-1)+1","v":"2016-02-01"},{"$f":"EOMONTH(ACHAT!M66,-1)+1","v":"2015-04-01"},{"$f":"EOMONTH(ACHAT!L66,-1)+1","v":"2015-07-01"}]
[null,{"$f":"EOMONTH(VENTE!A67,-1)+1","v":"2016-02-01"},{"$f":"EOMONTH(VENTE!I67,-1)+1","v":"2016-02-01"},{"$f":"EOMONTH(ACHAT!M67,-1)+1","v":"2015-08-01"},{"$f":"EOMONTH(ACHAT!L67,-1)+1","v":"2015-08-01"}]
[null,{"$f":"EOMONTH(VENTE!A68,-1)+1","v":"2016-02-01"},{"$f":"EOMONTH(VENTE!I68,-1)+1","v":"2016-02-01"},{"$f":"EOMONTH(ACHAT!M68,-1)+1","v":"2015-08-01"},{"$f":"EOMONTH(ACHAT!L68,-1)+1","v":"2015-08-01"}]
[null,{"$f":"EOMONTH(VENTE!A69,-1)+1","v":"2016-02-01"},{"$f":"EOMONTH(VENTE!I69,-1)+1","v":"2016-02-01"},{"$f":"EOMONTH(ACHAT!M69,-1)+1","v":"2015-08-01"},{"$f":"EOMONTH(ACHAT!L69,-1)+1","v":"2015-08-01"}]
[null,{"$f":"EOMONTH(VENTE!A70,-1)+1","v":"2016-02-01"},{"$f":"EOMONTH(VENTE!I70,-1)+1","v":"2016-02-01"},{"$f":"EOMONTH(ACHAT!M70,-1)+1","v":"2015-05-01"},{"$f":"EOMONTH(ACHAT!L70,-1)+1","v":"2015-08-01"}]
[null,{"$f":"EOMONTH(VENTE!A71,-1)+1","v":"2016-02-01"},{"$f":"EOMONTH(VENTE!I71,-1)+1","v":"2016-02-01"},{"$f":"EOMONTH(ACHAT!M71,-1)+1","v":"2015-05-01"},{"$f":"EOMONTH(ACHAT!L71,-1)+1","v":"2015-08-01"}]
[null,{"$f":"EOMONTH(VENTE!A72,-1)+1","v":"2016-02-01"},{"$f":"EOMONTH(VENTE!I72,-1)+1","v":"2016-02-01"},{"$f":"EOMONTH(ACHAT!M72,-1)+1","v":"2015-05-01"},{"$f":"EOMONTH(ACHAT!L72,-1)+1","v":"2015-08-01"}]
[null,{"$f":"EOMONTH(VENTE!A73,-1)+1","v":"2016-02-01"},{"$f":"EOMONTH(VENTE!I73,-1)+1","v":"2016-02-01"},{"$f":"EOMONTH(ACHAT!M73,-1)+1","v":"2015-09-01"},{"$f":"EOMONTH(ACHAT!L73,-1)+1","v":"2015-08-01"}]
[null,{"$f":"EOMONTH(VENTE!A74,-1)+1","v":"2015-11-01"},{"$f":"EOMONTH(VENTE!I74,-1)+1","v":"2016-03-01"},{"$f":"EOMONTH(ACHAT!M74,-1)+1","v":"2015-09-01"},{"$f":"EOMONTH(ACHAT!L74,-1)+1","v":"2015-08-01"}]
[null,{"$f":"EOMONTH(VENTE!A75,-1)+1","v":"2015-11-01"},{"$f":"EOMONTH(VENTE!I75,-1)+1","v":"2016-03-01"},{"$f":"EOMONTH(ACHAT!M75,-1)+1","v":"2015-09-01"},{"$f":"EOMONTH(ACHAT!L75,-1)+1","v":"2015-08-01"}]
[null,{"$f":"EOMONTH(VENTE!A76,-1)+1","v":"2015-11-01"},{"$f":"EOMONTH(VENTE!I76,-1)+1","v":"2016-03-01"},{"$f":"EOMONTH(ACHAT!M76,-1)+1","v":"2015-05-01"},{"$f":"EOMONTH(ACHAT!L76,-1)+1","v":"2015-09-01"}]
[null,{"$f":"EOMONTH(VENTE!A77,-1)+1","v":"2015-12-01"},{"$f":"EOMONTH(VENTE!I77,-1)+1","v":"2016-03-01"},{"$f":"EOMONTH(ACHAT!M77,-1)+1","v":"2015-05-01"},{"$f":"EOMONTH(ACHAT!L77,-1)+1","v":"2015-09-01"}]
[null,{"$f":"EOMONTH(VENTE!A78,-1)+1","v":"2015-12-01"},{"$f":"EOMONTH(VENTE!I78,-1)+1","v":"2016-03-01"},{"$f":"EOMONTH(ACHAT!M78,-1)+1","v":"2015-05-01"},{"$f":"EOMONTH(ACHAT!L78,-1)+1","v":"2015-09-01"}]
[null,{"$f":"EOMONTH(VENTE!A79,-1)+1","v":"2015-12-01"},{"$f":"EOMONTH(VENTE!I79,-1)+1","v":"2016-03-01"},{"$f":"EOMONTH(ACHAT!M79,-1)+1","v":"2015-06-01"},{"$f":"EOMONTH(ACHAT!L79,-1)+1","v":"2015-07-01"}]
[null,{"$f":"EOMONTH(VENTE!A80,-1)+1","v":"2016-01-01"},{"$f":"EOMONTH(VENTE!I80,-1)+1","v":"2016-03-01"},{"$f":"EOMONTH(ACHAT!M80,-1)+1","v":"2015-07-01"},{"$f":"EOMONTH(ACHAT!L80,-1)+1","v":"2015-08-01"}]
[null,{"$f":"EOMONTH(VENTE!A81,-1)+1","v":"2016-01-01"},{"$f":"EOMONTH(VENTE!I81,-1)+1","v":"2016-03-01"},{"$f":"EOMONTH(ACHAT!M81,-1)+1","v":"2015-08-01"},{"$f":"EOMONTH(ACHAT!L81,-1)+1","v":"2015-08-01"}]
[null,{"$f":"EOMONTH(VENTE!A82,-1)+1","v":"2016-02-01"},{"$f":"EOMONTH(VENTE!I82,-1)+1","v":"2016-03-01"},{"$f":"EOMONTH(ACHAT!M82,-1)+1","v":"2015-08-01"},{"$f":"EOMONTH(ACHAT!L82,-1)+1","v":"2015-09-01"}]
[null,{"$f":"EOMONTH(VENTE!A83,-1)+1","v":"2016-03-01"},{"$f":"EOMONTH(VENTE!I83,-1)+1","v":"2016-03-01"},{"$f":"EOMONTH(ACHAT!M83,-1)+1","v":"2015-06-01"},{"$f":"EOMONTH(ACHAT!L83,-1)+1","v":"2015-10-01"}]
[null,{"$f":"EOMONTH(VENTE!A84,-1)+1","v":"2016-03-01"},{"$f":"EOMONTH(VENTE!I84,-1)+1","v":"2016-03-01"},{"$f":"EOMONTH(ACHAT!M84,-1)+1","v":"2015-07-01"},{"$f":"EOMONTH(ACHAT!L84,-1)+1","v":"2015-10-01"}]
[null,{"$f":"EOMONTH(VENTE!A85,-1)+1","v":"2016-03-01"},{"$f":"EOMONTH(VENTE!I85,-1)+1","v":"2016-03-01"},{"$f":"EOMONTH(ACHAT!M85,-1)+1","v":"2015-06-01"},{"$f":"EOMONTH(ACHAT!L85,-1)+1","v":"2015-06-01"}]
[null,{"$f":"EOMONTH(VENTE!A86,-1)+1","v":"2016-03-01"},{"$f":"EOMONTH(VENTE!I86,-1)+1","v":"2016-03-01"},{"$f":"EOMONTH(ACHAT!M86,-1)+1","v":"2015-06-01"},{"$f":"EOMONTH(ACHAT!L86,-1)+1","v":"2015-09-01"}]
[null,{"$f":"EOMONTH(VENTE!A87,-1)+1","v":"2016-03-01"},{"$f":"EOMONTH(VENTE!I87,-1)+1","v":"2016-03-01"},{"$f":"EOMONTH(ACHAT!M87,-1)+1","v":"2015-09-01"},{"$f":"EOMONTH(ACHAT!L87,-1)+1","v":"2015-09-01"}]
[null,{"$f":"EOMONTH(VENTE!A88,-1)+1","v":"2016-03-01"},{"$f":"EOMONTH(VENTE!I88,-1)+1","v":"2016-03-01"},{"$f":"EOMONTH(ACHAT!M88,-1)+1","v":"2015-09-01"},{"$f":"EOMONTH(ACHAT!L88,-1)+1","v":"2015-09-01"}]
[null,{"$f":"EOMONTH(VENTE!A89,-1)+1","v":"2016-03-01"},{"$f":"EOMONTH(VENTE!I89,-1)+1","v":"2016-03-01"},{"$f":"EOMONTH(ACHAT!M89,-1)+1","v":"2015-09-01"},{"$f":"EOMONTH(ACHAT!L89,-1)+1","v":"2015-10-01"}]
[null,{"$f":"EOMONTH(VENTE!A90,-1)+1","v":"2016-03-01"},{"$f":"EOMONTH(VENTE!I90,-1)+1","v":"2016-03-01"},{"$f":"EOMONTH(ACHAT!M90,-1)+1","v":"2015-10-01"},{"$f":"EOMONTH(ACHAT!L90,-1)+1","v":"2015-10-01"}]
[null,{"$f":"EOMONTH(VENTE!A91,-1)+1","v":"2016-03-01"},{"$f":"EOMONTH(VENTE!I91,-1)+1","v":"2016-03-01"},{"$f":"EOMONTH(ACHAT!M91,-1)+1","v":"2015-11-01"},{"$f":"EOMONTH(ACHAT!L91,-1)+1","v":"2015-11-01"}]
[null,{"$f":"EOMONTH(VENTE!A92,-1)+1","v":"2016-03-01"},{"$f":"EOMONTH(VENTE!I92,-1)+1","v":"2016-03-01"},{"$f":"EOMONTH(ACHAT!M92,-1)+1","v":"2015-02-01"},{"$f":"EOMONTH(ACHAT!L92,-1)+1","v":"2015-06-01"}]
[null,{"$f":"EOMONTH(VENTE!A93,-1)+1","v":"2016-03-01"},{"$f":"EOMONTH(VENTE!I93,-1)+1","v":"2016-03-01"},{"$f":"EOMONTH(ACHAT!M93,-1)+1","v":"2015-03-01"},{"$f":"EOMONTH(ACHAT!L93,-1)+1","v":"2015-06-01"}]
[null,{"$f":"EOMONTH(VENTE!A94,-1)+1","v":"2016-03-01"},{"$f":"EOMONTH(VENTE!I94,-1)+1","v":"2016-03-01"},{"$f":"EOMONTH(ACHAT!M94,-1)+1","v":"2015-04-01"},{"$f":"EOMONTH(ACHAT!L94,-1)+1","v":"2015-06-01"}]
[null,{"$f":"EOMONTH(VENTE!A95,-1)+1","v":"2016-03-01"},{"$f":"EOMONTH(VENTE!I95,-1)+1","v":"2016-03-01"},{"$f":"EOMONTH(ACHAT!M95,-1)+1","v":"2015-06-01"},{"$f":"EOMONTH(ACHAT!L95,-1)+1","v":"2015-11-01"}]
[null,{"$f":"EOMONTH(VENTE!A96,-1)+1","v":"2016-03-01"},{"$f":"EOMONTH(VENTE!I96,-1)+1","v":"2016-03-01"},{"$f":"EOMONTH(ACHAT!M96,-1)+1","v":"2015-06-01"},{"$f":"EOMONTH(ACHAT!L96,-1)+1","v":"2015-11-01"}]
[null,{"$f":"EOMONTH(VENTE!A97,-1)+1","v":"2016-03-01"},{"$f":"EOMONTH(VENTE!I97,-1)+1","v":"2016-03-01"},{"$f":"EOMONTH(ACHAT!M97,-1)+1","v":"2015-07-01"},{"$f":"EOMONTH(ACHAT!L97,-1)+1","v":"2015-11-01"}]
[null,{"$f":"EOMONTH(VENTE!A98,-1)+1","v":"2016-03-01"},{"$f":"EOMONTH(VENTE!I98,-1)+1","v":"2016-03-01"},{"$f":"EOMONTH(ACHAT!M98,-1)+1","v":"2015-07-01"},{"$f":"EOMONTH(ACHAT!L98,-1)+1","v":"2015-11-01"}]
[null,{"$f":"EOMONTH(VENTE!A99,-1)+1","v":"2016-03-01"},{"$f":"EOMONTH(VENTE!I99,-1)+1","v":"2016-03-01"},{"$f":"EOMONTH(ACHAT!M99,-1)+1","v":"2015-11-01"},{"$f":"EOMONTH(ACHAT!L99,-1)+1","v":"2015-11-01"}]
[null,{"$f":"EOMONTH(VENTE!A100,-1)+1","v":"2016-03-01"},{"$f":"EOMONTH(VENTE!I100,-1)+1","v":"2016-03-01"},{"$f":"EOMONTH(ACHAT!M100,-1)+1","v":"2015-11-01"},{"$f":"EOMONTH(ACHAT!L100,-1)+1","v":"2015-11-01"}]
[null,{"$f":"EOMONTH(VENTE!A101,-1)+1","v":"2016-03-01"},{"$f":"EOMONTH(VENTE!I101,-1)+1","v":"2016-03-01"},{"$f":"EOMONTH(ACHAT!M101,-1)+1","v":"2015-08-01"},{"$f":"EOMONTH(ACHAT!L101,-1)+1","v":"2015-11-01"}]
[null,{"$f":"EOMONTH(VENTE!A102,-1)+1","v":"2016-03-01"},{"$f":"EOMONTH(VENTE!I102,-1)+1","v":"2016-03-01"},{"$f":"EOMONTH(ACHAT!M102,-1)+1","v":"2015-08-01"},{"$f":"EOMONTH(ACHAT!L102,-1)+1","v":"2015-12-01"}]
[null,{"$f":"EOMONTH(VENTE!A103,-1)+1","v":"2016-03-01"},{"$f":"EOMONTH(VENTE!I103,-1)+1","v":"2016-03-01"},{"$f":"EOMONTH(ACHAT!M103,-1)+1","v":"2015-09-01"},{"$f":"EOMONTH(ACHAT!L103,-1)+1","v":"2015-12-01"}]
[null,{"$f":"EOMONTH(VENTE!A104,-1)+1","v":"2016-03-01"},{"$f":"EOMONTH(VENTE!I104,-1)+1","v":"2016-03-01"},{"$f":"EOMONTH(ACHAT!M104,-1)+1","v":"2015-08-01"},{"$f":"EOMONTH(ACHAT!L104,-1)+1","v":"2015-12-01"}]
[null,{"$f":"EOMONTH(VENTE!A105,-1)+1","v":"2016-03-01"},{"$f":"EOMONTH(VENTE!I105,-1)+1","v":"2016-03-01"},{"$f":"EOMONTH(ACHAT!M105,-1)+1","v":"2015-08-01"},{"$f":"EOMONTH(ACHAT!L105,-1)+1","v":"2015-12-01"}]
[null,{"$f":"EOMONTH(VENTE!A106,-1)+1","v":"2016-03-01"},{"$f":"EOMONTH(VENTE!I106,-1)+1","v":"2016-03-01"},{"$f":"EOMONTH(ACHAT!M106,-1)+1","v":"2016-01-01"},{"$f":"EOMONTH(ACHAT!L106,-1)+1","v":"2016-01-01"}]
[null,{"$f":"EOMONTH(VENTE!A107,-1)+1","v":"2016-03-01"},{"$f":"EOMONTH(VENTE!I107,-1)+1","v":"2016-03-01"},{"$f":"EOMONTH(ACHAT!M107,-1)+1","v":"2015-10-01"},{"$f":"EOMONTH(ACHAT!L107,-1)+1","v":"2016-01-01"}]
[null,{"$f":"EOMONTH(VENTE!A108,-1)+1","v":"2016-03-01"},{"$f":"EOMONTH(VENTE!I108,-1)+1","v":"2016-03-01"},{"$f":"EOMONTH(ACHAT!M108,-1)+1","v":"2015-12-01"},{"$f":"EOMONTH(ACHAT!L108,-1)+1","v":"2016-01-01"}]
[null,{"$f":"EOMONTH(VENTE!A109,-1)+1","v":"2016-03-01"},{"$f":"EOMONTH(VENTE!I109,-1)+1","v":"2016-03-01"},{"$f":"EOMONTH(ACHAT!M109,-1)+1","v":"2015-12-01"},{"$f":"EOMONTH(ACHAT!L109,-1)+1","v":"2016-01-01"}]
[null,{"$f":"EOMONTH(VENTE!A110,-1)+1","v":"2016-03-01"},{"$f":"EOMONTH(VENTE!I110,-1)+1","v":"2016-03-01"},{"$f":"EOMONTH(ACHAT!M110,-1)+1","v":"2015-12-01"},{"$f":"EOMONTH(ACHAT!L110,-1)+1","v":"2016-01-01"}]
[null,{"$f":"EOMONTH(VENTE!A111,-1)+1","v":"2016-03-01"},{"$f":"EOMONTH(VENTE!I111,-1)+1","v":"2016-03-01"},{"$f":"EOMONTH(ACHAT!M111,-1)+1","v":"2015-10-01"},{"$f":"EOMONTH(ACHAT!L111,-1)+1","v":"2016-02-01"}]
[null,{"$f":"EOMONTH(VENTE!A112,-1)+1","v":"2016-03-01"},{"$f":"EOMONTH(VENTE!I112,-1)+1","v":"2016-03-01"},{"$f":"EOMONTH(ACHAT!M112,-1)+1","v":"2015-10-01"},{"$f":"EOMONTH(ACHAT!L112,-1)+1","v":"2016-02-01"}]
[null,{"$f":"EOMONTH(VENTE!A113,-1)+1","v":"2016-03-01"},{"$f":"EOMONTH(VENTE!I113,-1)+1","v":"2016-03-01"},{"$f":"EOMONTH(ACHAT!M113,-1)+1","v":"2015-10-01"},{"$f":"EOMONTH(ACHAT!L113,-1)+1","v":"2016-02-01"}]
[null,{"$f":"EOMONTH(VENTE!A114,-1)+1","v":"2016-03-01"},{"$f":"EOMONTH(VENTE!I114,-1)+1","v":"2016-03-01"},{"$f":"EOMONTH(ACHAT!M114,-1)+1","v":"2015-10-01"},{"$f":"EOMONTH(ACHAT!L114,-1)+1","v":"2016-02-01"}]
[null,{"$f":"EOMONTH(VENTE!A115,-1)+1","v":"2016-03-01"},{"$f":"EOMONTH(VENTE!I115,-1)+1","v":"2016-03-01"},{"$f":"EOMONTH(ACHAT!M115,-1)+1","v":"2015-11-01"},{"$f":"EOMONTH(ACHAT!L115,-1)+1","v":"2016-02-01"}]
[null,{"$f":"EOMONTH(VENTE!A116,-1)+1","v":"2016-03-01"},{"$f":"EOMONTH(VENTE!I116,-1)+1","v":"2016-03-01"},{"$f":"EOMONTH(ACHAT!M116,-1)+1","v":"2015-10-01"},{"$f":"EOMONTH(ACHAT!L116,-1)+1","v":"2016-02-01"}]
[null,{"$f":"EOMONTH(VENTE!A117,-1)+1","v":"2016-03-01"},{"$f":"EOMONTH(VENTE!I117,-1)+1","v":"2016-03-01"},{"$f":"EOMONTH(ACHAT!M117,-1)+1","v":"2015-01-01"},{"$f":"EOMONTH(ACHAT!L117,-1)+1","v":"2016-02-01"}]
[null,{"$f":"EOMONTH(VENTE!A118,-1)+1","v":"2016-03-01"},{"$f":"EOMONTH(VENTE!I118,-1)+1","v":"2016-03-01"},{"$f":"EOMONTH(ACHAT!M118,-1)+1","v":"2015-08-01"},{"$f":"EOMONTH(ACHAT!L118,-1)+1","v":"2016-02-01"}]
[null,{"$f":"EOMONTH(VENTE!A119,-1)+1","v":"2016-03-01"},{"$f":"EOMONTH(VENTE!I119,-1)+1","v":"2016-03-01"},{"$f":"EOMONTH(ACHAT!M119,-1)+1","v":"2015-11-01"},{"$f":"EOMONTH(ACHAT!L119,-1)+1","v":"2016-02-01"}]
[null,{"$f":"EOMONTH(VENTE!A120,-1)+1","v":"2016-03-01"},{"$f":"EOMONTH(VENTE!I120,-1)+1","v":"2016-03-01"},{"$f":"EOMONTH(ACHAT!M120,-1)+1","v":"2015-12-01"},{"$f":"EOMONTH(ACHAT!L120,-1)+1","v":"2016-02-01"}]
[null,{"$f":"EOMONTH(VENTE!A121,-1)+1","v":"2016-03-01"},{"$f":"EOMONTH(VENTE!I121,-1)+1","v":"2016-03-01"},{"$f":"EOMONTH(ACHAT!M121,-1)+1","v":"2015-12-01"},{"$f":"EOMONTH(ACHAT!L121,-1)+1","v":"2016-02-01"}]
[null,{"$f":"EOMONTH(VENTE!A122,-1)+1","v":"2015-11-01"},{"$f":"EOMONTH(VENTE!I122,-1)+1","v":"2016-04-01"},{"$f":"EOMONTH(ACHAT!M122,-1)+1","v":"2016-02-01"},{"$f":"EOMONTH(ACHAT!L122,-1)+1","v":"2016-02-01"}]
[null,{"$f":"EOMONTH(VENTE!A123,-1)+1","v":"2015-11-01"},{"$f":"EOMONTH(VENTE!I123,-1)+1","v":"2016-04-01"},{"$f":"EOMONTH(ACHAT!M123,-1)+1","v":"2015-11-01"},{"$f":"EOMONTH(ACHAT!L123,-1)+1","v":"2016-02-01"}]
[null,{"$f":"EOMONTH(VENTE!A124,-1)+1","v":"2015-11-01"},{"$f":"EOMONTH(VENTE!I124,-1)+1","v":"2016-04-01"},{"$f":"EOMONTH(ACHAT!M124,-1)+1","v":"2015-11-01"},{"$f":"EOMONTH(ACHAT!L124,-1)+1","v":"2016-02-01"}]
[null,{"$f":"EOMONTH(VENTE!A125,-1)+1","v":"2015-12-01"},{"$f":"EOMONTH(VENTE!I125,-1)+1","v":"2016-04-01"},{"$f":"EOMONTH(ACHAT!M125,-1)+1","v":"2015-11-01"},{"$f":"EOMONTH(ACHAT!L125,-1)+1","v":"2016-02-01"}]
[null,{"$f":"EOMONTH(VENTE!A126,-1)+1","v":"2015-12-01"},{"$f":"EOMONTH(VENTE!I126,-1)+1","v":"2016-04-01"},{"$f":"EOMONTH(ACHAT!M126,-1)+1","v":"2016-01-01"},{"$f":"EOMONTH(ACHAT!L126,-1)+1","v":"2016-01-01"}]
[null,{"$f":"EOMONTH(VENTE!A127,-1)+1","v":"2016-01-01"},{"$f":"EOMONTH(VENTE!I127,-1)+1","v":"2016-04-01"},{"$f":"EOMONTH(ACHAT!M127,-1)+1","v":"2016-02-01"},{"$f":"EOMONTH(ACHAT!L127,-1)+1","v":"2016-02-01"}]
[null,{"$f":"EOMONTH(VENTE!A128,-1)+1","v":"2016-01-01"},{"$f":"EOMONTH(VENTE!I128,-1)+1","v":"2016-04-01"},{"$f":"EOMONTH(ACHAT!M128,-1)+1","v":"2016-02-01"},{"$f":"EOMONTH(ACHAT!L128,-1)+1","v":"2016-02-01"}]
[null,{"$f":"EOMONTH(VENTE!A129,-1)+1","v":"2016-01-01"},{"$f":"EOMONTH(VENTE!I129,-1)+1","v":"2016-04-01"},{"$f":"EOMONTH(ACHAT!M129,-1)+1","v":"2016-03-01"},{"$f":"EOMONTH(ACHAT!L129,-1)+1","v":"2016-02-01"}]
[null,{"$f":"EOMONTH(VENTE!A130,-1)+1","v":"2016-01-01"},{"$f":"EOMONTH(VENTE!I130,-1)+1","v":"2016-04-01"},{"$f":"EOMONTH(ACHAT!M130,-1)+1","v":"2015-12-01"},{"$f":"EOMONTH(ACHAT!L130,-1)+1","v":"2016-03-01"}]
[null,{"$f":"EOMONTH(VENTE!A131,-1)+1","v":"2016-02-01"},{"$f":"EOMONTH(VENTE!I131,-1)+1","v":"2016-04-01"},{"$f":"EOMONTH(ACHAT!M131,-1)+1","v":"2015-12-01"},{"$f":"EOMONTH(ACHAT!L131,-1)+1","v":"2016-03-01"}]
[null,{"$f":"EOMONTH(VENTE!A132,-1)+1","v":"2016-03-01"},{"$f":"EOMONTH(VENTE!I132,-1)+1","v":"2016-03-01"},{"$f":"EOMONTH(ACHAT!M132,-1)+1","v":"2016-03-01"},{"$f":"EOMONTH(ACHAT!L132,-1)+1","v":"2016-03-01"}]
[null,{"$f":"EOMONTH(VENTE!A133,-1)+1","v":"2016-03-01"},{"$f":"EOMONTH(VENTE!I133,-1)+1","v":"2016-04-01"},{"$f":"EOMONTH(ACHAT!M133,-1)+1","v":"2016-03-01"},{"$f":"EOMONTH(ACHAT!L133,-1)+1","v":"2016-03-01"}]
[null,{"$f":"EOMONTH(VENTE!A134,-1)+1","v":"2016-03-01"},{"$f":"EOMONTH(VENTE!I134,-1)+1","v":"2016-04-01"},{"$f":"EOMONTH(ACHAT!M134,-1)+1","v":"2015-12-01"},{"$f":"EOMONTH(ACHAT!L134,-1)+1","v":"2016-03-01"}]
[null,{"$f":"EOMONTH(VENTE!A135,-1)+1","v":"2016-03-01"},{"$f":"EOMONTH(VENTE!I135,-1)+1","v":"2016-04-01"},{"$f":"EOMONTH(ACHAT!M135,-1)+1","v":"2016-03-01"},{"$f":"EOMONTH(ACHAT!L135,-1)+1","v":"2016-03-01"}]
[null,{"$f":"EOMONTH(VENTE!A136,-1)+1","v":"2016-03-01"},{"$f":"EOMONTH(VENTE!I136,-1)+1","v":"2016-04-01"},{"$f":"EOMONTH(ACHAT!M136,-1)+1","v":"2016-03-01"},{"$f":"EOMONTH(ACHAT!L136,-1)+1","v":"2016-03-01"}]
[null,{"$f":"EOMONTH(VENTE!A137,-1)+1","v":"2016-03-01"},{"$f":"EOMONTH(VENTE!I137,-1)+1","v":"2016-04-01"},{"$f":"EOMONTH(ACHAT!M137,-1)+1","v":"2015-01-01"},{"$f":"EOMONTH(ACHAT!L137,-1)+1","v":"2015-01-01"}]
[null,{"$f":"EOMONTH(VENTE!A138,-1)+1","v":"2016-04-01"},{"$f":"EOMONTH(VENTE!I138,-1)+1","v":"2016-04-01"},{"$f":"EOMONTH(ACHAT!M138,-1)+1","v":"2015-01-01"},{"$f":"EOMONTH(ACHAT!L138,-1)+1","v":"2015-01-01"}]
[null,{"$f":"EOMONTH(VENTE!A139,-1)+1","v":"2016-04-01"},{"$f":"EOMONTH(VENTE!I139,-1)+1","v":"2016-04-01"},{"$f":"EOMONTH(ACHAT!M139,-1)+1","v":"2015-02-01"},{"$f":"EOMONTH(ACHAT!L139,-1)+1","v":"2015-01-01"}]
[null,{"$f":"EOMONTH(VENTE!A140,-1)+1","v":"2016-04-01"},{"$f":"EOMONTH(VENTE!I140,-1)+1","v":"2016-04-01"},{"$f":"EOMONTH(ACHAT!M140,-1)+1","v":"2016-03-01"},{"$f":"EOMONTH(ACHAT!L140,-1)+1","v":"2015-03-01"}]
[null,{"$f":"EOMONTH(VENTE!A141,-1)+1","v":"2016-04-01"},{"$f":"EOMONTH(VENTE!I141,-1)+1","v":"2016-04-01"},{"$f":"EOMONTH(ACHAT!M141,-1)+1","v":"2015-02-01"},{"$f":"EOMONTH(ACHAT!L141,-1)+1","v":"2015-04-01"}]
[null,{"$f":"EOMONTH(VENTE!A142,-1)+1","v":"2016-04-01"},{"$f":"EOMONTH(VENTE!I142,-1)+1","v":"2016-04-01"},{"$f":"EOMONTH(ACHAT!M142,-1)+1","v":"2015-02-01"},{"$f":"EOMONTH(ACHAT!L142,-1)+1","v":"2015-04-01"}]
[null,{"$f":"EOMONTH(VENTE!A143,-1)+1","v":"2016-04-01"},{"$f":"EOMONTH(VENTE!I143,-1)+1","v":"2016-04-01"},{"$f":"EOMONTH(ACHAT!M143,-1)+1","v":"2015-03-01"},{"$f":"EOMONTH(ACHAT!L143,-1)+1","v":"2015-04-01"}]
[null,{"$f":"EOMONTH(VENTE!A144,-1)+1","v":"2016-04-01"},{"$f":"EOMONTH(VENTE!I144,-1)+1","v":"2016-04-01"},{"$f":"EOMONTH(ACHAT!M144,-1)+1","v":"2015-03-01"},{"$f":"EOMONTH(ACHAT!L144,-1)+1","v":"2015-04-01"}]
[null,{"$f":"EOMONTH(VENTE!A145,-1)+1","v":"2016-04-01"},{"$f":"EOMONTH(VENTE!I145,-1)+1","v":"2016-04-01"},{"$f":"EOMONTH(ACHAT!M145,-1)+1","v":"2015-04-01"},{"$f":"EOMONTH(ACHAT!L145,-1)+1","v":"2015-04-01"}]
[null,{"$f":"EOMONTH(VENTE!A146,-1)+1","v":"2016-04-01"},{"$f":"EOMONTH(VENTE!I146,-1)+1","v":"2016-04-01"},{"$f":"EOMONTH(ACHAT!M146,-1)+1","v":"2015-03-01"},{"$f":"EOMONTH(ACHAT!L146,-1)+1","v":"2015-06-01"}]
[null,{"$f":"EOMONTH(VENTE!A147,-1)+1","v":"2016-04-01"},{"$f":"EOMONTH(VENTE!I147,-1)+1","v":"2016-04-01"},{"$f":"EOMONTH(ACHAT!M147,-1)+1","v":"2015-03-01"},{"$f":"EOMONTH(ACHAT!L147,-1)+1","v":"2015-06-01"}]
[null,{"$f":"EOMONTH(VENTE!A148,-1)+1","v":"2016-04-01"},{"$f":"EOMONTH(VENTE!I148,-1)+1","v":"2016-04-01"},{"$f":"EOMONTH(ACHAT!M148,-1)+1","v":"2015-05-01"},{"$f":"EOMONTH(ACHAT!L148,-1)+1","v":"2015-06-01"}]
[null,{"$f":"EOMONTH(VENTE!A149,-1)+1","v":"2016-04-01"},{"$f":"EOMONTH(VENTE!I149,-1)+1","v":"2016-04-01"},{"$f":"EOMONTH(ACHAT!M149,-1)+1","v":"2015-04-01"},{"$f":"EOMONTH(ACHAT!L149,-1)+1","v":"2015-06-01"}]
[null,{"$f":"EOMONTH(VENTE!A150,-1)+1","v":"2016-04-01"},{"$f":"EOMONTH(VENTE!I150,-1)+1","v":"2016-04-01"},{"$f":"EOMONTH(ACHAT!M150,-1)+1","v":"2015-04-01"},{"$f":"EOMONTH(ACHAT!L150,-1)+1","v":"2015-07-01"}]
[null,{"$f":"EOMONTH(VENTE!A151,-1)+1","v":"2016-04-01"},{"$f":"EOMONTH(VENTE!I151,-1)+1","v":"2016-04-01"},{"$f":"EOMONTH(ACHAT!M151,-1)+1","v":"2015-04-01"},{"$f":"EOMONTH(ACHAT!L151,-1)+1","v":"2015-07-01"}]
[null,{"$f":"EOMONTH(VENTE!A152,-1)+1","v":"2016-04-01"},{"$f":"EOMONTH(VENTE!I152,-1)+1","v":"2016-04-01"},{"$f":"EOMONTH(ACHAT!M152,-1)+1","v":"2015-06-01"},{"$f":"EOMONTH(ACHAT!L152,-1)+1","v":"2015-07-01"}]
[null,{"$f":"EOMONTH(VENTE!A153,-1)+1","v":"2016-04-01"},{"$f":"EOMONTH(VENTE!I153,-1)+1","v":"2016-04-01"},{"$f":"EOMONTH(ACHAT!M153,-1)+1","v":"2015-05-01"},{"$f":"EOMONTH(ACHAT!L153,-1)+1","v":"2015-08-01"}]
[null,{"$f":"EOMONTH(VENTE!A154,-1)+1","v":"2016-04-01"},{"$f":"EOMONTH(VENTE!I154,-1)+1","v":"2016-04-01"},{"$f":"EOMONTH(ACHAT!M154,-1)+1","v":"2015-05-01"},{"$f":"EOMONTH(ACHAT!L154,-1)+1","v":"2015-08-01"}]
[null,{"$f":"EOMONTH(VENTE!A155,-1)+1","v":"2016-04-01"},{"$f":"EOMONTH(VENTE!I155,-1)+1","v":"2016-04-01"},{"$f":"EOMONTH(ACHAT!M155,-1)+1","v":"2015-07-01"},{"$f":"EOMONTH(ACHAT!L155,-1)+1","v":"2015-08-01"}]
[null,{"$f":"EOMONTH(VENTE!A156,-1)+1","v":"2016-04-01"},{"$f":"EOMONTH(VENTE!I156,-1)+1","v":"2016-04-01"},{"$f":"EOMONTH(ACHAT!M156,-1)+1","v":"2015-05-01"},{"$f":"EOMONTH(ACHAT!L156,-1)+1","v":"2015-08-01"}]
[null,{"$f":"EOMONTH(VENTE!A157,-1)+1","v":"2016-04-01"},{"$f":"EOMONTH(VENTE!I157,-1)+1","v":"2016-04-01"},{"$f":"EOMONTH(ACHAT!M157,-1)+1","v":"2015-06-01"},{"$f":"EOMONTH(ACHAT!L157,-1)+1","v":"2015-08-01"}]
[null,{"$f":"EOMONTH(VENTE!A158,-1)+1","v":"2016-03-01"},{"$f":"EOMONTH(VENTE!I158,-1)+1","v":"2016-05-01"},{"$f":"EOMONTH(ACHAT!M158,-1)+1","v":"2015-07-01"},{"$f":"EOMONTH(ACHAT!L158,-1)+1","v":"2015-08-01"}]
[null,{"$f":"EOMONTH(VENTE!A159,-1)+1","v":"2016-03-01"},{"$f":"EOMONTH(VENTE!I159,-1)+1","v":"2016-05-01"},{"$f":"EOMONTH(ACHAT!M159,-1)+1","v":"2015-06-01"},{"$f":"EOMONTH(ACHAT!L159,-1)+1","v":"2015-09-01"}]
[null,{"$f":"EOMONTH(VENTE!A160,-1)+1","v":"2016-03-01"},{"$f":"EOMONTH(VENTE!I160,-1)+1","v":"2016-05-01"},{"$f":"EOMONTH(ACHAT!M160,-1)+1","v":"2015-06-01"},{"$f":"EOMONTH(ACHAT!L160,-1)+1","v":"2015-09-01"}]
[null,{"$f":"EOMONTH(VENTE!A161,-1)+1","v":"2016-03-01"},{"$f":"EOMONTH(VENTE!I161,-1)+1","v":"2016-03-01"},{"$f":"EOMONTH(ACHAT!M161,-1)+1","v":"2015-07-01"},{"$f":"EOMONTH(ACHAT!L161,-1)+1","v":"2015-09-01"}]
[null,{"$f":"EOMONTH(VENTE!A162,-1)+1","v":"2016-04-01"},{"$f":"EOMONTH(VENTE!I162,-1)+1","v":"2016-05-01"},{"$f":"EOMONTH(ACHAT!M162,-1)+1","v":"2015-07-01"},{"$f":"EOMONTH(ACHAT!L162,-1)+1","v":"2015-09-01"}]
[null,{"$f":"EOMONTH(VENTE!A163,-1)+1","v":"2016-05-01"},{"$f":"EOMONTH(VENTE!I163,-1)+1","v":"2016-05-01"},{"$f":"EOMONTH(ACHAT!M163,-1)+1","v":"2015-08-01"},{"$f":"EOMONTH(ACHAT!L163,-1)+1","v":"2015-09-01"}]
[null,{"$f":"EOMONTH(VENTE!A164,-1)+1","v":"2016-05-01"},{"$f":"EOMONTH(VENTE!I164,-1)+1","v":"2016-05-01"},{"$f":"EOMONTH(ACHAT!M164,-1)+1","v":"2015-09-01"},{"$f":"EOMONTH(ACHAT!L164,-1)+1","v":"2015-10-01"}]
[null,{"$f":"EOMONTH(VENTE!A165,-1)+1","v":"2016-05-01"},{"$f":"EOMONTH(VENTE!I165,-1)+1","v":"2016-05-01"},{"$f":"EOMONTH(ACHAT!M165,-1)+1","v":"2015-10-01"},{"$f":"EOMONTH(ACHAT!L165,-1)+1","v":"2015-11-01"}]
[null,{"$f":"EOMONTH(VENTE!A166,-1)+1","v":"2016-05-01"},{"$f":"EOMONTH(VENTE!I166,-1)+1","v":"2016-05-01"},{"$f":"EOMONTH(ACHAT!M166,-1)+1","v":"2015-08-01"},{"$f":"EOMONTH(ACHAT!L166,-1)+1","v":"2015-11-01"}]
[null,{"$f":"EOMONTH(VENTE!A167,-1)+1","v":"2016-05-01"},{"$f":"EOMONTH(VENTE!I167,-1)+1","v":"2016-05-01"},{"$f":"EOMONTH(ACHAT!M167,-1)+1","v":"2015-09-01"},{"$f":"EOMONTH(ACHAT!L167,-1)+1","v":"2015-11-01"}]
[null,{"$f":"EOMONTH(VENTE!A168,-1)+1","v":"2016-05-01"},{"$f":"EOMONTH(VENTE!I168,-1)+1","v":"2016-05-01"},{"$f":"EOMONTH(ACHAT!M168,-1)+1","v":"2015-10-01"},{"$f":"EOMONTH(ACHAT!L168,-1)+1","v":"2015-11-01"}]
[null,{"$f":"EOMONTH(VENTE!A169,-1)+1","v":"2016-05-01"},{"$f":"EOMONTH(VENTE!I169,-1)+1","v":"2016-05-01"},{"$f":"EOMONTH(ACHAT!M169,-1)+1","v":"2015-08-01"},{"$f":"EOMONTH(ACHAT!L169,-1)+1","v":"2015-12-01"}]
[null,{"$f":"EOMONTH(VENTE!A170,-1)+1","v":"2016-05-01"},{"$f":"EOMONTH(VENTE!I170,-1)+1","v":"2016-05-01"},{"$f":"EOMONTH(ACHAT!M170,-1)+1","v":"2015-08-01"},{"$f":"EOMONTH(ACHAT!L170,-1)+1","v":"2015-12-01"}]
[null,{"$f":"EOMONTH(VENTE!A171,-1)+1","v":"2016-05-01"},{"$f":"EOMONTH(VENTE!I171,-1)+1","v":"2016-05-01"},{"$f":"EOMONTH(ACHAT!M171,-1)+1","v":"2015-09-01"},{"$f":"EOMONTH(ACHAT!L171,-1)+1","v":"2015-12-01"}]
[null,{"$f":"EOMONTH(VENTE!A172,-1)+1","v":"2016-05-01"},{"$f":"EOMONTH(VENTE!I172,-1)+1","v":"2016-05-01"},{"$f":"EOMONTH(ACHAT!M172,-1)+1","v":"2015-09-01"},{"$f":"EOMONTH(ACHAT!L172,-1)+1","v":"2015-12-01"}]
[null,{"$f":"EOMONTH(VENTE!A173,-1)+1","v":"2016-05-01"},{"$f":"EOMONTH(VENTE!I173,-1)+1","v":"2016-05-01"},{"$f":"EOMONTH(ACHAT!M173,-1)+1","v":"2015-10-01"},{"$f":"EOMONTH(ACHAT!L173,-1)+1","v":"2015-12-01"}]
[null,{"$f":"EOMONTH(VENTE!A174,-1)+1","v":"2016-05-01"},{"$f":"EOMONTH(VENTE!I174,-1)+1","v":"2016-05-01"},{"$f":"EOMONTH(ACHAT!M174,-1)+1","v":"2015-10-01"},{"$f":"EOMONTH(ACHAT!L174,-1)+1","v":"2015-12-01"}]
[null,{"$f":"EOMONTH(VENTE!A175,-1)+1","v":"2016-05-01"},{"$f":"EOMONTH(VENTE!I175,-1)+1","v":"2016-05-01"},{"$f":"EOMONTH(ACHAT!M175,-1)+1","v":"2015-11-01"},{"$f":"EOMONTH(ACHAT!L175,-1)+1","v":"2015-12-01"}]
[null,{"$f":"EOMONTH(VENTE!A176,-1)+1","v":"2016-05-01"},{"$f":"EOMONTH(VENTE!I176,-1)+1","v":"2016-05-01"},{"$f":"EOMONTH(ACHAT!M176,-1)+1","v":"2015-12-01"},{"$f":"EOMONTH(ACHAT!L176,-1)+1","v":"2015-12-01"}]
[null,{"$f":"EOMONTH(VENTE!A177,-1)+1","v":"2016-05-01"},{"$f":"EOMONTH(VENTE!I177,-1)+1","v":"2016-05-01"},{"$f":"EOMONTH(ACHAT!M177,-1)+1","v":"2016-01-01"},{"$f":"EOMONTH(ACHAT!L177,-1)+1","v":"2016-01-01"}]
[null,{"$f":"EOMONTH(VENTE!A178,-1)+1","v":"2016-05-01"},{"$f":"EOMONTH(VENTE!I178,-1)+1","v":"2016-05-01"},{"$f":"EOMONTH(ACHAT!M178,-1)+1","v":"2015-12-01"},{"$f":"EOMONTH(ACHAT!L178,-1)+1","v":"2016-01-01"}]
[null,{"$f":"EOMONTH(VENTE!A179,-1)+1","v":"2016-05-01"},{"$f":"EOMONTH(VENTE!I179,-1)+1","v":"2016-05-01"},{"$f":"EOMONTH(ACHAT!M179,-1)+1","v":"2015-12-01"},{"$f":"EOMONTH(ACHAT!L179,-1)+1","v":"2016-01-01"}]
[null,{"$f":"EOMONTH(VENTE!A180,-1)+1","v":"2016-05-01"},{"$f":"EOMONTH(VENTE!I180,-1)+1","v":"2016-05-01"},{"$f":"EOMONTH(ACHAT!M180,-1)+1","v":"2015-11-01"},{"$f":"EOMONTH(ACHAT!L180,-1)+1","v":"2016-02-01"}]
[null,{"$f":"EOMONTH(VENTE!A181,-1)+1","v":"2016-05-01"},{"$f":"EOMONTH(VENTE!I181,-1)+1","v":"2016-05-01"},{"$f":"EOMONTH(ACHAT!M181,-1)+1","v":"2015-12-01"},{"$f":"EOMONTH(ACHAT!L181,-1)+1","v":"2016-02-01"}]
[null,{"$f":"EOMONTH(VENTE!A182,-1)+1","v":"2016-05-01"},{"$f":"EOMONTH(VENTE!I182,-1)+1","v":"2016-05-01"},{"$f":"EOMONTH(ACHAT!M182,-1)+1","v":"2015-12-01"},{"$f":"EOMONTH(ACHAT!L182,-1)+1","v":"2016-02-01"}]
[null,{"$f":"EOMONTH(VENTE!A183,-1)+1","v":"2016-05-01"},{"$f":"EOMONTH(VENTE!I183,-1)+1","v":"2016-05-01"},{"$f":"EOMONTH(ACHAT!M183,-1)+1","v":"2015-12-01"},{"$f":"EOMONTH(ACHAT!L183,-1)+1","v":"2016-02-01"}]
[null,{"$f":"EOMONTH(VENTE!A184,-1)+1","v":"2016-05-01"},{"$f":"EOMONTH(VENTE!I184,-1)+1","v":"2016-05-01"},{"$f":"EOMONTH(ACHAT!M184,-1)+1","v":"2015-11-01"},{"$f":"EOMONTH(ACHAT!L184,-1)+1","v":"2016-02-01"}]
[null,{"$f":"EOMONTH(VENTE!A185,-1)+1","v":"2016-05-01"},{"$f":"EOMONTH(VENTE!I185,-1)+1","v":"2016-05-01"},{"$f":"EOMONTH(ACHAT!M185,-1)+1","v":"2015-11-01"},{"$f":"EOMONTH(ACHAT!L185,-1)+1","v":"2016-02-01"}]
[null,{"$f":"EOMONTH(VENTE!A186,-1)+1","v":"2016-05-01"},{"$f":"EOMONTH(VENTE!I186,-1)+1","v":"2016-05-01"},{"$f":"EOMONTH(ACHAT!M186,-1)+1","v":"2015-12-01"},{"$f":"EOMONTH(ACHAT!L186,-1)+1","v":"2016-02-01"}]
[null,{"$f":"EOMONTH(VENTE!A187,-1)+1","v":"2016-05-01"},{"$f":"EOMONTH(VENTE!I187,-1)+1","v":"2016-05-01"},{"$f":"EOMONTH(ACHAT!M187,-1)+1","v":"2015-12-01"},{"$f":"EOMONTH(ACHAT!L187,-1)+1","v":"2016-02-01"}]
[null,{"$f":"EOMONTH(VENTE!A188,-1)+1","v":"2016-05-01"},{"$f":"EOMONTH(VENTE!I188,-1)+1","v":"2016-05-01"},{"$f":"EOMONTH(ACHAT!M188,-1)+1","v":"2016-02-01"},{"$f":"EOMONTH(ACHAT!L188,-1)+1","v":"2016-02-01"}]
[null,{"$f":"EOMONTH(VENTE!A189,-1)+1","v":"2016-05-01"},{"$f":"EOMONTH(VENTE!I189,-1)+1","v":"2016-05-01"},{"$f":"EOMONTH(ACHAT!M189,-1)+1","v":"2015-12-01"},{"$f":"EOMONTH(ACHAT!L189,-1)+1","v":"2016-03-01"}]
[null,{"$f":"EOMONTH(VENTE!A190,-1)+1","v":"2016-05-01"},{"$f":"EOMONTH(VENTE!I190,-1)+1","v":"2016-05-01"},{"$f":"EOMONTH(ACHAT!M190,-1)+1","v":"2015-12-01"},{"$f":"EOMONTH(ACHAT!L190,-1)+1","v":"2016-03-01"}]
[null,{"$f":"EOMONTH(VENTE!A191,-1)+1","v":"2016-05-01"},{"$f":"EOMONTH(VENTE!I191,-1)+1","v":"2016-05-01"},{"$f":"EOMONTH(ACHAT!M191,-1)+1","v":"2015-12-01"},{"$f":"EOMONTH(ACHAT!L191,-1)+1","v":"2016-03-01"}]
[null,{"$f":"EOMONTH(VENTE!A192,-1)+1","v":"2016-05-01"},{"$f":"EOMONTH(VENTE!I192,-1)+1","v":"2016-05-01"},{"$f":"EOMONTH(ACHAT!M192,-1)+1","v":"2016-01-01"},{"$f":"EOMONTH(ACHAT!L192,-1)+1","v":"2016-03-01"}]
[null,{"$f":"EOMONTH(VENTE!A193,-1)+1","v":"2016-03-01"},{"$f":"EOMONTH(VENTE!I193,-1)+1","v":"2016-06-01"},{"$f":"EOMONTH(ACHAT!M193,-1)+1","v":"2016-03-01"},{"$f":"EOMONTH(ACHAT!L193,-1)+1","v":"2016-04-01"}]
[null,{"$f":"EOMONTH(VENTE!A194,-1)+1","v":"2016-03-01"},{"$f":"EOMONTH(VENTE!I194,-1)+1","v":"2016-06-01"},{"$f":"EOMONTH(ACHAT!M194,-1)+1","v":"2016-04-01"},{"$f":"EOMONTH(ACHAT!L194,-1)+1","v":"2016-04-01"}]
[null,{"$f":"EOMONTH(VENTE!A195,-1)+1","v":"2016-04-01"},{"$f":"EOMONTH(VENTE!I195,-1)+1","v":"2016-07-01"},{"$f":"EOMONTH(ACHAT!M195,-1)+1","v":"2016-01-01"},{"$f":"EOMONTH(ACHAT!L195,-1)+1","v":"2016-04-01"}]
[null,{"$f":"EOMONTH(VENTE!A196,-1)+1","v":"2016-04-01"},{"$f":"EOMONTH(VENTE!I196,-1)+1","v":"2016-04-01"},{"$f":"EOMONTH(ACHAT!M196,-1)+1","v":"2016-01-01"},{"$f":"EOMONTH(ACHAT!L196,-1)+1","v":"2016-04-01"}]
[null,{"$f":"EOMONTH(VENTE!A197,-1)+1","v":"2016-05-01"},{"$f":"EOMONTH(VENTE!I197,-1)+1","v":"2016-07-01"},{"$f":"EOMONTH(ACHAT!M197,-1)+1","v":"2016-02-01"},{"$f":"EOMONTH(ACHAT!L197,-1)+1","v":"2016-05-01"}]
[null,{"$f":"EOMONTH(VENTE!A198,-1)+1","v":"2016-06-01"},{"$f":"EOMONTH(VENTE!I198,-1)+1","v":"2016-06-01"},{"$f":"EOMONTH(ACHAT!M198,-1)+1","v":"2016-02-01"},{"$f":"EOMONTH(ACHAT!L198,-1)+1","v":"2016-05-01"}]
[null,{"$f":"EOMONTH(VENTE!A199,-1)+1","v":"2016-06-01"},{"$f":"EOMONTH(VENTE!I199,-1)+1","v":"2016-06-01"},{"$f":"EOMONTH(ACHAT!M199,-1)+1","v":"2016-05-01"},{"$f":"EOMONTH(ACHAT!L199,-1)+1","v":"2016-06-01"}]
[null,{"$f":"EOMONTH(VENTE!A200,-1)+1","v":"2016-06-01"},{"$f":"EOMONTH(VENTE!I200,-1)+1","v":"2016-06-01"},{"$f":"EOMONTH(ACHAT!M200,-1)+1","v":"2016-03-01"},{"$f":"EOMONTH(ACHAT!L200,-1)+1","v":"2016-06-01"}]
[null,{"$f":"EOMONTH(VENTE!A201,-1)+1","v":"2016-06-01"},{"$f":"EOMONTH(VENTE!I201,-1)+1","v":"2016-06-01"},{"$f":"EOMONTH(ACHAT!M201,-1)+1","v":"2016-03-01"},{"$f":"EOMONTH(ACHAT!L201,-1)+1","v":"2016-06-01"}]
[null,{"$f":"EOMONTH(VENTE!A202,-1)+1","v":"2016-06-01"},{"$f":"EOMONTH(VENTE!I202,-1)+1","v":"2016-06-01"},{"$f":"EOMONTH(ACHAT!M202,-1)+1","v":"2016-03-01"},{"$f":"EOMONTH(ACHAT!L202,-1)+1","v":"2016-06-01"}]
[null,{"$f":"EOMONTH(VENTE!A203,-1)+1","v":"2016-06-01"},{"$f":"EOMONTH(VENTE!I203,-1)+1","v":"2016-06-01"},{"$f":"EOMONTH(ACHAT!M203,-1)+1","v":"2016-03-01"},{"$f":"EOMONTH(ACHAT!L203,-1)+1","v":"2016-06-01"}]
[null,{"$f":"EOMONTH(VENTE!A204,-1)+1","v":"2016-06-01"},{"$f":"EOMONTH(VENTE!I204,-1)+1","v":"2016-06-01"},{"$f":"EOMONTH(ACHAT!M204,-1)+1","v":"2016-01-01"},{"$f":"EOMONTH(ACHAT!L204,-1)+1","v":"2016-05-01"}]
[null,{"$f":"EOMONTH(VENTE!A205,-1)+1","v":"2016-06-01"},{"$f":"EOMONTH(VENTE!I205,-1)+1","v":"2016-06-01"},{"$f":"EOMONTH(ACHAT!M205,-1)+1","v":"2016-05-01"},{"$f":"EOMONTH(ACHAT!L205,-1)+1","v":"2016-05-01"}]
[null,{"$f":"EOMONTH(VENTE!A206,-1)+1","v":"2016-06-01"},{"$f":"EOMONTH(VENTE!I206,-1)+1","v":"2016-06-01"},{"$f":"EOMONTH(ACHAT!M206,-1)+1","v":"2016-05-01"},{"$f":"EOMONTH(ACHAT!L206,-1)+1","v":"2016-05-01"}]
[null,{"$f":"EOMONTH(VENTE!A207,-1)+1","v":"2016-06-01"},{"$f":"EOMONTH(VENTE!I207,-1)+1","v":"2016-06-01"},{"$f":"EOMONTH(ACHAT!M207,-1)+1","v":"2016-02-01"},{"$f":"EOMONTH(ACHAT!L207,-1)+1","v":"2016-05-01"}]
[null,{"$f":"EOMONTH(VENTE!A208,-1)+1","v":"2016-06-01"},{"$f":"EOMONTH(VENTE!I208,-1)+1","v":"2016-06-01"},{"$f":"EOMONTH(ACHAT!M208,-1)+1","v":"2016-05-01"},{"$f":"EOMONTH(ACHAT!L208,-1)+1","v":"2016-05-01"}]
[null,{"$f":"EOMONTH(VENTE!A209,-1)+1","v":"2016-06-01"},{"$f":"EOMONTH(VENTE!I209,-1)+1","v":"2016-06-01"},{"$f":"EOMONTH(ACHAT!M209,-1)+1","v":"2016-05-01"},{"$f":"EOMONTH(ACHAT!L209,-1)+1","v":"2016-05-01"}]
[null,{"$f":"EOMONTH(VENTE!A210,-1)+1","v":"2016-06-01"},{"$f":"EOMONTH(VENTE!I210,-1)+1","v":"2016-06-01"},{"$f":"EOMONTH(ACHAT!M210,-1)+1","v":"2016-02-01"},{"$f":"EOMONTH(ACHAT!L210,-1)+1","v":"2016-06-01"}]
[null,{"$f":"EOMONTH(VENTE!A211,-1)+1","v":"2016-06-01"},{"$f":"EOMONTH(VENTE!I211,-1)+1","v":"2016-06-01"},{"$f":"EOMONTH(ACHAT!M211,-1)+1","v":"2016-07-01"},{"$f":"EOMONTH(ACHAT!L211,-1)+1","v":"2016-07-01"}]
[null,{"$f":"EOMONTH(VENTE!A212,-1)+1","v":"2016-06-01"},{"$f":"EOMONTH(VENTE!I212,-1)+1","v":"2016-06-01"},{"$f":"EOMONTH(ACHAT!M212,-1)+1","v":"2016-06-01"},{"$f":"EOMONTH(ACHAT!L212,-1)+1","v":"2016-07-01"}]
[null,{"$f":"EOMONTH(VENTE!A213,-1)+1","v":"2016-06-01"},{"$f":"EOMONTH(VENTE!I213,-1)+1","v":"2016-06-01"},{"$f":"EOMONTH(ACHAT!M213,-1)+1","v":"2016-01-01"},{"$f":"EOMONTH(ACHAT!L213,-1)+1","v":"2016-07-01"}]
[null,{"$f":"EOMONTH(VENTE!A214,-1)+1","v":"2016-06-01"},{"$f":"EOMONTH(VENTE!I214,-1)+1","v":"2016-06-01"},{"$f":"EOMONTH(ACHAT!M214,-1)+1","v":"2016-02-01"},{"$f":"EOMONTH(ACHAT!L214,-1)+1","v":"2016-07-01"}]
[null,{"$f":"EOMONTH(VENTE!A215,-1)+1","v":"2016-06-01"},{"$f":"EOMONTH(VENTE!I215,-1)+1","v":"2016-06-01"},{"$f":"EOMONTH(ACHAT!M215,-1)+1","v":"2016-04-01"},{"$f":"EOMONTH(ACHAT!L215,-1)+1","v":"2016-07-01"}]
[null,{"$f":"EOMONTH(VENTE!A216,-1)+1","v":"2016-06-01"},{"$f":"EOMONTH(VENTE!I216,-1)+1","v":"2016-07-01"},{"$f":"EOMONTH(ACHAT!M216,-1)+1","v":"2016-04-01"},{"$f":"EOMONTH(ACHAT!L216,-1)+1","v":"2016-07-01"}]
[null,{"$f":"EOMONTH(VENTE!A217,-1)+1","v":"2016-06-01"},{"$f":"EOMONTH(VENTE!I217,-1)+1","v":"2016-06-01"},{"$f":"EOMONTH(ACHAT!M217,-1)+1","v":"2016-03-01"},{"$f":"EOMONTH(ACHAT!L217,-1)+1","v":"2016-08-01"}]
[null,{"$f":"EOMONTH(VENTE!A218,-1)+1","v":"2016-06-01"},{"$f":"EOMONTH(VENTE!I218,-1)+1","v":"2016-06-01"},{"$f":"EOMONTH(ACHAT!M218,-1)+1","v":"2016-03-01"},{"$f":"EOMONTH(ACHAT!L218,-1)+1","v":"2016-08-01"}]
[null,{"$f":"EOMONTH(VENTE!A219,-1)+1","v":"2016-01-01"},{"$f":"EOMONTH(VENTE!I219,-1)+1","v":"2016-07-01"},{"$f":"EOMONTH(ACHAT!M219,-1)+1","v":"2016-07-01"},{"$f":"EOMONTH(ACHAT!L219,-1)+1","v":"2016-08-01"}]
[null,{"$f":"EOMONTH(VENTE!A220,-1)+1","v":"2016-01-01"},{"$f":"EOMONTH(VENTE!I220,-1)+1","v":"2016-07-01"},{"$f":"EOMONTH(ACHAT!M220,-1)+1","v":"2016-08-01"},{"$f":"EOMONTH(ACHAT!L220,-1)+1","v":"2016-08-01"}]
[null,{"$f":"EOMONTH(VENTE!A221,-1)+1","v":"2016-01-01"},{"$f":"EOMONTH(VENTE!I221,-1)+1","v":"2016-07-01"},{"$f":"EOMONTH(ACHAT!M221,-1)+1","v":"2016-05-01"},{"$f":"EOMONTH(ACHAT!L221,-1)+1","v":"2016-08-01"}]
[null,{"$f":"EOMONTH(VENTE!A222,-1)+1","v":"2016-02-01"},{"$f":"EOMONTH(VENTE!I222,-1)+1","v":"2016-07-01"},{"$f":"EOMONTH(ACHAT!M222,-1)+1","v":"2016-05-01"},{"$f":"EOMONTH(ACHAT!L222,-1)+1","v":"2016-08-01"}]
[null,{"$f":"EOMONTH(VENTE!A223,-1)+1","v":"2016-02-01"},{"$f":"EOMONTH(VENTE!I223,-1)+1","v":"2016-07-01"},{"$f":"EOMONTH(ACHAT!M223,-1)+1","v":"2016-05-01"},{"$f":"EOMONTH(ACHAT!L223,-1)+1","v":"2016-08-01"}]
[null,{"$f":"EOMONTH(VENTE!A224,-1)+1","v":"2016-02-01"},{"$f":"EOMONTH(VENTE!I224,-1)+1","v":"2016-07-01"},{"$f":"EOMONTH(ACHAT!M224,-1)+1","v":"2016-05-01"},{"$f":"EOMONTH(ACHAT!L224,-1)+1","v":"2016-08-01"}]
[null,{"$f":"EOMONTH(VENTE!A225,-1)+1","v":"2016-04-01"},{"$f":"EOMONTH(VENTE!I225,-1)+1","v":"2016-07-01"},{"$f":"EOMONTH(ACHAT!M225,-1)+1","v":"2016-04-01"},{"$f":"EOMONTH(ACHAT!L225,-1)+1","v":"2016-07-01"}]
[null,{"$f":"EOMONTH(VENTE!A226,-1)+1","v":"2016-04-01"},{"$f":"EOMONTH(VENTE!I226,-1)+1","v":"2016-07-01"},{"$f":"EOMONTH(ACHAT!M226,-1)+1","v":"2016-01-01"},{"$f":"EOMONTH(ACHAT!L226,-1)+1","v":"2016-07-01"}]
[null,{"$f":"EOMONTH(VENTE!A227,-1)+1","v":"2016-04-01"},{"$f":"EOMONTH(VENTE!I227,-1)+1","v":"2016-07-01"},{"$f":"EOMONTH(ACHAT!M227,-1)+1","v":"2016-08-01"},{"$f":"EOMONTH(ACHAT!L227,-1)+1","v":"2016-08-01"}]
[null,{"$f":"EOMONTH(VENTE!A228,-1)+1","v":"2016-05-01"},{"$f":"EOMONTH(VENTE!I228,-1)+1","v":"2016-07-01"},{"$f":"EOMONTH(ACHAT!M228,-1)+1","v":"2016-09-01"},{"$f":"EOMONTH(ACHAT!L228,-1)+1","v":"2016-09-01"}]
[null,{"$f":"EOMONTH(VENTE!A229,-1)+1","v":"2016-06-01"},{"$f":"EOMONTH(VENTE!I229,-1)+1","v":"2016-06-01"},{"$f":"EOMONTH(ACHAT!M229,-1)+1","v":"2016-06-01"},{"$f":"EOMONTH(ACHAT!L229,-1)+1","v":"2016-09-01"}]
[null,{"$f":"EOMONTH(VENTE!A230,-1)+1","v":"2016-07-01"},{"$f":"EOMONTH(VENTE!I230,-1)+1","v":"2016-07-01"},{"$f":"EOMONTH(ACHAT!M230,-1)+1","v":"2016-06-01"},{"$f":"EOMONTH(ACHAT!L230,-1)+1","v":"2016-09-01"}]
[null,{"$f":"EOMONTH(VENTE!A231,-1)+1","v":"2016-07-01"},{"$f":"EOMONTH(VENTE!I231,-1)+1","v":"2016-07-01"},{"$f":"EOMONTH(ACHAT!M231,-1)+1","v":"2016-06-01"},{"$f":"EOMONTH(ACHAT!L231,-1)+1","v":"2016-06-01"}]
[null,{"$f":"EOMONTH(VENTE!A232,-1)+1","v":"2016-07-01"},{"$f":"EOMONTH(VENTE!I232,-1)+1","v":"2016-07-01"},{"$f":"EOMONTH(ACHAT!M232,-1)+1","v":"2016-06-01"},{"$f":"EOMONTH(ACHAT!L232,-1)+1","v":"2016-06-01"}]
[null,{"$f":"EOMONTH(VENTE!A233,-1)+1","v":"2016-07-01"},{"$f":"EOMONTH(VENTE!I233,-1)+1","v":"2016-07-01"},{"$f":"EOMONTH(ACHAT!M233,-1)+1","v":"2016-06-01"},{"$f":"EOMONTH(ACHAT!L233,-1)+1","v":"2016-07-01"}]
[null,{"$f":"EOMONTH(VENTE!A234,-1)+1","v":"2016-07-01"},{"$f":"EOMONTH(VENTE!I234,-1)+1","v":"2016-07-01"},{"$f":"EOMONTH(ACHAT!M234,-1)+1","v":"2016-09-01"},{"$f":"EOMONTH(ACHAT!L234,-1)+1","v":"2016-08-01"}]
[null,{"$f":"EOMONTH(VENTE!A235,-1)+1","v":"2016-07-01"},{"$f":"EOMONTH(VENTE!I235,-1)+1","v":"2016-07-01"},{"$f":"EOMONTH(ACHAT!M235,-1)+1","v":"2016-10-01"},{"$f":"EOMONTH(ACHAT!L235,-1)+1","v":"2016-10-01"}]
[null,{"$f":"EOMONTH(VENTE!A236,-1)+1","v":"2016-07-01"},{"$f":"EOMONTH(VENTE!I236,-1)+1","v":"2016-07-01"},{"$f":"EOMONTH(ACHAT!M236,-1)+1","v":"2016-07-01"},{"$f":"EOMONTH(ACHAT!L236,-1)+1","v":"2016-10-01"}]
[null,{"$f":"EOMONTH(VENTE!A237,-1)+1","v":"2016-07-01"},{"$f":"EOMONTH(VENTE!I237,-1)+1","v":"2016-07-01"},{"$f":"EOMONTH(ACHAT!M237,-1)+1","v":"2016-05-01"},{"$f":"EOMONTH(ACHAT!L237,-1)+1","v":"2016-05-01"}]
[null,{"$f":"EOMONTH(VENTE!A238,-1)+1","v":"2016-07-01"},{"$f":"EOMONTH(VENTE!I238,-1)+1","v":"2016-07-01"},{"$f":"EOMONTH(ACHAT!M238,-1)+1","v":"2016-07-01"},{"$f":"EOMONTH(ACHAT!L238,-1)+1","v":"2016-07-01"}]
[null,{"$f":"EOMONTH(VENTE!A239,-1)+1","v":"2016-03-01"},{"$f":"EOMONTH(VENTE!I239,-1)+1","v":"2016-08-01"},{"$f":"EOMONTH(ACHAT!M239,-1)+1","v":"2016-08-01"},{"$f":"EOMONTH(ACHAT!L239,-1)+1","v":"2016-08-01"}]
[null,{"$f":"EOMONTH(VENTE!A240,-1)+1","v":"2016-03-01"},{"$f":"EOMONTH(VENTE!I240,-1)+1","v":"2016-08-01"},{"$f":"EOMONTH(ACHAT!M240,-1)+1","v":"2016-08-01"},{"$f":"EOMONTH(ACHAT!L240,-1)+1","v":"2016-08-01"}]
[null,{"$f":"EOMONTH(VENTE!A241,-1)+1","v":"2016-04-01"},{"$f":"EOMONTH(VENTE!I241,-1)+1","v":"2016-08-01"},{"$f":"EOMONTH(ACHAT!M241,-1)+1","v":"2016-09-01"},{"$f":"EOMONTH(ACHAT!L241,-1)+1","v":"2016-10-01"}]
[null,{"$f":"EOMONTH(VENTE!A242,-1)+1","v":"2016-04-01"},{"$f":"EOMONTH(VENTE!I242,-1)+1","v":"2016-08-01"},{"$f":"EOMONTH(ACHAT!M242,-1)+1","v":"2016-07-01"},{"$f":"EOMONTH(ACHAT!L242,-1)+1","v":"2016-10-01"}]
[null,{"$f":"EOMONTH(VENTE!A243,-1)+1","v":"2016-05-01"},{"$f":"EOMONTH(VENTE!I243,-1)+1","v":"2016-08-01"},{"$f":"EOMONTH(ACHAT!M243,-1)+1","v":"2016-08-01"},{"$f":"EOMONTH(ACHAT!L243,-1)+1","v":"2016-11-01"}]
[null,{"$f":"EOMONTH(VENTE!A244,-1)+1","v":"2016-05-01"},{"$f":"EOMONTH(VENTE!I244,-1)+1","v":"2016-08-01"},{"$f":"EOMONTH(ACHAT!M244,-1)+1","v":"2016-09-01"},{"$f":"EOMONTH(ACHAT!L244,-1)+1","v":"2016-11-01"}]
[null,{"$f":"EOMONTH(VENTE!A245,-1)+1","v":"2016-08-01"},{"$f":"EOMONTH(VENTE!I245,-1)+1","v":"2016-08-01"},{"$f":"EOMONTH(ACHAT!M245,-1)+1","v":"2016-08-01"},{"$f":"EOMONTH(ACHAT!L245,-1)+1","v":"2016-11-01"}]
[null,{"$f":"EOMONTH(VENTE!A246,-1)+1","v":"2016-08-01"},{"$f":"EOMONTH(VENTE!I246,-1)+1","v":"2016-08-01"},{"$f":"EOMONTH(ACHAT!M246,-1)+1","v":"2016-08-01"},{"$f":"EOMONTH(ACHAT!L246,-1)+1","v":"2016-11-01"}]
[null,{"$f":"EOMONTH(VENTE!A247,-1)+1","v":"2016-08-01"},{"$f":"EOMONTH(VENTE!I247,-1)+1","v":"2016-08-01"},{"$f":"EOMONTH(ACHAT!M247,-1)+1","v":"2016-05-01"},{"$f":"EOMONTH(ACHAT!L247,-1)+1","v":"2016-05-01"}]
[null,{"$f":"EOMONTH(VENTE!A248,-1)+1","v":"2016-08-01"},{"$f":"EOMONTH(VENTE!I248,-1)+1","v":"2016-08-01"},{"$f":"EOMONTH(ACHAT!M248,-1)+1","v":"2016-09-01"},{"$f":"EOMONTH(ACHAT!L248,-1)+1","v":"2016-10-01"}]
[null,{"$f":"EOMONTH(VENTE!A249,-1)+1","v":"2016-08-01"},{"$f":"EOMONTH(VENTE!I249,-1)+1","v":"2016-08-01"},{"$f":"EOMONTH(ACHAT!M249,-1)+1","v":"2016-11-01"},{"$f":"EOMONTH(ACHAT!L249,-1)+1","v":"2016-10-01"}]
[null,{"$f":"EOMONTH(VENTE!A250,-1)+1","v":"2016-08-01"},{"$f":"EOMONTH(VENTE!I250,-1)+1","v":"2016-08-01"},{"$f":"EOMONTH(ACHAT!M250,-1)+1","v":"2016-11-01"},{"$f":"EOMONTH(ACHAT!L250,-1)+1","v":"2016-11-01"}]
[null,{"$f":"EOMONTH(VENTE!A251,-1)+1","v":"2016-08-01"},{"$f":"EOMONTH(VENTE!I251,-1)+1","v":"2016-08-01"},{"$f":"EOMONTH(ACHAT!M251,-1)+1","v":"2016-12-01"},{"$f":"EOMONTH(ACHAT!L251,-1)+1","v":"2016-11-01"}]
[null,{"$f":"EOMONTH(VENTE!A252,-1)+1","v":"2016-08-01"},{"$f":"EOMONTH(VENTE!I252,-1)+1","v":"2016-08-01"},{"$f":"EOMONTH(ACHAT!M252,-1)+1","v":"2016-12-01"},{"$f":"EOMONTH(ACHAT!L252,-1)+1","v":"2016-11-01"}]
[null,{"$f":"EOMONTH(VENTE!A253,-1)+1","v":"2016-08-01"},{"$f":"EOMONTH(VENTE!I253,-1)+1","v":"2016-08-01"},{"$f":"EOMONTH(ACHAT!M253,-1)+1","v":"2016-07-01"},{"$f":"EOMONTH(ACHAT!L253,-1)+1","v":"2016-12-01"}]
[null,{"$f":"EOMONTH(VENTE!A254,-1)+1","v":"2016-08-01"},{"$f":"EOMONTH(VENTE!I254,-1)+1","v":"2016-08-01"},{"$f":"EOMONTH(ACHAT!M254,-1)+1","v":"2016-09-01"},{"$f":"EOMONTH(ACHAT!L254,-1)+1","v":"2016-12-01"}]
[null,{"$f":"EOMONTH(VENTE!A255,-1)+1","v":"2016-08-01"},{"$f":"EOMONTH(VENTE!I255,-1)+1","v":"2016-08-01"},{"$f":"EOMONTH(ACHAT!M255,-1)+1","v":"2016-08-01"},{"$f":"EOMONTH(ACHAT!L255,-1)+1","v":"2016-12-01"}]
[null,{"$f":"EOMONTH(VENTE!A256,-1)+1","v":"2016-08-01"},{"$f":"EOMONTH(VENTE!I256,-1)+1","v":"2016-08-01"},{"$f":"EOMONTH(ACHAT!M256,-1)+1","v":"2016-12-01"},{"$f":"EOMONTH(ACHAT!L256,-1)+1","v":"2016-12-01"}]
[null,{"$f":"EOMONTH(VENTE!A257,-1)+1","v":"2016-08-01"},{"$f":"EOMONTH(VENTE!I257,-1)+1","v":"2016-08-01"},{"$f":"EOMONTH(ACHAT!M257,-1)+1","v":"2016-11-01"},{"$f":"EOMONTH(ACHAT!L257,-1)+1","v":"2016-12-01"}]
[null,{"$f":"EOMONTH(VENTE!A258,-1)+1","v":"2016-08-01"},{"$f":"EOMONTH(VENTE!I258,-1)+1","v":"2016-08-01"},{"$f":"EOMONTH(ACHAT!M258,-1)+1","v":"2016-10-01"},{"$f":"EOMONTH(ACHAT!L258,-1)+1","v":"2016-11-01"}]
[null,{"$f":"EOMONTH(VENTE!A259,-1)+1","v":"2016-08-01"},{"$f":"EOMONTH(VENTE!I259,-1)+1","v":"2016-08-01"},{"$f":"EOMONTH(ACHAT!M259,-1)+1","v":"2017-01-01"},{"$f":"EOMONTH(ACHAT!L259,-1)+1","v":"2017-01-01"}]
[null,{"$f":"EOMONTH(VENTE!A260,-1)+1","v":"2016-08-01"},{"$f":"EOMONTH(VENTE!I260,-1)+1","v":"2016-08-01"},{"$f":"EOMONTH(ACHAT!M260,-1)+1","v":"2016-08-01"},{"$f":"EOMONTH(ACHAT!L260,-1)+1","v":"2017-01-01"}]
[null,{"$f":"EOMONTH(VENTE!A261,-1)+1","v":"2016-08-01"},{"$f":"EOMONTH(VENTE!I261,-1)+1","v":"2016-08-01"},{"$f":"EOMONTH(ACHAT!M261,-1)+1","v":"2016-08-01"},{"$f":"EOMONTH(ACHAT!L261,-1)+1","v":"2017-01-01"}]
[null,{"$f":"EOMONTH(VENTE!A262,-1)+1","v":"2016-08-01"},{"$f":"EOMONTH(VENTE!I262,-1)+1","v":"2016-08-01"},{"$f":"EOMONTH(ACHAT!M262,-1)+1","v":"2016-10-01"},{"$f":"EOMONTH(ACHAT!L262,-1)+1","v":"2017-01-01"}]
[null,{"$f":"EOMONTH(VENTE!A263,-1)+1","v":"2016-05-01"},{"$f":"EOMONTH(VENTE!I263,-1)+1","v":"2016-05-01"},{"$f":"EOMONTH(ACHAT!M263,-1)+1","v":"2017-01-01"},{"$f":"EOMONTH(ACHAT!L263,-1)+1","v":"2017-01-01"}]
[null,{"$f":"EOMONTH(VENTE!A264,-1)+1","v":"2016-05-01"},{"$f":"EOMONTH(VENTE!I264,-1)+1","v":"2016-05-01"},{"$f":"EOMONTH(ACHAT!M264,-1)+1","v":"2016-10-01"},{"$f":"EOMONTH(ACHAT!L264,-1)+1","v":"2016-10-01"}]
[null,{"$f":"EOMONTH(VENTE!A265,-1)+1","v":"2016-09-01"},{"$f":"EOMONTH(VENTE!I265,-1)+1","v":"2016-09-01"},{"$f":"EOMONTH(ACHAT!M265,-1)+1","v":"2017-02-01"},{"$f":"EOMONTH(ACHAT!L265,-1)+1","v":"2017-01-01"}]
[null,{"$f":"EOMONTH(VENTE!A266,-1)+1","v":"2016-09-01"},{"$f":"EOMONTH(VENTE!I266,-1)+1","v":"2016-09-01"},{"$f":"EOMONTH(ACHAT!M266,-1)+1","v":"2017-01-01"},{"$f":"EOMONTH(ACHAT!L266,-1)+1","v":"2017-02-01"}]
[null,{"$f":"EOMONTH(VENTE!A267,-1)+1","v":"2016-09-01"},{"$f":"EOMONTH(VENTE!I267,-1)+1","v":"2016-09-01"},{"$f":"EOMONTH(ACHAT!M267,-1)+1","v":"2016-10-01"},{"$f":"EOMONTH(ACHAT!L267,-1)+1","v":"2017-02-01"}]
[null,{"$f":"EOMONTH(VENTE!A268,-1)+1","v":"2016-09-01"},{"$f":"EOMONTH(VENTE!I268,-1)+1","v":"2016-09-01"},{"$f":"EOMONTH(ACHAT!M268,-1)+1","v":"2016-10-01"},{"$f":"EOMONTH(ACHAT!L268,-1)+1","v":"2017-02-01"}]
[null,{"$f":"EOMONTH(VENTE!A269,-1)+1","v":"2016-09-01"},{"$f":"EOMONTH(VENTE!I269,-1)+1","v":"2016-09-01"},{"$f":"EOMONTH(ACHAT!M269,-1)+1","v":"2016-10-01"},{"$f":"EOMONTH(ACHAT!L269,-1)+1","v":"2017-02-01"}]
[null,{"$f":"EOMONTH(VENTE!A270,-1)+1","v":"2016-09-01"},{"$f":"EOMONTH(VENTE!I270,-1)+1","v":"2016-09-01"},{"$f":"EOMONTH(ACHAT!M270,-1)+1","v":"2016-10-01"},{"$f":"EOMONTH(ACHAT!L270,-1)+1","v":"2017-02-01"}]
[null,{"$f":"EOMONTH(VENTE!A271,-1)+1","v":"2016-09-01"},{"$f":"EOMONTH(VENTE!I271,-1)+1","v":"2016-09-01"},{"$f":"EOMONTH(ACHAT!M271,-1)+1","v":"2017-02-01"},{"$f":"EOMONTH(ACHAT!L271,-1)+1","v":"2017-02-01"}]
[null,{"$f":"EOMONTH(VENTE!A272,-1)+1","v":"2016-09-01"},{"$f":"EOMONTH(VENTE!I272,-1)+1","v":"2016-09-01"},{"$f":"EOMONTH(ACHAT!M272,-1)+1","v":"2016-11-01"},{"$f":"EOMONTH(ACHAT!L272,-1)+1","v":"2017-02-01"}]
[null,{"$f":"EOMONTH(VENTE!A273,-1)+1","v":"2016-09-01"},{"$f":"EOMONTH(VENTE!I273,-1)+1","v":"2016-09-01"},{"$f":"EOMONTH(ACHAT!M273,-1)+1","v":"2016-11-01"},{"$f":"EOMONTH(ACHAT!L273,-1)+1","v":"2017-02-01"}]
[null,{"$f":"EOMONTH(VENTE!A274,-1)+1","v":"2016-09-01"},{"$f":"EOMONTH(VENTE!I274,-1)+1","v":"2016-09-01"},{"$f":"EOMONTH(ACHAT!M274,-1)+1","v":"2016-12-01"},{"$f":"EOMONTH(ACHAT!L274,-1)+1","v":"2017-03-01"}]
[null,{"$f":"EOMONTH(VENTE!A275,-1)+1","v":"2016-05-01"},{"$f":"EOMONTH(VENTE!I275,-1)+1","v":"2016-10-01"},{"$f":"EOMONTH(ACHAT!M275,-1)+1","v":"2017-01-01"},{"$f":"EOMONTH(ACHAT!L275,-1)+1","v":"2017-03-01"}]
[null,{"$f":"EOMONTH(VENTE!A276,-1)+1","v":"2016-06-01"},{"$f":"EOMONTH(VENTE!I276,-1)+1","v":"2016-10-01"},{"$f":"EOMONTH(ACHAT!M276,-1)+1","v":"2016-12-01"},{"$f":"EOMONTH(ACHAT!L276,-1)+1","v":"2017-03-01"}]
[null,{"$f":"EOMONTH(VENTE!A277,-1)+1","v":"2016-06-01"},{"$f":"EOMONTH(VENTE!I277,-1)+1","v":"2016-10-01"},{"$f":"EOMONTH(ACHAT!M277,-1)+1","v":"2016-12-01"},{"$f":"EOMONTH(ACHAT!L277,-1)+1","v":"2017-03-01"}]
[null,{"$f":"EOMONTH(VENTE!A278,-1)+1","v":"2016-10-01"},{"$f":"EOMONTH(VENTE!I278,-1)+1","v":"2016-10-01"},{"$f":"EOMONTH(ACHAT!M278,-1)+1","v":"2016-12-01"},{"$f":"EOMONTH(ACHAT!L278,-1)+1","v":"2017-03-01"}]
[null,{"$f":"EOMONTH(VENTE!A279,-1)+1","v":"2016-10-01"},{"$f":"EOMONTH(VENTE!I279,-1)+1","v":"2016-10-01"},{"$f":"EOMONTH(ACHAT!M279,-1)+1","v":"2016-01-01"},{"$f":"EOMONTH(ACHAT!L279,-1)+1","v":"2016-01-01"}]
[null,{"$f":"EOMONTH(VENTE!A280,-1)+1","v":"2016-10-01"},{"$f":"EOMONTH(VENTE!I280,-1)+1","v":"2016-10-01"},{"$f":"EOMONTH(ACHAT!M280,-1)+1","v":"2015-10-01"},{"$f":"EOMONTH(ACHAT!L280,-1)+1","v":"2016-02-01"}]
[null,{"$f":"EOMONTH(VENTE!A281,-1)+1","v":"2016-10-01"},{"$f":"EOMONTH(VENTE!I281,-1)+1","v":"2016-10-01"},{"$f":"EOMONTH(ACHAT!M281,-1)+1","v":"2016-01-01"},{"$f":"EOMONTH(ACHAT!L281,-1)+1","v":"2016-02-01"}]
[null,{"$f":"EOMONTH(VENTE!A282,-1)+1","v":"2016-10-01"},{"$f":"EOMONTH(VENTE!I282,-1)+1","v":"2016-10-01"},{"$f":"EOMONTH(ACHAT!M282,-1)+1","v":"2016-02-01"},{"$f":"EOMONTH(ACHAT!L282,-1)+1","v":"2016-02-01"}]
[null,{"$f":"EOMONTH(VENTE!A283,-1)+1","v":"2016-10-01"},{"$f":"EOMONTH(VENTE!I283,-1)+1","v":"2016-10-01"},{"$f":"EOMONTH(ACHAT!M283,-1)+1","v":"2016-03-01"},{"$f":"EOMONTH(ACHAT!L283,-1)+1","v":"2016-03-01"}]
[null,{"$f":"EOMONTH(VENTE!A284,-1)+1","v":"2016-10-01"},{"$f":"EOMONTH(VENTE!I284,-1)+1","v":"2016-10-01"},{"$f":"EOMONTH(ACHAT!M284,-1)+1","v":"2016-02-01"},{"$f":"EOMONTH(ACHAT!L284,-1)+1","v":"2016-03-01"}]
[null,{"$f":"EOMONTH(VENTE!A285,-1)+1","v":"2016-10-01"},{"$f":"EOMONTH(VENTE!I285,-1)+1","v":"2016-10-01"},{"$f":"EOMONTH(ACHAT!M285,-1)+1","v":"2016-03-01"},{"$f":"EOMONTH(ACHAT!L285,-1)+1","v":"2016-03-01"}]
[null,{"$f":"EOMONTH(VENTE!A286,-1)+1","v":"2016-10-01"},{"$f":"EOMONTH(VENTE!I286,-1)+1","v":"2016-10-01"},{"$f":"EOMONTH(ACHAT!M286,-1)+1","v":"2016-01-01"},{"$f":"EOMONTH(ACHAT!L286,-1)+1","v":"2016-04-01"}]
[null,{"$f":"EOMONTH(VENTE!A287,-1)+1","v":"2016-10-01"},{"$f":"EOMONTH(VENTE!I287,-1)+1","v":"2016-10-01"},{"$f":"EOMONTH(ACHAT!M287,-1)+1","v":"2016-01-01"},{"$f":"EOMONTH(ACHAT!L287,-1)+1","v":"2016-04-01"}]
[null,{"$f":"EOMONTH(VENTE!A288,-1)+1","v":"2016-10-01"},{"$f":"EOMONTH(VENTE!I288,-1)+1","v":"2016-10-01"},{"$f":"EOMONTH(ACHAT!M288,-1)+1","v":"2016-02-01"},{"$f":"EOMONTH(ACHAT!L288,-1)+1","v":"2016-04-01"}]
[null,{"$f":"EOMONTH(VENTE!A289,-1)+1","v":"2016-10-01"},{"$f":"EOMONTH(VENTE!I289,-1)+1","v":"2016-10-01"},{"$f":"EOMONTH(ACHAT!M289,-1)+1","v":"2016-02-01"},{"$f":"EOMONTH(ACHAT!L289,-1)+1","v":"2016-04-01"}]
[null,{"$f":"EOMONTH(VENTE!A290,-1)+1","v":"2016-10-01"},{"$f":"EOMONTH(VENTE!I290,-1)+1","v":"2016-10-01"},{"$f":"EOMONTH(ACHAT!M290,-1)+1","v":"2016-03-01"},{"$f":"EOMONTH(ACHAT!L290,-1)+1","v":"2016-04-01"}]
[null,{"$f":"EOMONTH(VENTE!A291,-1)+1","v":"2016-10-01"},{"$f":"EOMONTH(VENTE!I291,-1)+1","v":"2016-10-01"},{"$f":"EOMONTH(ACHAT!M291,-1)+1","v":"2016-05-01"},{"$f":"EOMONTH(ACHAT!L291,-1)+1","v":"2016-05-01"}]
[null,{"$f":"EOMONTH(VENTE!A292,-1)+1","v":"2016-10-01"},{"$f":"EOMONTH(VENTE!I292,-1)+1","v":"2016-10-01"},{"$f":"EOMONTH(ACHAT!M292,-1)+1","v":"2016-04-01"},{"$f":"EOMONTH(ACHAT!L292,-1)+1","v":"2016-05-01"}]
[null,{"$f":"EOMONTH(VENTE!A293,-1)+1","v":"2016-10-01"},{"$f":"EOMONTH(VENTE!I293,-1)+1","v":"2016-10-01"},{"$f":"EOMONTH(ACHAT!M293,-1)+1","v":"2016-03-01"},{"$f":"EOMONTH(ACHAT!L293,-1)+1","v":"2016-06-01"}]
[null,{"$f":"EOMONTH(VENTE!A294,-1)+1","v":"2016-10-01"},{"$f":"EOMONTH(VENTE!I294,-1)+1","v":"2016-10-01"},{"$f":"EOMONTH(ACHAT!M294,-1)+1","v":"2016-03-01"},{"$f":"EOMONTH(ACHAT!L294,-1)+1","v":"2016-06-01"}]
[null,{"$f":"EOMONTH(VENTE!A295,-1)+1","v":"2016-10-01"},{"$f":"EOMONTH(VENTE!I295,-1)+1","v":"2016-10-01"},{"$f":"EOMONTH(ACHAT!M295,-1)+1","v":"2016-04-01"},{"$f":"EOMONTH(ACHAT!L295,-1)+1","v":"2016-06-01"}]
[null,{"$f":"EOMONTH(VENTE!A296,-1)+1","v":"2016-10-01"},{"$f":"EOMONTH(VENTE!I296,-1)+1","v":"2016-10-01"},{"$f":"EOMONTH(ACHAT!M296,-1)+1","v":"2016-04-01"},{"$f":"EOMONTH(ACHAT!L296,-1)+1","v":"2016-06-01"}]
[null,{"$f":"EOMONTH(VENTE!A297,-1)+1","v":"2016-10-01"},{"$f":"EOMONTH(VENTE!I297,-1)+1","v":"2016-10-01"},{"$f":"EOMONTH(ACHAT!M297,-1)+1","v":"2016-06-01"},{"$f":"EOMONTH(ACHAT!L297,-1)+1","v":"2016-06-01"}]
[null,{"$f":"EOMONTH(VENTE!A298,-1)+1","v":"2016-08-01"},{"$f":"EOMONTH(VENTE!I298,-1)+1","v":"2016-11-01"},{"$f":"EOMONTH(ACHAT!M298,-1)+1","v":"2016-07-01"},{"$f":"EOMONTH(ACHAT!L298,-1)+1","v":"2016-06-01"}]
[null,{"$f":"EOMONTH(VENTE!A299,-1)+1","v":"2016-11-01"},{"$f":"EOMONTH(VENTE!I299,-1)+1","v":"2016-11-01"},{"$f":"EOMONTH(ACHAT!M299,-1)+1","v":"2016-03-01"},{"$f":"EOMONTH(ACHAT!L299,-1)+1","v":"2016-07-01"}]
[null,{"$f":"EOMONTH(VENTE!A300,-1)+1","v":"2016-11-01"},{"$f":"EOMONTH(VENTE!I300,-1)+1","v":"2016-01-01"},{"$f":"EOMONTH(ACHAT!M300,-1)+1","v":"2016-04-01"},{"$f":"EOMONTH(ACHAT!L300,-1)+1","v":"2016-07-01"}]
[null,{"$f":"EOMONTH(VENTE!A301,-1)+1","v":"2016-11-01"},{"$f":"EOMONTH(VENTE!I301,-1)+1","v":"2016-11-01"},{"$f":"EOMONTH(ACHAT!M301,-1)+1","v":"2016-05-01"},{"$f":"EOMONTH(ACHAT!L301,-1)+1","v":"2016-07-01"}]
[null,{"$f":"EOMONTH(VENTE!A302,-1)+1","v":"2016-11-01"},{"$f":"EOMONTH(VENTE!I302,-1)+1","v":"2016-11-01"},{"$f":"EOMONTH(ACHAT!M302,-1)+1","v":"2016-06-01"},{"$f":"EOMONTH(ACHAT!L302,-1)+1","v":"2016-07-01"}]
[null,{"$f":"EOMONTH(VENTE!A303,-1)+1","v":"2016-11-01"},{"$f":"EOMONTH(VENTE!I303,-1)+1","v":"2016-11-01"},{"$f":"EOMONTH(ACHAT!M303,-1)+1","v":"2016-07-01"},{"$f":"EOMONTH(ACHAT!L303,-1)+1","v":"2016-07-01"}]
[null,{"$f":"EOMONTH(VENTE!A304,-1)+1","v":"2016-11-01"},{"$f":"EOMONTH(VENTE!I304,-1)+1","v":"2016-11-01"},{"$f":"EOMONTH(ACHAT!M304,-1)+1","v":"2016-05-01"},{"$f":"EOMONTH(ACHAT!L304,-1)+1","v":"2016-08-01"}]
[null,{"$f":"EOMONTH(VENTE!A305,-1)+1","v":"2016-11-01"},{"$f":"EOMONTH(VENTE!I305,-1)+1","v":"2016-11-01"},{"$f":"EOMONTH(ACHAT!M305,-1)+1","v":"2016-05-01"},{"$f":"EOMONTH(ACHAT!L305,-1)+1","v":"2016-08-01"}]
[null,{"$f":"EOMONTH(VENTE!A306,-1)+1","v":"2016-11-01"},{"$f":"EOMONTH(VENTE!I306,-1)+1","v":"2016-11-01"},{"$f":"EOMONTH(ACHAT!M306,-1)+1","v":"2016-06-01"},{"$f":"EOMONTH(ACHAT!L306,-1)+1","v":"2016-08-01"}]
[null,{"$f":"EOMONTH(VENTE!A307,-1)+1","v":"2016-11-01"},{"$f":"EOMONTH(VENTE!I307,-1)+1","v":"2016-11-01"},{"$f":"EOMONTH(ACHAT!M307,-1)+1","v":"2016-06-01"},{"$f":"EOMONTH(ACHAT!L307,-1)+1","v":"2016-08-01"}]
[null,{"$f":"EOMONTH(VENTE!A308,-1)+1","v":"2016-11-01"},{"$f":"EOMONTH(VENTE!I308,-1)+1","v":"2016-11-01"},{"$f":"EOMONTH(ACHAT!M308,-1)+1","v":"2016-07-01"},{"$f":"EOMONTH(ACHAT!L308,-1)+1","v":"2016-10-01"}]
[null,{"$f":"EOMONTH(VENTE!A309,-1)+1","v":"2016-11-01"},{"$f":"EOMONTH(VENTE!I309,-1)+1","v":"2016-11-01"},{"$f":"EOMONTH(ACHAT!M309,-1)+1","v":"2016-07-01"},{"$f":"EOMONTH(ACHAT!L309,-1)+1","v":"2016-10-01"}]
[null,{"$f":"EOMONTH(VENTE!A310,-1)+1","v":"2016-11-01"},{"$f":"EOMONTH(VENTE!I310,-1)+1","v":"2016-11-01"},{"$f":"EOMONTH(ACHAT!M310,-1)+1","v":"2016-08-01"},{"$f":"EOMONTH(ACHAT!L310,-1)+1","v":"2016-10-01"}]
[null,{"$f":"EOMONTH(VENTE!A311,-1)+1","v":"2016-11-01"},{"$f":"EOMONTH(VENTE!I311,-1)+1","v":"2016-11-01"},{"$f":"EOMONTH(ACHAT!M311,-1)+1","v":"2016-08-01"},{"$f":"EOMONTH(ACHAT!L311,-1)+1","v":"2016-10-01"}]
[null,{"$f":"EOMONTH(VENTE!A312,-1)+1","v":"2016-11-01"},{"$f":"EOMONTH(VENTE!I312,-1)+1","v":"2016-11-01"},{"$f":"EOMONTH(ACHAT!M312,-1)+1","v":"2016-08-01"},{"$f":"EOMONTH(ACHAT!L312,-1)+1","v":"2016-10-01"}]
[null,{"$f":"EOMONTH(VENTE!A313,-1)+1","v":"2016-11-01"},{"$f":"EOMONTH(VENTE!I313,-1)+1","v":"2016-11-01"},{"$f":"EOMONTH(ACHAT!M313,-1)+1","v":"2016-09-01"},{"$f":"EOMONTH(ACHAT!L313,-1)+1","v":"2016-10-01"}]
[null,{"$f":"EOMONTH(VENTE!A314,-1)+1","v":"2016-07-01"},{"$f":"EOMONTH(VENTE!I314,-1)+1","v":"2016-12-01"},{"$f":"EOMONTH(ACHAT!M314,-1)+1","v":"2016-09-01"},{"$f":"EOMONTH(ACHAT!L314,-1)+1","v":"2016-12-01"}]
[null,{"$f":"EOMONTH(VENTE!A315,-1)+1","v":"2016-07-01"},{"$f":"EOMONTH(VENTE!I315,-1)+1","v":"2016-12-01"},{"$f":"EOMONTH(ACHAT!M315,-1)+1","v":"2016-09-01"},{"$f":"EOMONTH(ACHAT!L315,-1)+1","v":"2016-12-01"}]
[null,{"$f":"EOMONTH(VENTE!A316,-1)+1","v":"2016-07-01"},{"$f":"EOMONTH(VENTE!I316,-1)+1","v":"2016-12-01"},{"$f":"EOMONTH(ACHAT!M316,-1)+1","v":"2016-10-01"},{"$f":"EOMONTH(ACHAT!L316,-1)+1","v":"2016-12-01"}]
[null,{"$f":"EOMONTH(VENTE!A317,-1)+1","v":"2016-08-01"},{"$f":"EOMONTH(VENTE!I317,-1)+1","v":"2016-12-01"},{"$f":"EOMONTH(ACHAT!M317,-1)+1","v":"2016-10-01"},{"$f":"EOMONTH(ACHAT!L317,-1)+1","v":"2016-12-01"}]
[null,{"$f":"EOMONTH(VENTE!A318,-1)+1","v":"2016-09-01"},{"$f":"EOMONTH(VENTE!I318,-1)+1","v":"2016-12-01"},{"$f":"EOMONTH(ACHAT!M318,-1)+1","v":"2016-10-01"},{"$f":"EOMONTH(ACHAT!L318,-1)+1","v":"2016-12-01"}]
[null,{"$f":"EOMONTH(VENTE!A319,-1)+1","v":"2016-11-01"},{"$f":"EOMONTH(VENTE!I319,-1)+1","v":"2016-12-01"},{"$f":"EOMONTH(ACHAT!M319,-1)+1","v":"2016-11-01"},{"$f":"EOMONTH(ACHAT!L319,-1)+1","v":"2016-12-01"}]
[null,{"$f":"EOMONTH(VENTE!A320,-1)+1","v":"2016-12-01"},{"$f":"EOMONTH(VENTE!I320,-1)+1","v":"2016-12-01"},{"$f":"EOMONTH(ACHAT!M320,-1)+1","v":"2016-11-01"},{"$f":"EOMONTH(ACHAT!L320,-1)+1","v":"2017-01-01"}]
[null,{"$f":"EOMONTH(VENTE!A321,-1)+1","v":"2016-12-01"},{"$f":"EOMONTH(VENTE!I321,-1)+1","v":"2016-12-01"},{"$f":"EOMONTH(ACHAT!M321,-1)+1","v":"2016-11-01"},{"$f":"EOMONTH(ACHAT!L321,-1)+1","v":"2017-01-01"}]
[null,{"$f":"EOMONTH(VENTE!A322,-1)+1","v":"2016-12-01"},{"$f":"EOMONTH(VENTE!I322,-1)+1","v":"2016-12-01"},{"$f":"EOMONTH(ACHAT!M322,-1)+1","v":"2016-12-01"},{"$f":"EOMONTH(ACHAT!L322,-1)+1","v":"2017-01-01"}]
[null,{"$f":"EOMONTH(VENTE!A323,-1)+1","v":"2016-12-01"},{"$f":"EOMONTH(VENTE!I323,-1)+1","v":"2016-12-01"},{"$f":"EOMONTH(ACHAT!M323,-1)+1","v":"2016-12-01"},{"$f":"EOMONTH(ACHAT!L323,-1)+1","v":"2017-01-01"}]
[null,{"$f":"EOMONTH(VENTE!A324,-1)+1","v":"2016-12-01"},{"$f":"EOMONTH(VENTE!I324,-1)+1","v":"2016-12-01"},{"$f":"EOMONTH(ACHAT!M324,-1)+1","v":"2016-11-01"},{"$f":"EOMONTH(ACHAT!L324,-1)+1","v":"2017-03-01"}]
[null,{"$f":"EOMONTH(VENTE!A325,-1)+1","v":"2016-12-01"},{"$f":"EOMONTH(VENTE!I325,-1)+1","v":"2016-12-01"},{"$f":"EOMONTH(ACHAT!M325,-1)+1","v":"2016-12-01"},{"$f":"EOMONTH(ACHAT!L325,-1)+1","v":"2017-03-01"}]
[null,{"$f":"EOMONTH(VENTE!A326,-1)+1","v":"2016-12-01"},{"$f":"EOMONTH(VENTE!I326,-1)+1","v":"2016-12-01"},{"$f":"EOMONTH(ACHAT!M326,-1)+1","v":"2017-01-01"},{"$f":"EOMONTH(ACHAT!L326,-1)+1","v":"2017-04-01"}]
[null,{"$f":"EOMONTH(VENTE!A327,-1)+1","v":"2016-12-01"},{"$f":"EOMONTH(VENTE!I327,-1)+1","v":"2016-12-01"},{"$f":"EOMONTH(ACHAT!M327,-1)+1","v":"2017-01-01"},{"$f":"EOMONTH(ACHAT!L327,-1)+1","v":"2017-04-01"}]
[null,{"$f":"EOMONTH(VENTE!A328,-1)+1","v":"2016-12-01"},{"$f":"EOMONTH(VENTE!I328,-1)+1","v":"2016-12-01"},{"$f":"EOMONTH(ACHAT!M328,-1)+1","v":"2017-01-01"},{"$f":"EOMONTH(ACHAT!L328,-1)+1","v":"2017-04-01"}]
[null,{"$f":"EOMONTH(VENTE!A329,-1)+1","v":"2016-12-01"},{"$f":"EOMONTH(VENTE!I329,-1)+1","v":"2016-12-01"},{"$f":"EOMONTH(ACHAT!M329,-1)+1","v":"2017-01-01"},{"$f":"EOMONTH(ACHAT!L329,-1)+1","v":"2017-04-01"}]
[null,{"$f":"EOMONTH(VENTE!A330,-1)+1","v":"2016-12-01"},{"$f":"EOMONTH(VENTE!I330,-1)+1","v":"2016-12-01"},{"$f":"EOMONTH(ACHAT!M330,-1)+1","v":"2017-01-01"},{"$f":"EOMONTH(ACHAT!L330,-1)+1","v":"2017-04-01"}]
[null,{"$f":"EOMONTH(VENTE!A331,-1)+1","v":"2016-12-01"},{"$f":"EOMONTH(VENTE!I331,-1)+1","v":"2016-12-01"},{"$f":"EOMONTH(ACHAT!M331,-1)+1","v":"2016-08-01"},{"$f":"EOMONTH(ACHAT!L331,-1)+1","v":"2017-05-01"}]
[null,{"$f":"EOMONTH(VENTE!A332,-1)+1","v":"2016-12-01"},{"$f":"EOMONTH(VENTE!I332,-1)+1","v":"2016-12-01"},{"$f":"EOMONTH(ACHAT!M332,-1)+1","v":"2016-09-01"},{"$f":"EOMONTH(ACHAT!L332,-1)+1","v":"2017-05-01"}]
[null,{"$f":"EOMONTH(VENTE!A333,-1)+1","v":"2016-12-01"},{"$f":"EOMONTH(VENTE!I333,-1)+1","v":"2016-12-01"},{"$f":"EOMONTH(ACHAT!M333,-1)+1","v":"2016-10-01"},{"$f":"EOMONTH(ACHAT!L333,-1)+1","v":"2017-05-01"}]
[null,{"$f":"EOMONTH(VENTE!A334,-1)+1","v":"2016-12-01"},{"$f":"EOMONTH(VENTE!I334,-1)+1","v":"2016-12-01"},{"$f":"EOMONTH(ACHAT!M334,-1)+1","v":{"$error":"#NUM!"}},{"$f":"EOMONTH(ACHAT!L334,-1)+1","v":{"$error":"#NUM!"}}]
[null,{"$f":"EOMONTH(VENTE!A335,-1)+1","v":"2016-09-01"},{"$f":"EOMONTH(VENTE!I335,-1)+1","v":"2017-01-01"},{"$f":"EOMONTH(ACHAT!M335,-1)+1","v":{"$error":"#NUM!"}},{"$f":"EOMONTH(ACHAT!L335,-1)+1","v":{"$error":"#NUM!"}}]
[null,{"$f":"EOMONTH(VENTE!A336,-1)+1","v":"2017-01-01"},{"$f":"EOMONTH(VENTE!I336,-1)+1","v":"2017-01-01"},{"$f":"EOMONTH(ACHAT!M336,-1)+1","v":{"$error":"#NUM!"}},{"$f":"EOMONTH(ACHAT!L336,-1)+1","v":{"$error":"#NUM!"}}]
[null,{"$f":"EOMONTH(VENTE!A337,-1)+1","v":"2017-01-01"},{"$f":"EOMONTH(VENTE!I337,-1)+1","v":"2017-01-01"},{"$f":"EOMONTH(ACHAT!M337,-1)+1","v":{"$error":"#NUM!"}},{"$f":"EOMONTH(ACHAT!L337,-1)+1","v":{"$error":"#NUM!"}}]
[null,{"$f":"EOMONTH(VENTE!A338,-1)+1","v":"2017-01-01"},{"$f":"EOMONTH(VENTE!I338,-1)+1","v":"2017-01-01"},{"$f":"EOMONTH(ACHAT!M338,-1)+1","v":{"$error":"#NUM!"}},{"$f":"EOMONTH(ACHAT!L338,-1)+1","v":{"$error":"#NUM!"}}]
[null,{"$f":"EOMONTH(VENTE!A339,-1)+1","v":"2017-01-01"},{"$f":"EOMONTH(VENTE!I339,-1)+1","v":"2017-01-01"},{"$f":"EOMONTH(ACHAT!M339,-1)+1","v":{"$error":"#NUM!"}},{"$f":"EOMONTH(ACHAT!L339,-1)+1","v":{"$error":"#NUM!"}}]
[null,{"$f":"EOMONTH(VENTE!A340,-1)+1","v":"2017-01-01"},{"$f":"EOMONTH(VENTE!I340,-1)+1","v":"2017-01-01"},{"$f":"EOMONTH(ACHAT!M340,-1)+1","v":{"$error":"#NUM!"}},{"$f":"EOMONTH(ACHAT!L340,-1)+1","v":{"$error":"#NUM!"}}]
[null,{"$f":"EOMONTH(VENTE!A341,-1)+1","v":"2017-01-01"},{"$f":"EOMONTH(VENTE!I341,-1)+1","v":"2017-01-01"},{"$f":"EOMONTH(ACHAT!M341,-1)+1","v":{"$error":"#NUM!"}},{"$f":"EOMONTH(ACHAT!L341,-1)+1","v":{"$error":"#NUM!"}}]
[null,{"$f":"EOMONTH(VENTE!A342,-1)+1","v":"2017-01-01"},{"$f":"EOMONTH(VENTE!I342,-1)+1","v":"2017-01-01"},{"$f":"EOMONTH(ACHAT!M342,-1)+1","v":{"$error":"#NUM!"}},{"$f":"EOMONTH(ACHAT!L342,-1)+1","v":{"$error":"#NUM!"}}]
[null,{"$f":"EOMONTH(VENTE!A343,-1)+1","v":"2017-01-01"},{"$f":"EOMONTH(VENTE!I343,-1)+1","v":"2017-01-01"},{"$f":"EOMONTH(ACHAT!M343,-1)+1","v":{"$error":"#NUM!"}},{"$f":"EOMONTH(ACHAT!L343,-1)+1","v":{"$error":"#NUM!"}}]
[null,{"$f":"EOMONTH(VENTE!A344,-1)+1","v":"2017-01-01"},{"$f":"EOMONTH(VENTE!I344,-1)+1","v":"2017-01-01"},{"$f":"EOMONTH(ACHAT!M344,-1)+1","v":{"$error":"#NUM!"}},{"$f":"EOMONTH(ACHAT!L344,-1)+1","v":{"$error":"#NUM!"}}]
[null,{"$f":"EOMONTH(VENTE!A345,-1)+1","v":"2017-01-01"},{"$f":"EOMONTH(VENTE!I345,-1)+1","v":"2017-01-01"},{"$f":"EOMONTH(ACHAT!M345,-1)+1","v":{"$error":"#NUM!"}},{"$f":"EOMONTH(ACHAT!L345,-1)+1","v":{"$error":"#NUM!"}}]
[null,{"$f":"EOMONTH(VENTE!A346,-1)+1","v":"2017-01-01"},{"$f":"EOMONTH(VENTE!I346,-1)+1","v":"2017-01-01"},{"$f":"EOMONTH(ACHAT!M346,-1)+1","v":{"$error":"#NUM!"}},{"$f":"EOMONTH(ACHAT!L346,-1)+1","v":{"$error":"#NUM!"}}]
[null,{"$f":"EOMONTH(VENTE!A347,-1)+1","v":"2017-01-01"},{"$f":"EOMONTH(VENTE!I347,-1)+1","v":"2017-01-01"},{"$f":"EOMONTH(ACHAT!M347,-1)+1","v":{"$error":"#NUM!"}},{"$f":"EOMONTH(ACHAT!L347,-1)+1","v":{"$error":"#NUM!"}}]
[null,{"$f":"EOMONTH(VENTE!A348,-1)+1","v":"2017-01-01"},{"$f":"EOMONTH(VENTE!I348,-1)+1","v":"2017-01-01"},{"$f":"EOMONTH(ACHAT!M348,-1)+1","v":{"$error":"#NUM!"}},{"$f":"EOMONTH(ACHAT!L348,-1)+1","v":{"$error":"#NUM!"}}]
[null,{"$f":"EOMONTH(VENTE!A349,-1)+1","v":"2017-01-01"},{"$f":"EOMONTH(VENTE!I349,-1)+1","v":"2017-01-01"},{"$f":"EOMONTH(ACHAT!M349,-1)+1","v":{"$error":"#NUM!"}},{"$f":"EOMONTH(ACHAT!L349,-1)+1","v":{"$error":"#NUM!"}}]
[null,{"$f":"EOMONTH(VENTE!A350,-1)+1","v":"2017-01-01"},{"$f":"EOMONTH(VENTE!I350,-1)+1","v":"2017-01-01"},{"$f":"EOMONTH(ACHAT!M350,-1)+1","v":{"$error":"#NUM!"}},{"$f":"EOMONTH(ACHAT!L350,-1)+1","v":{"$error":"#NUM!"}}]
[null,{"$f":"EOMONTH(VENTE!A351,-1)+1","v":"2017-01-01"},{"$f":"EOMONTH(VENTE!I351,-1)+1","v":"2017-01-01"},{"$f":"EOMONTH(ACHAT!M351,-1)+1","v":{"$error":"#NUM!"}},{"$f":"EOMONTH(ACHAT!L351,-1)+1","v":{"$error":"#NUM!"}}]
[null,{"$f":"EOMONTH(VENTE!A352,-1)+1","v":"2017-01-01"},{"$f":"EOMONTH(VENTE!I352,-1)+1","v":"2017-01-01"},{"$f":"EOMONTH(ACHAT!M352,-1)+1","v":{"$error":"#NUM!"}},{"$f":"EOMONTH(ACHAT!L352,-1)+1","v":{"$error":"#NUM!"}}]
[null,{"$f":"EOMONTH(VENTE!A353,-1)+1","v":"2017-01-01"},{"$f":"EOMONTH(VENTE!I353,-1)+1","v":"2017-01-01"},{"$f":"EOMONTH(ACHAT!M353,-1)+1","v":{"$error":"#NUM!"}},{"$f":"EOMONTH(ACHAT!L353,-1)+1","v":{"$error":"#NUM!"}}]
[null,{"$f":"EOMONTH(VENTE!A354,-1)+1","v":"2017-01-01"},{"$f":"EOMONTH(VENTE!I354,-1)+1","v":"2017-01-01"},{"$f":"EOMONTH(ACHAT!M354,-1)+1","v":{"$error":"#NUM!"}},{"$f":"EOMONTH(ACHAT!L354,-1)+1","v":{"$error":"#NUM!"}}]
[null,{"$f":"EOMONTH(VENTE!A355,-1)+1","v":"2017-01-01"},{"$f":"EOMONTH(VENTE!I355,-1)+1","v":"2017-01-01"},{"$f":"EOMONTH(ACHAT!M355,-1)+1","v":{"$error":"#NUM!"}},{"$f":"EOMONTH(ACHAT!L355,-1)+1","v":{"$error":"#NUM!"}}]
[null,{"$f":"EOMONTH(VENTE!A356,-1)+1","v":"2017-01-01"},{"$f":"EOMONTH(VENTE!I356,-1)+1","v":"2017-01-01"},{"$f":"EOMONTH(ACHAT!M356,-1)+1","v":{"$error":"#NUM!"}},{"$f":"EOMONTH(ACHAT!L356,-1)+1","v":{"$error":"#NUM!"}}]
[null,{"$f":"EOMONTH(VENTE!A357,-1)+1","v":"2016-07-01"},{"$f":"EOMONTH(VENTE!I357,-1)+1","v":"2017-02-01"},{"$f":"EOMONTH(ACHAT!M357,-1)+1","v":{"$error":"#NUM!"}},{"$f":"EOMONTH(ACHAT!L357,-1)+1","v":{"$error":"#NUM!"}}]
[null,{"$f":"EOMONTH(VENTE!A358,-1)+1","v":"2016-08-01"},{"$f":"EOMONTH(VENTE!I358,-1)+1","v":"2017-02-01"},{"$f":"EOMONTH(ACHAT!M358,-1)+1","v":{"$error":"#NUM!"}},{"$f":"EOMONTH(ACHAT!L358,-1)+1","v":{"$error":"#NUM!"}}]
[null,{"$f":"EOMONTH(VENTE!A359,-1)+1","v":"2016-08-01"},{"$f":"EOMONTH(VENTE!I359,-1)+1","v":"2017-02-01"},{"$f":"EOMONTH(ACHAT!M359,-1)+1","v":{"$error":"#NUM!"}},{"$f":"EOMONTH(ACHAT!L359,-1)+1","v":{"$error":"#NUM!"}}]
[null,{"$f":"EOMONTH(VENTE!A360,-1)+1","v":"2016-10-01"},{"$f":"EOMONTH(VENTE!I360,-1)+1","v":"2017-02-01"},{"$f":"EOMONTH(ACHAT!M360,-1)+1","v":{"$error":"#NUM!"}},{"$f":"EOMONTH(ACHAT!L360,-1)+1","v":{"$error":"#NUM!"}}]
[null,{"$f":"EOMONTH(VENTE!A361,-1)+1","v":"2016-10-01"},{"$f":"EOMONTH(VENTE!I361,-1)+1","v":"2017-02-01"},{"$f":"EOMONTH(ACHAT!M361,-1)+1","v":{"$error":"#NUM!"}},{"$f":"EOMONTH(ACHAT!L361,-1)+1","v":{"$error":"#NUM!"}}]
[null,{"$f":"EOMONTH(VENTE!A362,-1)+1","v":"2016-10-01"},{"$f":"EOMONTH(VENTE!I362,-1)+1","v":"2017-02-01"},{"$f":"EOMONTH(ACHAT!M362,-1)+1","v":{"$error":"#NUM!"}},{"$f":"EOMONTH(ACHAT!L362,-1)+1","v":{"$error":"#NUM!"}}]
[null,{"$f":"EOMONTH(VENTE!A363,-1)+1","v":"2016-10-01"},{"$f":"EOMONTH(VENTE!I363,-1)+1","v":"2017-02-01"},{"$f":"EOMONTH(ACHAT!M363,-1)+1","v":{"$error":"#NUM!"}},{"$f":"EOMONTH(ACHAT!L363,-1)+1","v":{"$error":"#NUM!"}}]
[null,{"$f":"EOMONTH(VENTE!A364,-1)+1","v":"2016-12-01"},{"$f":"EOMONTH(VENTE!I364,-1)+1","v":"2017-02-01"},{"$f":"EOMONTH(ACHAT!M364,-1)+1","v":{"$error":"#NUM!"}},{"$f":"EOMONTH(ACHAT!L364,-1)+1","v":{"$error":"#NUM!"}}]
[null,{"$f":"EOMONTH(VENTE!A365,-1)+1","v":"2017-02-01"},{"$f":"EOMONTH(VENTE!I365,-1)+1","v":"2017-02-01"},{"$f":"EOMONTH(ACHAT!M365,-1)+1","v":{"$error":"#NUM!"}},{"$f":"EOMONTH(ACHAT!L365,-1)+1","v":{"$error":"#NUM!"}}]
[null,{"$f":"EOMONTH(VENTE!A366,-1)+1","v":"2017-02-01"},{"$f":"EOMONTH(VENTE!I366,-1)+1","v":"2017-02-01"},{"$f":"EOMONTH(ACHAT!M366,-1)+1","v":{"$error":"#NUM!"}},{"$f":"EOMONTH(ACHAT!L366,-1)+1","v":{"$error":"#NUM!"}}]
[null,{"$f":"EOMONTH(VENTE!A367,-1)+1","v":"2017-02-01"},{"$f":"EOMONTH(VENTE!I367,-1)+1","v":"2017-02-01"},{"$f":"EOMONTH(ACHAT!M367,-1)+1","v":{"$error":"#NUM!"}},{"$f":"EOMONTH(ACHAT!L367,-1)+1","v":{"$error":"#NUM!"}}]
[null,{"$f":"EOMONTH(VENTE!A368,-1)+1","v":"2017-02-01"},{"$f":"EOMONTH(VENTE!I368,-1)+1","v":"2017-02-01"},{"$f":"EOMONTH(ACHAT!M368,-1)+1","v":{"$error":"#NUM!"}},{"$f":"EOMONTH(ACHAT!L368,-1)+1","v":{"$error":"#NUM!"}}]
[null,{"$f":"EOMONTH(VENTE!A369,-1)+1","v":"2017-02-01"},{"$f":"EOMONTH(VENTE!I369,-1)+1","v":"2017-02-01"},{"$f":"EOMONTH(ACHAT!M369,-1)+1","v":{"$error":"#NUM!"}},{"$f":"EOMONTH(ACHAT!L369,-1)+1","v":{"$error":"#NUM!"}}]
[null,{"$f":"EOMONTH(VENTE!A370,-1)+1","v":"2017-02-01"},{"$f":"EOMONTH(VENTE!I370,-1)+1","v":"2017-02-01"},{"$f":"EOMONTH(ACHAT!M370,-1)+1","v":{"$error":"#NUM!"}},{"$f":"EOMONTH(ACHAT!L370,-1)+1","v":{"$error":"#NUM!"}}]
[null,{"$f":"EOMONTH(VENTE!A371,-1)+1","v":"2017-02-01"},{"$f":"EOMONTH(VENTE!I371,-1)+1","v":"2017-02-01"},{"$f":"EOMONTH(ACHAT!M371,-1)+1","v":{"$error":"#NUM!"}},{"$f":"EOMONTH(ACHAT!L371,-1)+1","v":{"$error":"#NUM!"}}]
[null,{"$f":"EOMONTH(VENTE!A372,-1)+1","v":"2017-02-01"},{"$f":"EOMONTH(VENTE!I372,-1)+1","v":"2017-02-01"},{"$f":"EOMONTH(ACHAT!M372,-1)+1","v":{"$error":"#NUM!"}},{"$f":"EOMONTH(ACHAT!L372,-1)+1","v":{"$error":"#NUM!"}}]
[null,{"$f":"EOMONTH(VENTE!A373,-1)+1","v":"2017-02-01"},{"$f":"EOMONTH(VENTE!I373,-1)+1","v":"2017-02-01"},{"$f":"EOMONTH(ACHAT!M373,-1)+1","v":{"$error":"#NUM!"}},{"$f":"EOMONTH(ACHAT!L373,-1)+1","v":{"$error":"#NUM!"}}]
[null,{"$f":"EOMONTH(VENTE!A374,-1)+1","v":"2017-02-01"},{"$f":"EOMONTH(VENTE!I374,-1)+1","v":"2017-02-01"},{"$f":"EOMONTH(ACHAT!M374,-1)+1","v":{"$error":"#NUM!"}},{"$f":"EOMONTH(ACHAT!L374,-1)+1","v":{"$error":"#NUM!"}}]
[null,{"$f":"EOMONTH(VENTE!A375,-1)+1","v":"2017-02-01"},{"$f":"EOMONTH(VENTE!I375,-1)+1","v":"2017-02-01"},{"$f":"EOMONTH(ACHAT!M375,-1)+1","v":{"$error":"#NUM!"}},{"$f":"EOMONTH(ACHAT!L375,-1)+1","v":{"$error":"#NUM!"}}]
[null,{"$f":"EOMONTH(VENTE!A376,-1)+1","v":"2017-02-01"},{"$f":"EOMONTH(VENTE!I376,-1)+1","v":"2017-02-01"},{"$f":"EOMONTH(ACHAT!M376,-1)+1","v":{"$error":"#NUM!"}},{"$f":"EOMONTH(ACHAT!L376,-1)+1","v":{"$error":"#NUM!"}}]
[null,{"$f":"EOMONTH(VENTE!A377,-1)+1","v":"2017-02-01"},{"$f":"EOMONTH(VENTE!I377,-1)+1","v":"2017-02-01"},{"$f":"EOMONTH(ACHAT!M377,-1)+1","v":{"$error":"#NUM!"}},{"$f":"EOMONTH(ACHAT!L377,-1)+1","v":{"$error":"#NUM!"}}]
[null,{"$f":"EOMONTH(VENTE!A378,-1)+1","v":"2017-02-01"},{"$f":"EOMONTH(VENTE!I378,-1)+1","v":"2017-02-01"},{"$f":"EOMONTH(ACHAT!M378,-1)+1","v":{"$error":"#NUM!"}},{"$f":"EOMONTH(ACHAT!L378,-1)+1","v":{"$error":"#NUM!"}}]
[null,{"$f":"EOMONTH(VENTE!A379,-1)+1","v":"2017-02-01"},{"$f":"EOMONTH(VENTE!I379,-1)+1","v":"2017-02-01"},{"$f":"EOMONTH(ACHAT!M379,-1)+1","v":{"$error":"#NUM!"}},{"$f":"EOMONTH(ACHAT!L379,-1)+1","v":{"$error":"#NUM!"}}]
[null,{"$f":"EOMONTH(VENTE!A380,-1)+1","v":"2017-02-01"},{"$f":"EOMONTH(VENTE!I380,-1)+1","v":"2017-02-01"},{"$f":"EOMONTH(ACHAT!M380,-1)+1","v":{"$error":"#NUM!"}},{"$f":"EOMONTH(ACHAT!L380,-1)+1","v":{"$error":"#NUM!"}}]
[null,{"$f":"EOMONTH(VENTE!A381,-1)+1","v":"2017-02-01"},{"$f":"EOMONTH(VENTE!I381,-1)+1","v":"2017-02-01"},{"$f":"EOMONTH(ACHAT!M381,-1)+1","v":{"$error":"#NUM!"}},{"$f":"EOMONTH(ACHAT!L381,-1)+1","v":{"$error":"#NUM!"}}]
[null,{"$f":"EOMONTH(VENTE!A382,-1)+1","v":"2017-02-01"},{"$f":"EOMONTH(VENTE!I382,-1)+1","v":"2017-02-01"},{"$f":"EOMONTH(ACHAT!M382,-1)+1","v":{"$error":"#NUM!"}},{"$f":"EOMONTH(ACHAT!L382,-1)+1","v":{"$error":"#NUM!"}}]
[null,{"$f":"EOMONTH(VENTE!A383,-1)+1","v":"2017-02-01"},{"$f":"EOMONTH(VENTE!I383,-1)+1","v":"2017-02-01"},{"$f":"EOMONTH(ACHAT!M383,-1)+1","v":{"$error":"#NUM!"}},{"$f":"EOMONTH(ACHAT!L383,-1)+1","v":{"$error":"#NUM!"}}]
[null,{"$f":"EOMONTH(VENTE!A384,-1)+1","v":"2017-02-01"},{"$f":"EOMONTH(VENTE!I384,-1)+1","v":"2017-02-01"},{"$f":"EOMONTH(ACHAT!M384,-1)+1","v":{"$error":"#NUM!"}},{"$f":"EOMONTH(ACHAT!L384,-1)+1","v":{"$error":"#NUM!"}}]
[null,{"$f":"EOMONTH(VENTE!A385,-1)+1","v":"2017-02-01"},{"$f":"EOMONTH(VENTE!I385,-1)+1","v":"2017-02-01"},{"$f":"EOMONTH(ACHAT!M385,-1)+1","v":{"$error":"#NUM!"}},{"$f":"EOMONTH(ACHAT!L385,-1)+1","v":{"$error":"#NUM!"}}]
[null,{"$f":"EOMONTH(VENTE!A386,-1)+1","v":"2017-02-01"},{"$f":"EOMONTH(VENTE!I386,-1)+1","v":"2017-02-01"},{"$f":"EOMONTH(ACHAT!M386,-1)+1","v":{"$error":"#NUM!"}},{"$f":"EOMONTH(ACHAT!L386,-1)+1","v":{"$error":"#NUM!"}}]
[null,{"$f":"EOMONTH(VENTE!A387,-1)+1","v":"2017-02-01"},{"$f":"EOMONTH(VENTE!I387,-1)+1","v":"2017-02-01"},{"$f":"EOMONTH(ACHAT!M387,-1)+1","v":{"$error":"#NUM!"}},{"$f":"EOMONTH(ACHAT!L387,-1)+1","v":{"$error":"#NUM!"}}]
[null,{"$f":"EOMONTH(VENTE!A388,-1)+1","v":"2016-06-01"},{"$f":"EOMONTH(VENTE!I388,-1)+1","v":"2017-03-01"},{"$f":"EOMONTH(ACHAT!M388,-1)+1","v":{"$error":"#NUM!"}},{"$f":"EOMONTH(ACHAT!L388,-1)+1","v":{"$error":"#NUM!"}}]
[null,{"$f":"EOMONTH(VENTE!A389,-1)+1","v":"2016-07-01"},{"$f":"EOMONTH(VENTE!I389,-1)+1","v":"2017-03-01"},{"$f":"EOMONTH(ACHAT!M389,-1)+1","v":{"$error":"#NUM!"}},{"$f":"EOMONTH(ACHAT!L389,-1)+1","v":{"$error":"#NUM!"}}]
[null,{"$f":"EOMONTH(VENTE!A390,-1)+1","v":"2016-09-01"},{"$f":"EOMONTH(VENTE!I390,-1)+1","v":"2017-03-01"},{"$f":"EOMONTH(ACHAT!M390,-1)+1","v":{"$error":"#NUM!"}},{"$f":"EOMONTH(ACHAT!L390,-1)+1","v":{"$error":"#NUM!"}}]
[null,{"$f":"EOMONTH(VENTE!A391,-1)+1","v":"2016-10-01"},{"$f":"EOMONTH(VENTE!I391,-1)+1","v":"2017-03-01"},{"$f":"EOMONTH(ACHAT!M391,-1)+1","v":{"$error":"#NUM!"}},{"$f":"EOMONTH(ACHAT!L391,-1)+1","v":{"$error":"#NUM!"}}]
[null,{"$f":"EOMONTH(VENTE!A392,-1)+1","v":"2016-11-01"},{"$f":"EOMONTH(VENTE!I392,-1)+1","v":"2017-03-01"},{"$f":"EOMONTH(ACHAT!M392,-1)+1","v":{"$error":"#NUM!"}},{"$f":"EOMONTH(ACHAT!L392,-1)+1","v":{"$error":"#NUM!"}}]
[null,{"$f":"EOMONTH(VENTE!A393,-1)+1","v":"2016-11-01"},{"$f":"EOMONTH(VENTE!I393,-1)+1","v":"2017-03-01"},{"$f":"EOMONTH(ACHAT!M393,-1)+1","v":{"$error":"#NUM!"}},{"$f":"EOMONTH(ACHAT!L393,-1)+1","v":{"$error":"#NUM!"}}]
[null,{"$f":"EOMONTH(VENTE!A394,-1)+1","v":"2016-11-01"},{"$f":"EOMONTH(VENTE!I394,-1)+1","v":"2017-03-01"},{"$f":"EOMONTH(ACHAT!M394,-1)+1","v":{"$error":"#NUM!"}},{"$f":"EOMONTH(ACHAT!L394,-1)+1","v":{"$error":"#NUM!"}}]
[null,{"$f":"EOMONTH(VENTE!A395,-1)+1","v":"2016-11-01"},{"$f":"EOMONTH(VENTE!I395,-1)+1","v":"2017-03-01"},{"$f":"EOMONTH(ACHAT!M395,-1)+1","v":{"$error":"#NUM!"}},{"$f":"EOMONTH(ACHAT!L395,-1)+1","v":{"$error":"#NUM!"}}]
[null,{"$f":"EOMONTH(VENTE!A396,-1)+1","v":"2017-02-01"},{"$f":"EOMONTH(VENTE!I396,-1)+1","v":"2017-03-01"},{"$f":"EOMONTH(ACHAT!M396,-1)+1","v":{"$error":"#NUM!"}},{"$f":"EOMONTH(ACHAT!L396,-1)+1","v":{"$error":"#NUM!"}}]
[null,{"$f":"EOMONTH(VENTE!A397,-1)+1","v":"2017-03-01"},{"$f":"EOMONTH(VENTE!I397,-1)+1","v":"2017-03-01"},{"$f":"EOMONTH(ACHAT!M397,-1)+1","v":{"$error":"#NUM!"}},{"$f":"EOMONTH(ACHAT!L397,-1)+1","v":{"$error":"#NUM!"}}]
[null,{"$f":"EOMONTH(VENTE!A398,-1)+1","v":"2017-03-01"},{"$f":"EOMONTH(VENTE!I398,-1)+1","v":"2017-03-01"},{"$f":"EOMONTH(ACHAT!M398,-1)+1","v":{"$error":"#NUM!"}},{"$f":"EOMONTH(ACHAT!L398,-1)+1","v":{"$error":"#NUM!"}}]
[null,{"$f":"EOMONTH(VENTE!A399,-1)+1","v":"2017-03-01"},{"$f":"EOMONTH(VENTE!I399,-1)+1","v":"2017-03-01"},{"$f":"EOMONTH(ACHAT!M399,-1)+1","v":{"$error":"#NUM!"}},{"$f":"EOMONTH(ACHAT!L399,-1)+1","v":{"$error":"#NUM!"}}]
[null,{"$f":"EOMONTH(VENTE!A400,-1)+1","v":"2017-03-01"},{"$f":"EOMONTH(VENTE!I400,-1)+1","v":"2017-03-01"},{"$f":"EOMONTH(ACHAT!M400,-1)+1","v":{"$error":"#NUM!"}},{"$f":"EOMONTH(ACHAT!L400,-1)+1","v":{"$error":"#NUM!"}}]
[null,{"$f":"EOMONTH(VENTE!A401,-1)+1","v":"2017-03-01"},{"$f":"EOMONTH(VENTE!I401,-1)+1","v":"2017-03-01"},{"$f":"EOMONTH(ACHAT!M401,-1)+1","v":{"$error":"#NUM!"}},{"$f":"EOMONTH(ACHAT!L401,-1)+1","v":{"$error":"#NUM!"}}]
[null,{"$f":"EOMONTH(VENTE!A402,-1)+1","v":"2017-03-01"},{"$f":"EOMONTH(VENTE!I402,-1)+1","v":"2017-03-01"},{"$f":"EOMONTH(ACHAT!M402,-1)+1","v":{"$error":"#NUM!"}},{"$f":"EOMONTH(ACHAT!L402,-1)+1","v":{"$error":"#NUM!"}}]
[null,{"$f":"EOMONTH(VENTE!A403,-1)+1","v":"2017-03-01"},{"$f":"EOMONTH(VENTE!I403,-1)+1","v":"2017-03-01"},{"$f":"EOMONTH(ACHAT!M403,-1)+1","v":{"$error":"#NUM!"}},{"$f":"EOMONTH(ACHAT!L403,-1)+1","v":{"$error":"#NUM!"}}]
[null,{"$f":"EOMONTH(VENTE!A404,-1)+1","v":"2017-03-01"},{"$f":"EOMONTH(VENTE!I404,-1)+1","v":"2017-03-01"},{"$f":"EOMONTH(ACHAT!M404,-1)+1","v":{"$error":"#NUM!"}},{"$f":"EOMONTH(ACHAT!L404,-1)+1","v":{"$error":"#NUM!"}}]
[null,{"$f":"EOMONTH(VENTE!A405,-1)+1","v":"2016-12-01"},{"$f":"EOMONTH(VENTE!I405,-1)+1","v":"2017-04-01"},{"$f":"EOMONTH(ACHAT!M405,-1)+1","v":{"$error":"#NUM!"}},{"$f":"EOMONTH(ACHAT!L405,-1)+1","v":{"$error":"#NUM!"}}]
[null,{"$f":"EOMONTH(VENTE!A406,-1)+1","v":"2016-12-01"},{"$f":"EOMONTH(VENTE!I406,-1)+1","v":"2017-04-01"},{"$f":"EOMONTH(ACHAT!M406,-1)+1","v":{"$error":"#NUM!"}},{"$f":"EOMONTH(ACHAT!L406,-1)+1","v":{"$error":"#NUM!"}}]
[null,{"$f":"EOMONTH(VENTE!A407,-1)+1","v":"2016-02-01"},{"$f":"EOMONTH(VENTE!I407,-1)+1","v":"2017-04-01"},{"$f":"EOMONTH(ACHAT!M407,-1)+1","v":{"$error":"#NUM!"}},{"$f":"EOMONTH(ACHAT!L407,-1)+1","v":{"$error":"#NUM!"}}]
[null,{"$f":"EOMONTH(VENTE!A408,-1)+1","v":"2017-02-01"},{"$f":"EOMONTH(VENTE!I408,-1)+1","v":"2017-04-01"},{"$f":"EOMONTH(ACHAT!M408,-1)+1","v":{"$error":"#NUM!"}},{"$f":"EOMONTH(ACHAT!L408,-1)+1","v":{"$error":"#NUM!"}}]
[null,{"$f":"EOMONTH(VENTE!A409,-1)+1","v":"2017-02-01"},{"$f":"EOMONTH(VENTE!I409,-1)+1","v":"2017-04-01"},{"$f":"EOMONTH(ACHAT!M409,-1)+1","v":{"$error":"#NUM!"}},{"$f":"EOMONTH(ACHAT!L409,-1)+1","v":{"$error":"#NUM!"}}]
[null,{"$f":"EOMONTH(VENTE!A410,-1)+1","v":"2017-02-01"},{"$f":"EOMONTH(VENTE!I410,-1)+1","v":"2017-04-01"},{"$f":"EOMONTH(ACHAT!M410,-1)+1","v":{"$error":"#NUM!"}},{"$f":"EOMONTH(ACHAT!L410,-1)+1","v":{"$error":"#NUM!"}}]
[null,{"$f":"EOMONTH(VENTE!A411,-1)+1","v":"2017-02-01"},{"$f":"EOMONTH(VENTE!I411,-1)+1","v":"2017-04-01"},{"$f":"EOMONTH(ACHAT!M411,-1)+1","v":{"$error":"#NUM!"}},{"$f":"EOMONTH(ACHAT!L411,-1)+1","v":{"$error":"#NUM!"}}]
[null,{"$f":"EOMONTH(VENTE!A412,-1)+1","v":"2017-03-01"},{"$f":"EOMONTH(VENTE!I412,-1)+1","v":"2017-04-01"},{"$f":"EOMONTH(ACHAT!M412,-1)+1","v":{"$error":"#NUM!"}},{"$f":"EOMONTH(ACHAT!L412,-1)+1","v":{"$error":"#NUM!"}}]
[null,{"$f":"EOMONTH(VENTE!A413,-1)+1","v":"2017-04-01"},{"$f":"EOMONTH(VENTE!I413,-1)+1","v":"2017-04-01"},{"$f":"EOMONTH(ACHAT!M413,-1)+1","v":{"$error":"#NUM!"}},{"$f":"EOMONTH(ACHAT!L413,-1)+1","v":{"$error":"#NUM!"}}]
[null,{"$f":"EOMONTH(VENTE!A414,-1)+1","v":"2017-04-01"},{"$f":"EOMONTH(VENTE!I414,-1)+1","v":"2017-04-01"},{"$f":"EOMONTH(ACHAT!M414,-1)+1","v":{"$error":"#NUM!"}},{"$f":"EOMONTH(ACHAT!L414,-1)+1","v":{"$error":"#NUM!"}}]
[null,{"$f":"EOMONTH(VENTE!A415,-1)+1","v":"2017-04-01"},{"$f":"EOMONTH(VENTE!I415,-1)+1","v":"2017-04-01"},{"$f":"EOMONTH(ACHAT!M415,-1)+1","v":{"$error":"#NUM!"}},{"$f":"EOMONTH(ACHAT!L415,-1)+1","v":{"$error":"#NUM!"}}]
[null,{"$f":"EOMONTH(VENTE!A416,-1)+1","v":"2017-04-01"},{"$f":"EOMONTH(VENTE!I416,-1)+1","v":"2017-04-01"},{"$f":"EOMONTH(ACHAT!M416,-1)+1","v":{"$error":"#NUM!"}},{"$f":"EOMONTH(ACHAT!L416,-1)+1","v":{"$error":"#NUM!"}}]
[null,{"$f":"EOMONTH(VENTE!A417,-1)+1","v":"2017-04-01"},{"$f":"EOMONTH(VENTE!I417,-1)+1","v":"2017-04-01"},{"$f":"EOMONTH(ACHAT!M417,-1)+1","v":{"$error":"#NUM!"}},{"$f":"EOMONTH(ACHAT!L417,-1)+1","v":{"$error":"#NUM!"}}]
[null,{"$f":"EOMONTH(VENTE!A418,-1)+1","v":"2017-04-01"},{"$f":"EOMONTH(VENTE!I418,-1)+1","v":"2017-04-01"},{"$f":"EOMONTH(ACHAT!M418,-1)+1","v":{"$error":"#NUM!"}},{"$f":"EOMONTH(ACHAT!L418,-1)+1","v":{"$error":"#NUM!"}}]
[null,{"$f":"EOMONTH(VENTE!A419,-1)+1","v":"2017-04-01"},{"$f":"EOMONTH(VENTE!I419,-1)+1","v":"2017-04-01"},{"$f":"EOMONTH(ACHAT!M419,-1)+1","v":{"$error":"#NUM!"}},{"$f":"EOMONTH(ACHAT!L419,-1)+1","v":{"$error":"#NUM!"}}]
[null,{"$f":"EOMONTH(VENTE!A420,-1)+1","v":"2017-04-01"},{"$f":"EOMONTH(VENTE!I420,-1)+1","v":"2017-04-01"},{"$f":"EOMONTH(ACHAT!M420,-1)+1","v":{"$error":"#NUM!"}},{"$f":"EOMONTH(ACHAT!L420,-1)+1","v":{"$error":"#NUM!"}}]
[null,{"$f":"EOMONTH(VENTE!A421,-1)+1","v":{"$error":"#NUM!"}},{"$f":"EOMONTH(VENTE!I421,-1)+1","v":{"$error":"#NUM!"}},{"$f":"EOMONTH(ACHAT!M421,-1)+1","v":{"$error":"#NUM!"}},{"$f":"EOMONTH(ACHAT!L421,-1)+1","v":{"$error":"#NUM!"}}]
[null,{"$f":"EOMONTH(VENTE!A422,-1)+1","v":{"$error":"#NUM!"}},{"$f":"EOMONTH(VENTE!I422,-1)+1","v":{"$error":"#NUM!"}},{"$f":"EOMONTH(ACHAT!M422,-1)+1","v":{"$error":"#NUM!"}},{"$f":"EOMONTH(ACHAT!L422,-1)+1","v":{"$error":"#NUM!"}}]
[null,{"$f":"EOMONTH(VENTE!A423,-1)+1","v":{"$error":"#NUM!"}},{"$f":"EOMONTH(VENTE!I423,-1)+1","v":{"$error":"#NUM!"}},{"$f":"EOMONTH(ACHAT!M423,-1)+1","v":{"$error":"#NUM!"}},{"$f":"EOMONTH(ACHAT!L423,-1)+1","v":{"$error":"#NUM!"}}]
[null,{"$f":"EOMONTH(VENTE!A424,-1)+1","v":{"$error":"#NUM!"}},{"$f":"EOMONTH(VENTE!I424,-1)+1","v":{"$error":"#NUM!"}},{"$f":"EOMONTH(ACHAT!M424,-1)+1","v":{"$error":"#NUM!"}},{"$f":"EOMONTH(ACHAT!L424,-1)+1","v":{"$error":"#NUM!"}}]
[null,{"$f":"EOMONTH(VENTE!A425,-1)+1","v":{"$error":"#NUM!"}},{"$f":"EOMONTH(VENTE!I425,-1)+1","v":{"$error":"#NUM!"}},{"$f":"EOMONTH(ACHAT!M425,-1)+1","v":{"$error":"#NUM!"}},{"$f":"EOMONTH(ACHAT!L425,-1)+1","v":{"$error":"#NUM!"}}]
[null,{"$f":"EOMONTH(VENTE!A426,-1)+1","v":{"$error":"#NUM!"}},{"$f":"EOMONTH(VENTE!I426,-1)+1","v":{"$error":"#NUM!"}},{"$f":"EOMONTH(ACHAT!M426,-1)+1","v":{"$error":"#NUM!"}},{"$f":"EOMONTH(ACHAT!L426,-1)+1","v":{"$error":"#NUM!"}}]
[null,{"$f":"EOMONTH(VENTE!A427,-1)+1","v":{"$error":"#NUM!"}},{"$f":"EOMONTH(VENTE!I427,-1)+1","v":{"$error":"#NUM!"}},{"$f":"EOMONTH(ACHAT!M427,-1)+1","v":{"$error":"#NUM!"}},{"$f":"EOMONTH(ACHAT!L427,-1)+1","v":{"$error":"#NUM!"}}]
[null,{"$f":"EOMONTH(VENTE!A428,-1)+1","v":{"$error":"#NUM!"}},{"$f":"EOMONTH(VENTE!I428,-1)+1","v":{"$error":"#NUM!"}},{"$f":"EOMONTH(ACHAT!M428,-1)+1","v":{"$error":"#NUM!"}},{"$f":"EOMONTH(ACHAT!L428,-1)+1","v":{"$error":"#NUM!"}}]
[null,{"$f":"EOMONTH(VENTE!A429,-1)+1","v":{"$error":"#NUM!"}},{"$f":"EOMONTH(VENTE!I429,-1)+1","v":{"$error":"#NUM!"}},{"$f":"EOMONTH(ACHAT!M429,-1)+1","v":{"$error":"#NUM!"}},{"$f":"EOMONTH(ACHAT!L429,-1)+1","v":{"$error":"#NUM!"}}]
[null,{"$f":"EOMONTH(VENTE!A430,-1)+1","v":{"$error":"#NUM!"}},{"$f":"EOMONTH(VENTE!I430,-1)+1","v":{"$error":"#NUM!"}},{"$f":"EOMONTH(ACHAT!M430,-1)+1","v":{"$error":"#NUM!"}},{"$f":"EOMONTH(ACHAT!L430,-1)+1","v":{"$error":"#NUM!"}}]
[null,{"$f":"EOMONTH(VENTE!A431,-1)+1","v":{"$error":"#NUM!"}},{"$f":"EOMONTH(VENTE!I431,-1)+1","v":{"$error":"#NUM!"}},{"$f":"EOMONTH(ACHAT!M431,-1)+1","v":{"$error":"#NUM!"}},{"$f":"EOMONTH(ACHAT!L431,-1)+1","v":{"$error":"#NUM!"}}]
[null,{"$f":"EOMONTH(VENTE!A432,-1)+1","v":{"$error":"#NUM!"}},{"$f":"EOMONTH(VENTE!I432,-1)+1","v":{"$error":"#NUM!"}},{"$f":"EOMONTH(ACHAT!M432,-1)+1","v":{"$error":"#NUM!"}},{"$f":"EOMONTH(ACHAT!L432,-1)+1","v":{"$error":"#NUM!"}}]
[null,{"$f":"EOMONTH(VENTE!A433,-1)+1","v":{"$error":"#NUM!"}},{"$f":"EOMONTH(VENTE!I433,-1)+1","v":{"$error":"#NUM!"}},{"$f":"EOMONTH(ACHAT!M433,-1)+1","v":{"$error":"#NUM!"}},{"$f":"EOMONTH(ACHAT!L433,-1)+1","v":{"$error":"#NUM!"}}]
[null,{"$f":"EOMONTH(VENTE!A434,-1)+1","v":{"$error":"#NUM!"}},{"$f":"EOMONTH(VENTE!I434,-1)+1","v":{"$error":"#NUM!"}},{"$f":"EOMONTH(ACHAT!M434,-1)+1","v":{"$error":"#NUM!"}},{"$f":"EOMONTH(ACHAT!L434,-1)+1","v":{"$error":"#NUM!"}}]
[null,{"$f":"EOMONTH(VENTE!A435,-1)+1","v":{"$error":"#NUM!"}},{"$f":"EOMONTH(VENTE!I435,-1)+1","v":{"$error":"#NUM!"}},{"$f":"EOMONTH(ACHAT!M435,-1)+1","v":{"$error":"#NUM!"}},{"$f":"EOMONTH(ACHAT!L435,-1)+1","v":{"$error":"#NUM!"}}]
[null,{"$f":"EOMONTH(VENTE!A436,-1)+1","v":{"$error":"#NUM!"}},{"$f":"EOMONTH(VENTE!I436,-1)+1","v":{"$error":"#NUM!"}},{"$f":"EOMONTH(ACHAT!M436,-1)+1","v":{"$error":"#NUM!"}},{"$f":"EOMONTH(ACHAT!L436,-1)+1","v":{"$error":"#NUM!"}}]
[null,{"$f":"EOMONTH(VENTE!A437,-1)+1","v":{"$error":"#NUM!"}},{"$f":"EOMONTH(VENTE!I437,-1)+1","v":{"$error":"#NUM!"}},{"$f":"EOMONTH(ACHAT!M437,-1)+1","v":{"$error":"#NUM!"}},{"$f":"EOMONTH(ACHAT!L437,-1)+1","v":{"$error":"#NUM!"}}]
[null,{"$f":"EOMONTH(VENTE!A438,-1)+1","v":{"$error":"#NUM!"}},{"$f":"EOMONTH(VENTE!I438,-1)+1","v":{"$error":"#NUM!"}},{"$f":"EOMONTH(ACHAT!M438,-1)+1","v":{"$error":"#NUM!"}},{"$f":"EOMONTH(ACHAT!L438,-1)+1","v":{"$error":"#NUM!"}}]
[null,{"$f":"EOMONTH(VENTE!A439,-1)+1","v":{"$error":"#NUM!"}},{"$f":"EOMONTH(VENTE!I439,-1)+1","v":{"$error":"#NUM!"}},{"$f":"EOMONTH(ACHAT!M439,-1)+1","v":{"$error":"#NUM!"}},{"$f":"EOMONTH(ACHAT!L439,-1)+1","v":{"$error":"#NUM!"}}]
[null,{"$f":"EOMONTH(VENTE!A440,-1)+1","v":{"$error":"#NUM!"}},{"$f":"EOMONTH(VENTE!I440,-1)+1","v":{"$error":"#NUM!"}},{"$f":"EOMONTH(ACHAT!M440,-1)+1","v":{"$error":"#NUM!"}},{"$f":"EOMONTH(ACHAT!L440,-1)+1","v":{"$error":"#NUM!"}}]
[null,{"$f":"EOMONTH(VENTE!A441,-1)+1","v":{"$error":"#NUM!"}},{"$f":"EOMONTH(VENTE!I441,-1)+1","v":{"$error":"#NUM!"}},{"$f":"EOMONTH(ACHAT!M441,-1)+1","v":{"$error":"#NUM!"}},{"$f":"EOMONTH(ACHAT!L441,-1)+1","v":{"$error":"#NUM!"}}]
[null,{"$f":"EOMONTH(VENTE!A442,-1)+1","v":{"$error":"#NUM!"}},{"$f":"EOMONTH(VENTE!I442,-1)+1","v":{"$error":"#NUM!"}},{"$f":"EOMONTH(ACHAT!M442,-1)+1","v":{"$error":"#NUM!"}},{"$f":"EOMONTH(ACHAT!L442,-1)+1","v":{"$error":"#NUM!"}}]
[null,{"$f":"EOMONTH(VENTE!A443,-1)+1","v":{"$error":"#NUM!"}},{"$f":"EOMONTH(VENTE!I443,-1)+1","v":{"$error":"#NUM!"}},{"$f":"EOMONTH(ACHAT!M443,-1)+1","v":{"$error":"#NUM!"}},{"$f":"EOMONTH(ACHAT!L443,-1)+1","v":{"$error":"#NUM!"}}]
[null,{"$f":"EOMONTH(VENTE!A444,-1)+1","v":{"$error":"#NUM!"}},{"$f":"EOMONTH(VENTE!I444,-1)+1","v":{"$error":"#NUM!"}},{"$f":"EOMONTH(ACHAT!M444,-1)+1","v":{"$error":"#NUM!"}},{"$f":"EOMONTH(ACHAT!L444,-1)+1","v":{"$error":"#NUM!"}}]
[null,{"$f":"EOMONTH(VENTE!A445,-1)+1","v":{"$error":"#NUM!"}},{"$f":"EOMONTH(VENTE!I445,-1)+1","v":{"$error":"#NUM!"}},{"$f":"EOMONTH(ACHAT!M445,-1)+1","v":{"$error":"#NUM!"}},{"$f":"EOMONTH(ACHAT!L445,-1)+1","v":{"$error":"#NUM!"}}]
[null,{"$f":"EOMONTH(VENTE!A446,-1)+1","v":{"$error":"#NUM!"}},{"$f":"EOMONTH(VENTE!I446,-1)+1","v":{"$error":"#NUM!"}},{"$f":"EOMONTH(ACHAT!M446,-1)+1","v":{"$error":"#NUM!"}},{"$f":"EOMONTH(ACHAT!L446,-1)+1","v":{"$error":"#NUM!"}}]
[null,{"$f":"EOMONTH(VENTE!A447,-1)+1","v":{"$error":"#NUM!"}},{"$f":"EOMONTH(VENTE!I447,-1)+1","v":{"$error":"#NUM!"}},{"$f":"EOMONTH(ACHAT!M447,-1)+1","v":{"$error":"#NUM!"}},{"$f":"EOMONTH(ACHAT!L447,-1)+1","v":{"$error":"#NUM!"}}]
[null,{"$f":"EOMONTH(VENTE!A448,-1)+1","v":{"$error":"#NUM!"}},{"$f":"EOMONTH(VENTE!I448,-1)+1","v":{"$error":"#NUM!"}},{"$f":"EOMONTH(ACHAT!M448,-1)+1","v":{"$error":"#NUM!"}},{"$f":"EOMONTH(ACHAT!L448,-1)+1","v":{"$error":"#NUM!"}}]
[null,{"$f":"EOMONTH(VENTE!A449,-1)+1","v":{"$error":"#NUM!"}},{"$f":"EOMONTH(VENTE!I449,-1)+1","v":{"$error":"#NUM!"}},{"$f":"EOMONTH(ACHAT!M449,-1)+1","v":{"$error":"#NUM!"}},{"$f":"EOMONTH(ACHAT!L449,-1)+1","v":{"$error":"#NUM!"}}]
[null,{"$f":"EOMONTH(VENTE!A450,-1)+1","v":{"$error":"#NUM!"}},{"$f":"EOMONTH(VENTE!I450,-1)+1","v":{"$error":"#NUM!"}},{"$f":"EOMONTH(ACHAT!M450,-1)+1","v":{"$error":"#NUM!"}},{"$f":"EOMONTH(ACHAT!L450,-1)+1","v":{"$error":"#NUM!"}}]
[null,{"$f":"EOMONTH(VENTE!A451,-1)+1","v":{"$error":"#NUM!"}},{"$f":"EOMONTH(VENTE!I451,-1)+1","v":{"$error":"#NUM!"}},{"$f":"EOMONTH(ACHAT!M451,-1)+1","v":{"$error":"#NUM!"}},{"$f":"EOMONTH(ACHAT!L451,-1)+1","v":{"$error":"#NUM!"}}]
[null,{"$f":"EOMONTH(VENTE!A452,-1)+1","v":{"$error":"#NUM!"}},{"$f":"EOMONTH(VENTE!I452,-1)+1","v":{"$error":"#NUM!"}},{"$f":"EOMONTH(ACHAT!M452,-1)+1","v":{"$error":"#NUM!"}},{"$f":"EOMONTH(ACHAT!L452,-1)+1","v":{"$error":"#NUM!"}}]
[null,{"$f":"EOMONTH(VENTE!A453,-1)+1","v":{"$error":"#NUM!"}},{"$f":"EOMONTH(VENTE!I453,-1)+1","v":{"$error":"#NUM!"}},{"$f":"EOMONTH(ACHAT!M453,-1)+1","v":{"$error":"#NUM!"}},{"$f":"EOMONTH(ACHAT!L453,-1)+1","v":{"$error":"#NUM!"}}]
[null,{"$f":"EOMONTH(VENTE!A454,-1)+1","v":{"$error":"#NUM!"}},{"$f":"EOMONTH(VENTE!I454,-1)+1","v":{"$error":"#NUM!"}},{"$f":"EOMONTH(ACHAT!M454,-1)+1","v":{"$error":"#NUM!"}},{"$f":"EOMONTH(ACHAT!L454,-1)+1","v":{"$error":"#NUM!"}}]
[null,{"$f":"EOMONTH(VENTE!A455,-1)+1","v":{"$error":"#NUM!"}},{"$f":"EOMONTH(VENTE!I455,-1)+1","v":{"$error":"#NUM!"}},{"$f":"EOMONTH(ACHAT!M455,-1)+1","v":{"$error":"#NUM!"}},{"$f":"EOMONTH(ACHAT!L455,-1)+1","v":{"$error":"#NUM!"}}]
[null,{"$f":"EOMONTH(VENTE!A456,-1)+1","v":{"$error":"#NUM!"}},{"$f":"EOMONTH(VENTE!I456,-1)+1","v":{"$error":"#NUM!"}},{"$f":"EOMONTH(ACHAT!M456,-1)+1","v":{"$error":"#NUM!"}},{"$f":"EOMONTH(ACHAT!L456,-1)+1","v":{"$error":"#NUM!"}}]
[null,{"$f":"EOMONTH(VENTE!A457,-1)+1","v":{"$error":"#NUM!"}},{"$f":"EOMONTH(VENTE!I457,-1)+1","v":{"$error":"#NUM!"}},{"$f":"EOMONTH(ACHAT!M457,-1)+1","v":{"$error":"#NUM!"}},{"$f":"EOMONTH(ACHAT!L457,-1)+1","v":{"$error":"#NUM!"}}]
[null,{"$f":"EOMONTH(VENTE!A458,-1)+1","v":{"$error":"#NUM!"}},{"$f":"EOMONTH(VENTE!I458,-1)+1","v":{"$error":"#NUM!"}},{"$f":"EOMONTH(ACHAT!M458,-1)+1","v":{"$error":"#NUM!"}},{"$f":"EOMONTH(ACHAT!L458,-1)+1","v":{"$error":"#NUM!"}}]
[null,{"$f":"EOMONTH(VENTE!A459,-1)+1","v":{"$error":"#NUM!"}},{"$f":"EOMONTH(VENTE!I459,-1)+1","v":{"$error":"#NUM!"}},{"$f":"EOMONTH(ACHAT!M459,-1)+1","v":{"$error":"#NUM!"}},{"$f":"EOMONTH(ACHAT!L459,-1)+1","v":{"$error":"#NUM!"}}]
[null,{"$f":"EOMONTH(VENTE!A460,-1)+1","v":{"$error":"#NUM!"}},{"$f":"EOMONTH(VENTE!I460,-1)+1","v":{"$error":"#NUM!"}},{"$f":"EOMONTH(ACHAT!M460,-1)+1","v":{"$error":"#NUM!"}},{"$f":"EOMONTH(ACHAT!L460,-1)+1","v":{"$error":"#NUM!"}}]
[null,{"$f":"EOMONTH(VENTE!A461,-1)+1","v":{"$error":"#NUM!"}},{"$f":"EOMONTH(VENTE!I461,-1)+1","v":{"$error":"#NUM!"}},{"$f":"EOMONTH(ACHAT!M461,-1)+1","v":{"$error":"#NUM!"}},{"$f":"EOMONTH(ACHAT!L461,-1)+1","v":{"$error":"#NUM!"}}]
[null,{"$f":"EOMONTH(VENTE!A462,-1)+1","v":{"$error":"#NUM!"}},{"$f":"EOMONTH(VENTE!I462,-1)+1","v":{"$error":"#NUM!"}},{"$f":"EOMONTH(ACHAT!M462,-1)+1","v":{"$error":"#NUM!"}},{"$f":"EOMONTH(ACHAT!L462,-1)+1","v":{"$error":"#NUM!"}}]
[null,{"$f":"EOMONTH(VENTE!A463,-1)+1","v":{"$error":"#NUM!"}},{"$f":"EOMONTH(VENTE!I463,-1)+1","v":{"$error":"#NUM!"}},{"$f":"EOMONTH(ACHAT!M463,-1)+1","v":{"$error":"#NUM!"}},{"$f":"EOMONTH(ACHAT!L463,-1)+1","v":{"$error":"#NUM!"}}]
[null,{"$f":"EOMONTH(VENTE!A464,-1)+1","v":{"$error":"#NUM!"}},{"$f":"EOMONTH(VENTE!I464,-1)+1","v":{"$error":"#NUM!"}},{"$f":"EOMONTH(ACHAT!M464,-1)+1","v":{"$error":"#NUM!"}},{"$f":"EOMONTH(ACHAT!L464,-1)+1","v":{"$error":"#NUM!"}}]
[null,{"$f":"EOMONTH(VENTE!A465,-1)+1","v":{"$error":"#NUM!"}},{"$f":"EOMONTH(VENTE!I465,-1)+1","v":{"$error":"#NUM!"}},{"$f":"EOMONTH(ACHAT!M465,-1)+1","v":{"$error":"#NUM!"}},{"$f":"EOMONTH(ACHAT!L465,-1)+1","v":{"$error":"#NUM!"}}]
[null,{"$f":"EOMONTH(VENTE!A466,-1)+1","v":{"$error":"#NUM!"}},{"$f":"EOMONTH(VENTE!I466,-1)+1","v":{"$error":"#NUM!"}},{"$f":"EOMONTH(ACHAT!M466,-1)+1","v":{"$error":"#NUM!"}},{"$f":"EOMONTH(ACHAT!L466,-1)+1","v":{"$error":"#NUM!"}}]
[null,{"$f":"EOMONTH(VENTE!A467,-1)+1","v":{"$error":"#NUM!"}},{"$f":"EOMONTH(VENTE!I467,-1)+1","v":{"$error":"#NUM!"}},{"$f":"EOMONTH(ACHAT!M467,-1)+1","v":{"$error":"#NUM!"}},{"$f":"EOMONTH(ACHAT!L467,-1)+1","v":{"$error":"#NUM!"}}]
[null,{"$f":"EOMONTH(VENTE!A468,-1)+1","v":{"$error":"#NUM!"}},{"$f":"EOMONTH(VENTE!I468,-1)+1","v":{"$error":"#NUM!"}},{"$f":"EOMONTH(ACHAT!M468,-1)+1","v":{"$error":"#NUM!"}},{"$f":"EOMONTH(ACHAT!L468,-1)+1","v":{"$error":"#NUM!"}}]
[null,{"$f":"EOMONTH(VENTE!A469,-1)+1","v":{"$error":"#NUM!"}},{"$f":"EOMONTH(VENTE!I469,-1)+1","v":{"$error":"#NUM!"}},{"$f":"EOMONTH(ACHAT!M469,-1)+1","v":{"$error":"#NUM!"}},{"$f":"EOMONTH(ACHAT!L469,-1)+1","v":{"$error":"#NUM!"}}]
[null,{"$f":"EOMONTH(VENTE!A470,-1)+1","v":{"$error":"#NUM!"}},{"$f":"EOMONTH(VENTE!I470,-1)+1","v":{"$error":"#NUM!"}},{"$f":"EOMONTH(ACHAT!M470,-1)+1","v":{"$error":"#NUM!"}},{"$f":"EOMONTH(ACHAT!L470,-1)+1","v":{"$error":"#NUM!"}}]
[null,{"$f":"EOMONTH(VENTE!A471,-1)+1","v":{"$error":"#NUM!"}},{"$f":"EOMONTH(VENTE!I471,-1)+1","v":{"$error":"#NUM!"}},{"$f":"EOMONTH(ACHAT!M471,-1)+1","v":{"$error":"#NUM!"}},{"$f":"EOMONTH(ACHAT!L471,-1)+1","v":{"$error":"#NUM!"}}]
[null,{"$f":"EOMONTH(VENTE!A472,-1)+1","v":{"$error":"#NUM!"}},{"$f":"EOMONTH(VENTE!I472,-1)+1","v":{"$error":"#NUM!"}},{"$f":"EOMONTH(ACHAT!M472,-1)+1","v":{"$error":"#NUM!"}},{"$f":"EOMONTH(ACHAT!L472,-1)+1","v":{"$error":"#NUM!"}}]
[null,{"$f":"EOMONTH(VENTE!A473,-1)+1","v":{"$error":"#NUM!"}},{"$f":"EOMONTH(VENTE!I473,-1)+1","v":{"$error":"#NUM!"}},{"$f":"EOMONTH(ACHAT!M473,-1)+1","v":{"$error":"#NUM!"}},{"$f":"EOMONTH(ACHAT!L473,-1)+1","v":{"$error":"#NUM!"}}]
[null,{"$f":"EOMONTH(VENTE!A474,-1)+1","v":{"$error":"#NUM!"}},{"$f":"EOMONTH(VENTE!I474,-1)+1","v":{"$error":"#NUM!"}},{"$f":"EOMONTH(ACHAT!M474,-1)+1","v":{"$error":"#NUM!"}},{"$f":"EOMONTH(ACHAT!L474,-1)+1","v":{"$error":"#NUM!"}}]
[null,{"$f":"EOMONTH(VENTE!A475,-1)+1","v":{"$error":"#NUM!"}},{"$f":"EOMONTH(VENTE!I475,-1)+1","v":{"$error":"#NUM!"}},{"$f":"EOMONTH(ACHAT!M475,-1)+1","v":{"$error":"#NUM!"}},{"$f":"EOMONTH(ACHAT!L475,-1)+1","v":{"$error":"#NUM!"}}]
[null,{"$f":"EOMONTH(VENTE!A476,-1)+1","v":{"$error":"#NUM!"}},{"$f":"EOMONTH(VENTE!I476,-1)+1","v":{"$error":"#NUM!"}},{"$f":"EOMONTH(ACHAT!M476,-1)+1","v":{"$error":"#NUM!"}},{"$f":"EOMONTH(ACHAT!L476,-1)+1","v":{"$error":"#NUM!"}}]
[null,{"$f":"EOMONTH(VENTE!A477,-1)+1","v":{"$error":"#NUM!"}},{"$f":"EOMONTH(VENTE!I477,-1)+1","v":{"$error":"#NUM!"}},{"$f":"EOMONTH(ACHAT!M477,-1)+1","v":{"$error":"#NUM!"}},{"$f":"EOMONTH(ACHAT!L477,-1)+1","v":{"$error":"#NUM!"}}]
[null,{"$f":"EOMONTH(VENTE!A478,-1)+1","v":{"$error":"#NUM!"}},{"$f":"EOMONTH(VENTE!I478,-1)+1","v":{"$error":"#NUM!"}},{"$f":"EOMONTH(ACHAT!M478,-1)+1","v":{"$error":"#NUM!"}},{"$f":"EOMONTH(ACHAT!L478,-1)+1","v":{"$error":"#NUM!"}}]
[null,{"$f":"EOMONTH(VENTE!A479,-1)+1","v":{"$error":"#NUM!"}},{"$f":"EOMONTH(VENTE!I479,-1)+1","v":{"$error":"#NUM!"}},{"$f":"EOMONTH(ACHAT!M479,-1)+1","v":{"$error":"#NUM!"}},{"$f":"EOMONTH(ACHAT!L479,-1)+1","v":{"$error":"#NUM!"}}]
[null,{"$f":"EOMONTH(VENTE!A480,-1)+1","v":{"$error":"#NUM!"}},{"$f":"EOMONTH(VENTE!I480,-1)+1","v":{"$error":"#NUM!"}},{"$f":"EOMONTH(ACHAT!M480,-1)+1","v":{"$error":"#NUM!"}},{"$f":"EOMONTH(ACHAT!L480,-1)+1","v":{"$error":"#NUM!"}}]
[null,{"$f":"EOMONTH(VENTE!A481,-1)+1","v":{"$error":"#NUM!"}},{"$f":"EOMONTH(VENTE!I481,-1)+1","v":{"$error":"#NUM!"}},{"$f":"EOMONTH(ACHAT!M481,-1)+1","v":{"$error":"#NUM!"}},{"$f":"EOMONTH(ACHAT!L481,-1)+1","v":{"$error":"#NUM!"}}]
[null,{"$f":"EOMONTH(VENTE!A482,-1)+1","v":{"$error":"#NUM!"}},{"$f":"EOMONTH(VENTE!I482,-1)+1","v":{"$error":"#NUM!"}},{"$f":"EOMONTH(ACHAT!M482,-1)+1","v":{"$error":"#NUM!"}},{"$f":"EOMONTH(ACHAT!L482,-1)+1","v":{"$error":"#NUM!"}}]
[null,{"$f":"EOMONTH(VENTE!A483,-1)+1","v":{"$error":"#NUM!"}},{"$f":"EOMONTH(VENTE!I483,-1)+1","v":{"$error":"#NUM!"}},{"$f":"EOMONTH(ACHAT!M483,-1)+1","v":{"$error":"#NUM!"}},{"$f":"EOMONTH(ACHAT!L483,-1)+1","v":{"$error":"#NUM!"}}]
[null,{"$f":"EOMONTH(VENTE!A484,-1)+1","v":{"$error":"#NUM!"}},{"$f":"EOMONTH(VENTE!I484,-1)+1","v":{"$error":"#NUM!"}},{"$f":"EOMONTH(ACHAT!M484,-1)+1","v":{"$error":"#NUM!"}},{"$f":"EOMONTH(ACHAT!L484,-1)+1","v":{"$error":"#NUM!"}}]
[null,{"$f":"EOMONTH(VENTE!A485,-1)+1","v":{"$error":"#NUM!"}},{"$f":"EOMONTH(VENTE!I485,-1)+1","v":{"$error":"#NUM!"}},{"$f":"EOMONTH(ACHAT!M485,-1)+1","v":{"$error":"#NUM!"}},{"$f":"EOMONTH(ACHAT!L485,-1)+1","v":{"$error":"#NUM!"}}]
[null,{"$f":"EOMONTH(VENTE!A486,-1)+1","v":{"$error":"#NUM!"}},{"$f":"EOMONTH(VENTE!I486,-1)+1","v":{"$error":"#NUM!"}},{"$f":"EOMONTH(ACHAT!M486,-1)+1","v":{"$error":"#NUM!"}},{"$f":"EOMONTH(ACHAT!L486,-1)+1","v":{"$error":"#NUM!"}}]
[null,{"$f":"EOMONTH(VENTE!A487,-1)+1","v":{"$error":"#NUM!"}},{"$f":"EOMONTH(VENTE!I487,-1)+1","v":{"$error":"#NUM!"}},{"$f":"EOMONTH(ACHAT!M487,-1)+1","v":{"$error":"#NUM!"}},{"$f":"EOMONTH(ACHAT!L487,-1)+1","v":{"$error":"#NUM!"}}]
[null,{"$f":"EOMONTH(VENTE!A488,-1)+1","v":{"$error":"#NUM!"}},{"$f":"EOMONTH(VENTE!I488,-1)+1","v":{"$error":"#NUM!"}},{"$f":"EOMONTH(ACHAT!M488,-1)+1","v":{"$error":"#NUM!"}},{"$f":"EOMONTH(ACHAT!L488,-1)+1","v":{"$error":"#NUM!"}}]
[null,{"$f":"EOMONTH(VENTE!A489,-1)+1","v":{"$error":"#NUM!"}},{"$f":"EOMONTH(VENTE!I489,-1)+1","v":{"$error":"#NUM!"}},{"$f":"EOMONTH(ACHAT!M489,-1)+1","v":{"$error":"#NUM!"}},{"$f":"EOMONTH(ACHAT!L489,-1)+1","v":{"$error":"#NUM!"}}]
[null,{"$f":"EOMONTH(VENTE!A490,-1)+1","v":{"$error":"#NUM!"}},{"$f":"EOMONTH(VENTE!I490,-1)+1","v":{"$error":"#NUM!"}},{"$f":"EOMONTH(ACHAT!M490,-1)+1","v":{"$error":"#NUM!"}},{"$f":"EOMONTH(ACHAT!L490,-1)+1","v":{"$error":"#NUM!"}}]
[null,{"$f":"EOMONTH(VENTE!A491,-1)+1","v":{"$error":"#NUM!"}},{"$f":"EOMONTH(VENTE!I491,-1)+1","v":{"$error":"#NUM!"}},{"$f":"EOMONTH(ACHAT!M491,-1)+1","v":{"$error":"#NUM!"}},{"$f":"EOMONTH(ACHAT!L491,-1)+1","v":{"$error":"#NUM!"}}]
[null,{"$f":"EOMONTH(VENTE!A492,-1)+1","v":{"$error":"#NUM!"}},{"$f":"EOMONTH(VENTE!I492,-1)+1","v":{"$error":"#NUM!"}},{"$f":"EOMONTH(ACHAT!M492,-1)+1","v":{"$error":"#NUM!"}},{"$f":"EOMONTH(ACHAT!L492,-1)+1","v":{"$error":"#NUM!"}}]
[null,{"$f":"EOMONTH(VENTE!A493,-1)+1","v":{"$error":"#NUM!"}},{"$f":"EOMONTH(VENTE!I493,-1)+1","v":{"$error":"#NUM!"}},{"$f":"EOMONTH(ACHAT!M493,-1)+1","v":{"$error":"#NUM!"}},{"$f":"EOMONTH(ACHAT!L493,-1)+1","v":{"$error":"#NUM!"}}]
[null,{"$f":"EOMONTH(VENTE!A494,-1)+1","v":{"$error":"#NUM!"}},{"$f":"EOMONTH(VENTE!I494,-1)+1","v":{"$error":"#NUM!"}},{"$f":"EOMONTH(ACHAT!M494,-1)+1","v":{"$error":"#NUM!"}},{"$f":"EOMONTH(ACHAT!L494,-1)+1","v":{"$error":"#NUM!"}}]
[null,{"$f":"EOMONTH(VENTE!A495,-1)+1","v":{"$error":"#NUM!"}},{"$f":"EOMONTH(VENTE!I495,-1)+1","v":{"$error":"#NUM!"}},{"$f":"EOMONTH(ACHAT!M495,-1)+1","v":{"$error":"#NUM!"}},{"$f":"EOMONTH(ACHAT!L495,-1)+1","v":{"$error":"#NUM!"}}]
[null,{"$f":"EOMONTH(VENTE!A496,-1)+1","v":{"$error":"#NUM!"}},{"$f":"EOMONTH(VENTE!I496,-1)+1","v":{"$error":"#NUM!"}},{"$f":"EOMONTH(ACHAT!M496,-1)+1","v":{"$error":"#NUM!"}},{"$f":"EOMONTH(ACHAT!L496,-1)+1","v":{"$error":"#NUM!"}}]
[null,{"$f":"EOMONTH(VENTE!A497,-1)+1","v":{"$error":"#NUM!"}},{"$f":"EOMONTH(VENTE!I497,-1)+1","v":{"$error":"#NUM!"}},{"$f":"EOMONTH(ACHAT!M497,-1)+1","v":{"$error":"#NUM!"}},{"$f":"EOMONTH(ACHAT!L497,-1)+1","v":{"$error":"#NUM!"}}]
[null,{"$f":"EOMONTH(VENTE!A498,-1)+1","v":{"$error":"#NUM!"}},{"$f":"EOMONTH(VENTE!I498,-1)+1","v":{"$error":"#NUM!"}},{"$f":"EOMONTH(ACHAT!M498,-1)+1","v":{"$error":"#NUM!"}},{"$f":"EOMONTH(ACHAT!L498,-1)+1","v":{"$error":"#NUM!"}}]
[null,{"$f":"EOMONTH(VENTE!A499,-1)+1","v":{"$error":"#NUM!"}},{"$f":"EOMONTH(VENTE!I499,-1)+1","v":{"$error":"#NUM!"}},{"$f":"EOMONTH(ACHAT!M499,-1)+1","v":{"$error":"#NUM!"}},{"$f":"EOMONTH(ACHAT!L499,-1)+1","v":{"$error":"#NUM!"}}]
[null,{"$f":"EOMONTH(VENTE!A500,-1)+1","v":{"$error":"#NUM!"}},{"$f":"EOMONTH(VENTE!I500,-1)+1","v":{"$error":"#NUM!"}},{"$f":"EOMONTH(ACHAT!M500,-1)+1","v":{"$error":"#NUM!"}},{"$f":"EOMONTH(ACHAT!L500,-1)+1","v":{"$error":"#NUM!"}}]
[null,{"$f":"EOMONTH(VENTE!A501,-1)+1","v":{"$error":"#NUM!"}},{"$f":"EOMONTH(VENTE!I501,-1)+1","v":{"$error":"#NUM!"}},{"$f":"EOMONTH(ACHAT!M501,-1)+1","v":{"$error":"#NUM!"}},{"$f":"EOMONTH(ACHAT!L501,-1)+1","v":{"$error":"#NUM!"}}]
[null,{"$f":"EOMONTH(VENTE!A502,-1)+1","v":{"$error":"#NUM!"}},{"$f":"EOMONTH(VENTE!I502,-1)+1","v":{"$error":"#NUM!"}},{"$f":"EOMONTH(ACHAT!M502,-1)+1","v":{"$error":"#NUM!"}},{"$f":"EOMONTH(ACHAT!L502,-1)+1","v":{"$error":"#NUM!"}}]
[null,{"$f":"EOMONTH(VENTE!A503,-1)+1","v":{"$error":"#NUM!"}},{"$f":"EOMONTH(VENTE!I503,-1)+1","v":{"$error":"#NUM!"}},{"$f":"EOMONTH(ACHAT!M503,-1)+1","v":{"$error":"#NUM!"}},{"$f":"EOMONTH(ACHAT!L503,-1)+1","v":{"$error":"#NUM!"}}]
[null,{"$f":"EOMONTH(VENTE!A504,-1)+1","v":{"$error":"#NUM!"}},{"$f":"EOMONTH(VENTE!I504,-1)+1","v":{"$error":"#NUM!"}},{"$f":"EOMONTH(ACHAT!M504,-1)+1","v":{"$error":"#NUM!"}},{"$f":"EOMONTH(ACHAT!L504,-1)+1","v":{"$error":"#NUM!"}}]
[null,{"$f":"EOMONTH(VENTE!A505,-1)+1","v":{"$error":"#NUM!"}},{"$f":"EOMONTH(VENTE!I505,-1)+1","v":{"$error":"#NUM!"}},{"$f":"EOMONTH(ACHAT!M505,-1)+1","v":{"$error":"#NUM!"}},{"$f":"EOMONTH(ACHAT!L505,-1)+1","v":{"$error":"#NUM!"}}]
[null,{"$f":"EOMONTH(VENTE!A506,-1)+1","v":{"$error":"#NUM!"}},{"$f":"EOMONTH(VENTE!I506,-1)+1","v":{"$error":"#NUM!"}},{"$f":"EOMONTH(ACHAT!M506,-1)+1","v":{"$error":"#NUM!"}},{"$f":"EOMONTH(ACHAT!L506,-1)+1","v":{"$error":"#NUM!"}}]
[null,{"$f":"EOMONTH(VENTE!A507,-1)+1","v":{"$error":"#NUM!"}},{"$f":"EOMONTH(VENTE!I507,-1)+1","v":{"$error":"#NUM!"}},{"$f":"EOMONTH(ACHAT!M507,-1)+1","v":{"$error":"#NUM!"}},{"$f":"EOMONTH(ACHAT!L507,-1)+1","v":{"$error":"#NUM!"}}]
[null,{"$f":"EOMONTH(VENTE!A508,-1)+1","v":{"$error":"#NUM!"}},{"$f":"EOMONTH(VENTE!I508,-1)+1","v":{"$error":"#NUM!"}},{"$f":"EOMONTH(ACHAT!M508,-1)+1","v":{"$error":"#NUM!"}},{"$f":"EOMONTH(ACHAT!L508,-1)+1","v":{"$error":"#NUM!"}}]
[null,{"$f":"EOMONTH(VENTE!A509,-1)+1","v":{"$error":"#NUM!"}},{"$f":"EOMONTH(VENTE!I509,-1)+1","v":{"$error":"#NUM!"}},{"$f":"EOMONTH(ACHAT!M509,-1)+1","v":{"$error":"#NUM!"}},{"$f":"EOMONTH(ACHAT!L509,-1)+1","v":{"$error":"#NUM!"}}]
[null,{"$f":"EOMONTH(VENTE!A510,-1)+1","v":{"$error":"#NUM!"}},{"$f":"EOMONTH(VENTE!I510,-1)+1","v":{"$error":"#NUM!"}},{"$f":"EOMONTH(ACHAT!M510,-1)+1","v":{"$error":"#NUM!"}},{"$f":"EOMONTH(ACHAT!L510,-1)+1","v":{"$error":"#NUM!"}}]
[null,{"$f":"EOMONTH(VENTE!A511,-1)+1","v":{"$error":"#NUM!"}},{"$f":"EOMONTH(VENTE!I511,-1)+1","v":{"$error":"#NUM!"}},{"$f":"EOMONTH(ACHAT!M511,-1)+1","v":{"$error":"#NUM!"}},{"$f":"EOMONTH(ACHAT!L511,-1)+1","v":{"$error":"#NUM!"}}]
[null,{"$f":"EOMONTH(VENTE!A512,-1)+1","v":{"$error":"#NUM!"}},{"$f":"EOMONTH(VENTE!I512,-1)+1","v":{"$error":"#NUM!"}},{"$f":"EOMONTH(ACHAT!M512,-1)+1","v":{"$error":"#NUM!"}},{"$f":"EOMONTH(ACHAT!L512,-1)+1","v":{"$error":"#NUM!"}}]
[null,{"$f":"EOMONTH(VENTE!A513,-1)+1","v":{"$error":"#NUM!"}},{"$f":"EOMONTH(VENTE!I513,-1)+1","v":{"$error":"#NUM!"}},{"$f":"EOMONTH(ACHAT!M513,-1)+1","v":{"$error":"#NUM!"}},{"$f":"EOMONTH(ACHAT!L513,-1)+1","v":{"$error":"#NUM!"}}]
[null,{"$f":"EOMONTH(VENTE!A514,-1)+1","v":{"$error":"#NUM!"}},{"$f":"EOMONTH(VENTE!I514,-1)+1","v":{"$error":"#NUM!"}},{"$f":"EOMONTH(ACHAT!M514,-1)+1","v":{"$error":"#NUM!"}},{"$f":"EOMONTH(ACHAT!L514,-1)+1","v":{"$error":"#NUM!"}}]
[null,{"$f":"EOMONTH(VENTE!A515,-1)+1","v":{"$error":"#NUM!"}},{"$f":"EOMONTH(VENTE!I515,-1)+1","v":{"$error":"#NUM!"}},{"$f":"EOMONTH(ACHAT!M515,-1)+1","v":{"$error":"#NUM!"}},{"$f":"EOMONTH(ACHAT!L515,-1)+1","v":{"$error":"#NUM!"}}]
[null,{"$f":"EOMONTH(VENTE!A516,-1)+1","v":{"$error":"#NUM!"}},{"$f":"EOMONTH(VENTE!I516,-1)+1","v":{"$error":"#NUM!"}},{"$f":"EOMONTH(ACHAT!M516,-1)+1","v":{"$error":"#NUM!"}},{"$f":"EOMONTH(ACHAT!L516,-1)+1","v":{"$error":"#NUM!"}}]
[null,{"$f":"EOMONTH(VENTE!A517,-1)+1","v":{"$error":"#NUM!"}},{"$f":"EOMONTH(VENTE!I517,-1)+1","v":{"$error":"#NUM!"}},{"$f":"EOMONTH(ACHAT!M517,-1)+1","v":{"$error":"#NUM!"}},{"$f":"EOMONTH(ACHAT!L517,-1)+1","v":{"$error":"#NUM!"}}]
[null,{"$f":"EOMONTH(VENTE!A518,-1)+1","v":{"$error":"#NUM!"}},{"$f":"EOMONTH(VENTE!I518,-1)+1","v":{"$error":"#NUM!"}},{"$f":"EOMONTH(ACHAT!M518,-1)+1","v":{"$error":"#NUM!"}},{"$f":"EOMONTH(ACHAT!L518,-1)+1","v":{"$error":"#NUM!"}}]
[null,{"$f":"EOMONTH(VENTE!A519,-1)+1","v":{"$error":"#NUM!"}},{"$f":"EOMONTH(VENTE!I519,-1)+1","v":{"$error":"#NUM!"}},{"$f":"EOMONTH(ACHAT!M519,-1)+1","v":{"$error":"#NUM!"}},{"$f":"EOMONTH(ACHAT!L519,-1)+1","v":{"$error":"#NUM!"}}]
[null,{"$f":"EOMONTH(VENTE!A520,-1)+1","v":{"$error":"#NUM!"}},{"$f":"EOMONTH(VENTE!I520,-1)+1","v":{"$error":"#NUM!"}},{"$f":"EOMONTH(ACHAT!M520,-1)+1","v":{"$error":"#NUM!"}},{"$f":"EOMONTH(ACHAT!L520,-1)+1","v":{"$error":"#NUM!"}}]
[null,{"$f":"EOMONTH(VENTE!A521,-1)+1","v":{"$error":"#NUM!"}},{"$f":"EOMONTH(VENTE!I521,-1)+1","v":{"$error":"#NUM!"}},{"$f":"EOMONTH(ACHAT!M521,-1)+1","v":{"$error":"#NUM!"}},{"$f":"EOMONTH(ACHAT!L521,-1)+1","v":{"$error":"#NUM!"}}]
[null,{"$f":"EOMONTH(VENTE!A522,-1)+1","v":{"$error":"#NUM!"}},{"$f":"EOMONTH(VENTE!I522,-1)+1","v":{"$error":"#NUM!"}},{"$f":"EOMONTH(ACHAT!M522,-1)+1","v":{"$error":"#NUM!"}},{"$f":"EOMONTH(ACHAT!L522,-1)+1","v":{"$error":"#NUM!"}}]
[null,{"$f":"EOMONTH(VENTE!A523,-1)+1","v":{"$error":"#NUM!"}},{"$f":"EOMONTH(VENTE!I523,-1)+1","v":{"$error":"#NUM!"}},{"$f":"EOMONTH(ACHAT!M523,-1)+1","v":{"$error":"#NUM!"}},{"$f":"EOMONTH(ACHAT!L523,-1)+1","v":{"$error":"#NUM!"}}]
[null,{"$f":"EOMONTH(VENTE!A524,-1)+1","v":{"$error":"#NUM!"}},{"$f":"EOMONTH(VENTE!I524,-1)+1","v":{"$error":"#NUM!"}},{"$f":"EOMONTH(ACHAT!M524,-1)+1","v":{"$error":"#NUM!"}},{"$f":"EOMONTH(ACHAT!L524,-1)+1","v":{"$error":"#NUM!"}}]
[null,{"$f":"EOMONTH(VENTE!A525,-1)+1","v":{"$error":"#NUM!"}},{"$f":"EOMONTH(VENTE!I525,-1)+1","v":{"$error":"#NUM!"}},{"$f":"EOMONTH(ACHAT!M525,-1)+1","v":{"$error":"#NUM!"}},{"$f":"EOMONTH(ACHAT!L525,-1)+1","v":{"$error":"#NUM!"}}]
[null,{"$f":"EOMONTH(VENTE!A526,-1)+1","v":{"$error":"#NUM!"}},{"$f":"EOMONTH(VENTE!I526,-1)+1","v":{"$error":"#NUM!"}},{"$f":"EOMONTH(ACHAT!M526,-1)+1","v":{"$error":"#NUM!"}},{"$f":"EOMONTH(ACHAT!L526,-1)+1","v":{"$error":"#NUM!"}}]
[null,{"$f":"EOMONTH(VENTE!A527,-1)+1","v":{"$error":"#NUM!"}},{"$f":"EOMONTH(VENTE!I527,-1)+1","v":{"$error":"#NUM!"}},{"$f":"EOMONTH(ACHAT!M527,-1)+1","v":{"$error":"#NUM!"}},{"$f":"EOMONTH(ACHAT!L527,-1)+1","v":{"$error":"#NUM!"}}]
[null,{"$f":"EOMONTH(VENTE!A528,-1)+1","v":{"$error":"#NUM!"}},{"$f":"EOMONTH(VENTE!I528,-1)+1","v":{"$error":"#NUM!"}},{"$f":"EOMONTH(ACHAT!M528,-1)+1","v":{"$error":"#NUM!"}},{"$f":"EOMONTH(ACHAT!L528,-1)+1","v":{"$error":"#NUM!"}}]
[null,{"$f":"EOMONTH(VENTE!A529,-1)+1","v":{"$error":"#NUM!"}},{"$f":"EOMONTH(VENTE!I529,-1)+1","v":{"$error":"#NUM!"}},{"$f":"EOMONTH(ACHAT!M529,-1)+1","v":{"$error":"#NUM!"}},{"$f":"EOMONTH(ACHAT!L529,-1)+1","v":{"$error":"#NUM!"}}]
[null,{"$f":"EOMONTH(VENTE!A530,-1)+1","v":{"$error":"#NUM!"}},{"$f":"EOMONTH(VENTE!I530,-1)+1","v":{"$error":"#NUM!"}},{"$f":"EOMONTH(ACHAT!M530,-1)+1","v":{"$error":"#NUM!"}},{"$f":"EOMONTH(ACHAT!L530,-1)+1","v":{"$error":"#NUM!"}}]
[null,{"$f":"EOMONTH(VENTE!A531,-1)+1","v":{"$error":"#NUM!"}},{"$f":"EOMONTH(VENTE!I531,-1)+1","v":{"$error":"#NUM!"}},{"$f":"EOMONTH(ACHAT!M531,-1)+1","v":{"$error":"#NUM!"}},{"$f":"EOMONTH(ACHAT!L531,-1)+1","v":{"$error":"#NUM!"}}]
[null,{"$f":"EOMONTH(VENTE!A532,-1)+1","v":{"$error":"#NUM!"}},{"$f":"EOMONTH(VENTE!I532,-1)+1","v":{"$error":"#NUM!"}},{"$f":"EOMONTH(ACHAT!M532,-1)+1","v":{"$error":"#NUM!"}},{"$f":"EOMONTH(ACHAT!L532,-1)+1","v":{"$error":"#NUM!"}}]
[null,{"$f":"EOMONTH(VENTE!A533,-1)+1","v":{"$error":"#NUM!"}},{"$f":"EOMONTH(VENTE!I533,-1)+1","v":{"$error":"#NUM!"}},{"$f":"EOMONTH(ACHAT!M533,-1)+1","v":{"$error":"#NUM!"}},{"$f":"EOMONTH(ACHAT!L533,-1)+1","v":{"$error":"#NUM!"}}]
[null,{"$f":"EOMONTH(VENTE!A534,-1)+1","v":{"$error":"#NUM!"}},{"$f":"EOMONTH(VENTE!I534,-1)+1","v":{"$error":"#NUM!"}},{"$f":"EOMONTH(ACHAT!M534,-1)+1","v":{"$error":"#NUM!"}},{"$f":"EOMONTH(ACHAT!L534,-1)+1","v":{"$error":"#NUM!"}}]
[null,{"$f":"EOMONTH(VENTE!A535,-1)+1","v":{"$error":"#NUM!"}},{"$f":"EOMONTH(VENTE!I535,-1)+1","v":{"$error":"#NUM!"}},{"$f":"EOMONTH(ACHAT!M535,-1)+1","v":{"$error":"#NUM!"}},{"$f":"EOMONTH(ACHAT!L535,-1)+1","v":{"$error":"#NUM!"}}]
[null,{"$f":"EOMONTH(VENTE!A536,-1)+1","v":{"$error":"#NUM!"}},{"$f":"EOMONTH(VENTE!I536,-1)+1","v":{"$error":"#NUM!"}},{"$f":"EOMONTH(ACHAT!M536,-1)+1","v":{"$error":"#NUM!"}},{"$f":"EOMONTH(ACHAT!L536,-1)+1","v":{"$error":"#NUM!"}}]
[null,{"$f":"EOMONTH(VENTE!A537,-1)+1","v":{"$error":"#NUM!"}},{"$f":"EOMONTH(VENTE!I537,-1)+1","v":{"$error":"#NUM!"}},{"$f":"EOMONTH(ACHAT!M537,-1)+1","v":{"$error":"#NUM!"}},{"$f":"EOMONTH(ACHAT!L537,-1)+1","v":{"$error":"#NUM!"}}]
[null,{"$f":"EOMONTH(VENTE!A538,-1)+1","v":{"$error":"#NUM!"}},{"$f":"EOMONTH(VENTE!I538,-1)+1","v":{"$error":"#NUM!"}},{"$f":"EOMONTH(ACHAT!M538,-1)+1","v":{"$error":"#NUM!"}},{"$f":"EOMONTH(ACHAT!L538,-1)+1","v":{"$error":"#NUM!"}}]
[null,{"$f":"EOMONTH(VENTE!A539,-1)+1","v":{"$error":"#NUM!"}},{"$f":"EOMONTH(VENTE!I539,-1)+1","v":{"$error":"#NUM!"}},{"$f":"EOMONTH(ACHAT!M539,-1)+1","v":{"$error":"#NUM!"}},{"$f":"EOMONTH(ACHAT!L539,-1)+1","v":{"$error":"#NUM!"}}]
[null,{"$f":"EOMONTH(VENTE!A540,-1)+1","v":{"$error":"#NUM!"}},{"$f":"EOMONTH(VENTE!I540,-1)+1","v":{"$error":"#NUM!"}},{"$f":"EOMONTH(ACHAT!M540,-1)+1","v":{"$error":"#NUM!"}},{"$f":"EOMONTH(ACHAT!L540,-1)+1","v":{"$error":"#NUM!"}}]
[null,{"$f":"EOMONTH(VENTE!A541,-1)+1","v":{"$error":"#NUM!"}},{"$f":"EOMONTH(VENTE!I541,-1)+1","v":{"$error":"#NUM!"}},{"$f":"EOMONTH(ACHAT!M541,-1)+1","v":{"$error":"#NUM!"}},{"$f":"EOMONTH(ACHAT!L541,-1)+1","v":{"$error":"#NUM!"}}]
[null,{"$f":"EOMONTH(VENTE!A542,-1)+1","v":{"$error":"#NUM!"}},{"$f":"EOMONTH(VENTE!I542,-1)+1","v":{"$error":"#NUM!"}},{"$f":"EOMONTH(ACHAT!M542,-1)+1","v":{"$error":"#NUM!"}},{"$f":"EOMONTH(ACHAT!L542,-1)+1","v":{"$error":"#NUM!"}}]
[null,{"$f":"EOMONTH(VENTE!A543,-1)+1","v":{"$error":"#NUM!"}},{"$f":"EOMONTH(VENTE!I543,-1)+1","v":{"$error":"#NUM!"}},{"$f":"EOMONTH(ACHAT!M543,-1)+1","v":{"$error":"#NUM!"}},{"$f":"EOMONTH(ACHAT!L543,-1)+1","v":{"$error":"#NUM!"}}]
[null,{"$f":"EOMONTH(VENTE!A544,-1)+1","v":{"$error":"#NUM!"}},{"$f":"EOMONTH(VENTE!I544,-1)+1","v":{"$error":"#NUM!"}},{"$f":"EOMONTH(ACHAT!M544,-1)+1","v":{"$error":"#NUM!"}},{"$f":"EOMONTH(ACHAT!L544,-1)+1","v":{"$error":"#NUM!"}}]
[null,{"$f":"EOMONTH(VENTE!A545,-1)+1","v":{"$error":"#NUM!"}},{"$f":"EOMONTH(VENTE!I545,-1)+1","v":{"$error":"#NUM!"}},{"$f":"EOMONTH(ACHAT!M545,-1)+1","v":{"$error":"#NUM!"}},{"$f":"EOMONTH(ACHAT!L545,-1)+1","v":{"$error":"#NUM!"}}]
[null,{"$f":"EOMONTH(VENTE!A546,-1)+1","v":{"$error":"#NUM!"}},{"$f":"EOMONTH(VENTE!I546,-1)+1","v":{"$error":"#NUM!"}},{"$f":"EOMONTH(ACHAT!M546,-1)+1","v":{"$error":"#NUM!"}},{"$f":"EOMONTH(ACHAT!L546,-1)+1","v":{"$error":"#NUM!"}}]
[null,{"$f":"EOMONTH(VENTE!A547,-1)+1","v":{"$error":"#NUM!"}},{"$f":"EOMONTH(VENTE!I547,-1)+1","v":{"$error":"#NUM!"}},{"$f":"EOMONTH(ACHAT!M547,-1)+1","v":{"$error":"#NUM!"}},{"$f":"EOMONTH(ACHAT!L547,-1)+1","v":{"$error":"#NUM!"}}]
[null,{"$f":"EOMONTH(VENTE!A548,-1)+1","v":{"$error":"#NUM!"}},{"$f":"EOMONTH(VENTE!I548,-1)+1","v":{"$error":"#NUM!"}},{"$f":"EOMONTH(ACHAT!M548,-1)+1","v":{"$error":"#NUM!"}},{"$f":"EOMONTH(ACHAT!L548,-1)+1","v":{"$error":"#NUM!"}}]
[null,{"$f":"EOMONTH(VENTE!A549,-1)+1","v":{"$error":"#NUM!"}},{"$f":"EOMONTH(VENTE!I549,-1)+1","v":{"$error":"#NUM!"}},{"$f":"EOMONTH(ACHAT!M549,-1)+1","v":{"$error":"#NUM!"}},{"$f":"EOMONTH(ACHAT!L549,-1)+1","v":{"$error":"#NUM!"}}]
[null,{"$f":"EOMONTH(VENTE!A550,-1)+1","v":{"$error":"#NUM!"}},{"$f":"EOMONTH(VENTE!I550,-1)+1","v":{"$error":"#NUM!"}},{"$f":"EOMONTH(ACHAT!M550,-1)+1","v":{"$error":"#NUM!"}},{"$f":"EOMONTH(ACHAT!L550,-1)+1","v":{"$error":"#NUM!"}}]
[null,{"$f":"EOMONTH(VENTE!A551,-1)+1","v":{"$error":"#NUM!"}},{"$f":"EOMONTH(VENTE!I551,-1)+1","v":{"$error":"#NUM!"}},{"$f":"EOMONTH(ACHAT!M551,-1)+1","v":{"$error":"#NUM!"}},{"$f":"EOMONTH(ACHAT!L551,-1)+1","v":{"$error":"#NUM!"}}]
[null,{"$f":"EOMONTH(VENTE!A552,-1)+1","v":{"$error":"#NUM!"}},{"$f":"EOMONTH(VENTE!I552,-1)+1","v":{"$error":"#NUM!"}},{"$f":"EOMONTH(ACHAT!M552,-1)+1","v":{"$error":"#NUM!"}},{"$f":"EOMONTH(ACHAT!L552,-1)+1","v":{"$error":"#NUM!"}}]
[null,{"$f":"EOMONTH(VENTE!A553,-1)+1","v":{"$error":"#NUM!"}},{"$f":"EOMONTH(VENTE!I553,-1)+1","v":{"$error":"#NUM!"}},{"$f":"EOMONTH(ACHAT!M553,-1)+1","v":{"$error":"#NUM!"}},{"$f":"EOMONTH(ACHAT!L553,-1)+1","v":{"$error":"#NUM!"}}]
[null,{"$f":"EOMONTH(VENTE!A554,-1)+1","v":{"$error":"#NUM!"}},{"$f":"EOMONTH(VENTE!I554,-1)+1","v":{"$error":"#NUM!"}},{"$f":"EOMONTH(ACHAT!M554,-1)+1","v":{"$error":"#NUM!"}},{"$f":"EOMONTH(ACHAT!L554,-1)+1","v":{"$error":"#NUM!"}}]
[null,{"$f":"EOMONTH(VENTE!A555,-1)+1","v":{"$error":"#NUM!"}},{"$f":"EOMONTH(VENTE!I555,-1)+1","v":{"$error":"#NUM!"}},{"$f":"EOMONTH(ACHAT!M555,-1)+1","v":{"$error":"#NUM!"}},{"$f":"EOMONTH(ACHAT!L555,-1)+1","v":{"$error":"#NUM!"}}]
[null,{"$f":"EOMONTH(VENTE!A556,-1)+1","v":{"$error":"#NUM!"}},{"$f":"EOMONTH(VENTE!I556,-1)+1","v":{"$error":"#NUM!"}},{"$f":"EOMONTH(ACHAT!M556,-1)+1","v":{"$error":"#NUM!"}},{"$f":"EOMONTH(ACHAT!L556,-1)+1","v":{"$error":"#NUM!"}}]
[null,{"$f":"EOMONTH(VENTE!A557,-1)+1","v":{"$error":"#NUM!"}},{"$f":"EOMONTH(VENTE!I557,-1)+1","v":{"$error":"#NUM!"}},{"$f":"EOMONTH(ACHAT!M557,-1)+1","v":{"$error":"#NUM!"}},{"$f":"EOMONTH(ACHAT!L557,-1)+1","v":{"$error":"#NUM!"}}]
[null,{"$f":"EOMONTH(VENTE!A558,-1)+1","v":{"$error":"#NUM!"}},{"$f":"EOMONTH(VENTE!I558,-1)+1","v":{"$error":"#NUM!"}},{"$f":"EOMONTH(ACHAT!M558,-1)+1","v":{"$error":"#NUM!"}},{"$f":"EOMONTH(ACHAT!L558,-1)+1","v":{"$error":"#NUM!"}}]
[null,{"$f":"EOMONTH(VENTE!A559,-1)+1","v":{"$error":"#NUM!"}},{"$f":"EOMONTH(VENTE!I559,-1)+1","v":{"$error":"#NUM!"}},{"$f":"EOMONTH(ACHAT!M559,-1)+1","v":{"$error":"#NUM!"}},{"$f":"EOMONTH(ACHAT!L559,-1)+1","v":{"$error":"#NUM!"}}]
[null,{"$f":"EOMONTH(VENTE!A560,-1)+1","v":{"$error":"#NUM!"}},{"$f":"EOMONTH(VENTE!I560,-1)+1","v":{"$error":"#NUM!"}},{"$f":"EOMONTH(ACHAT!M560,-1)+1","v":{"$error":"#NUM!"}},{"$f":"EOMONTH(ACHAT!L560,-1)+1","v":{"$error":"#NUM!"}}]
[null,{"$f":"EOMONTH(VENTE!A561,-1)+1","v":{"$error":"#NUM!"}},{"$f":"EOMONTH(VENTE!I561,-1)+1","v":{"$error":"#NUM!"}},{"$f":"EOMONTH(ACHAT!M561,-1)+1","v":{"$error":"#NUM!"}},{"$f":"EOMONTH(ACHAT!L561,-1)+1","v":{"$error":"#NUM!"}}]
[null,{"$f":"EOMONTH(VENTE!A562,-1)+1","v":{"$error":"#NUM!"}},{"$f":"EOMONTH(VENTE!I562,-1)+1","v":{"$error":"#NUM!"}},{"$f":"EOMONTH(ACHAT!M562,-1)+1","v":{"$error":"#NUM!"}},{"$f":"EOMONTH(ACHAT!L562,-1)+1","v":{"$error":"#NUM!"}}]
[null,{"$f":"EOMONTH(VENTE!A563,-1)+1","v":{"$error":"#NUM!"}},{"$f":"EOMONTH(VENTE!I563,-1)+1","v":{"$error":"#NUM!"}},{"$f":"EOMONTH(ACHAT!M563,-1)+1","v":{"$error":"#NUM!"}},{"$f":"EOMONTH(ACHAT!L563,-1)+1","v":{"$error":"#NUM!"}}]
[null,{"$f":"EOMONTH(VENTE!A564,-1)+1","v":{"$error":"#NUM!"}},{"$f":"EOMONTH(VENTE!I564,-1)+1","v":{"$error":"#NUM!"}},{"$f":"EOMONTH(ACHAT!M564,-1)+1","v":{"$error":"#NUM!"}},{"$f":"EOMONTH(ACHAT!L564,-1)+1","v":{"$error":"#NUM!"}}]
[null,{"$f":"EOMONTH(VENTE!A565,-1)+1","v":{"$error":"#NUM!"}},{"$f":"EOMONTH(VENTE!I565,-1)+1","v":{"$error":"#NUM!"}},{"$f":"EOMONTH(ACHAT!M565,-1)+1","v":{"$error":"#NUM!"}},{"$f":"EOMONTH(ACHAT!L565,-1)+1","v":{"$error":"#NUM!"}}]
[null,{"$f":"EOMONTH(VENTE!A566,-1)+1","v":{"$error":"#NUM!"}},{"$f":"EOMONTH(VENTE!I566,-1)+1","v":{"$error":"#NUM!"}},{"$f":"EOMONTH(ACHAT!M566,-1)+1","v":{"$error":"#NUM!"}},{"$f":"EOMONTH(ACHAT!L566,-1)+1","v":{"$error":"#NUM!"}}]
[null,{"$f":"EOMONTH(VENTE!A567,-1)+1","v":{"$error":"#NUM!"}},{"$f":"EOMONTH(VENTE!I567,-1)+1","v":{"$error":"#NUM!"}},{"$f":"EOMONTH(ACHAT!M567,-1)+1","v":{"$error":"#NUM!"}},{"$f":"EOMONTH(ACHAT!L567,-1)+1","v":{"$error":"#NUM!"}}]
[null,{"$f":"EOMONTH(VENTE!A568,-1)+1","v":{"$error":"#NUM!"}},{"$f":"EOMONTH(VENTE!I568,-1)+1","v":{"$error":"#NUM!"}},{"$f":"EOMONTH(ACHAT!M568,-1)+1","v":{"$error":"#NUM!"}},{"$f":"EOMONTH(ACHAT!L568,-1)+1","v":{"$error":"#NUM!"}}]
[null,{"$f":"EOMONTH(VENTE!A569,-1)+1","v":{"$error":"#NUM!"}},{"$f":"EOMONTH(VENTE!I569,-1)+1","v":{"$error":"#NUM!"}},{"$f":"EOMONTH(ACHAT!M569,-1)+1","v":{"$error":"#NUM!"}},{"$f":"EOMONTH(ACHAT!L569,-1)+1","v":{"$error":"#NUM!"}}]
[null,{"$f":"EOMONTH(VENTE!A570,-1)+1","v":{"$error":"#NUM!"}},{"$f":"EOMONTH(VENTE!I570,-1)+1","v":{"$error":"#NUM!"}},{"$f":"EOMONTH(ACHAT!M570,-1)+1","v":{"$error":"#NUM!"}},{"$f":"EOMONTH(ACHAT!L570,-1)+1","v":{"$error":"#NUM!"}}]
[null,{"$f":"EOMONTH(VENTE!A571,-1)+1","v":{"$error":"#NUM!"}},{"$f":"EOMONTH(VENTE!I571,-1)+1","v":{"$error":"#NUM!"}},{"$f":"EOMONTH(ACHAT!M571,-1)+1","v":{"$error":"#NUM!"}},{"$f":"EOMONTH(ACHAT!L571,-1)+1","v":{"$error":"#NUM!"}}]
[null,{"$f":"EOMONTH(VENTE!A572,-1)+1","v":{"$error":"#NUM!"}},{"$f":"EOMONTH(VENTE!I572,-1)+1","v":{"$error":"#NUM!"}},{"$f":"EOMONTH(ACHAT!M572,-1)+1","v":{"$error":"#NUM!"}},{"$f":"EOMONTH(ACHAT!L572,-1)+1","v":{"$error":"#NUM!"}}]
[null,{"$f":"EOMONTH(VENTE!A573,-1)+1","v":{"$error":"#NUM!"}},{"$f":"EOMONTH(VENTE!I573,-1)+1","v":{"$error":"#NUM!"}},{"$f":"EOMONTH(ACHAT!M573,-1)+1","v":{"$error":"#NUM!"}},{"$f":"EOMONTH(ACHAT!L573,-1)+1","v":{"$error":"#NUM!"}}]
[null,{"$f":"EOMONTH(VENTE!A574,-1)+1","v":{"$error":"#NUM!"}},{"$f":"EOMONTH(VENTE!I574,-1)+1","v":{"$error":"#NUM!"}},{"$f":"EOMONTH(ACHAT!M574,-1)+1","v":{"$error":"#NUM!"}},{"$f":"EOMONTH(ACHAT!L574,-1)+1","v":{"$error":"#NUM!"}}]
[null,{"$f":"EOMONTH(VENTE!A575,-1)+1","v":{"$error":"#NUM!"}},{"$f":"EOMONTH(VENTE!I575,-1)+1","v":{"$error":"#NUM!"}},{"$f":"EOMONTH(ACHAT!M575,-1)+1","v":{"$error":"#NUM!"}},{"$f":"EOMONTH(ACHAT!L575,-1)+1","v":{"$error":"#NUM!"}}]
[null,{"$f":"EOMONTH(VENTE!A576,-1)+1","v":{"$error":"#NUM!"}},{"$f":"EOMONTH(VENTE!I576,-1)+1","v":{"$error":"#NUM!"}},{"$f":"EOMONTH(ACHAT!M576,-1)+1","v":{"$error":"#NUM!"}},{"$f":"EOMONTH(ACHAT!L576,-1)+1","v":{"$error":"#NUM!"}}]
[null,{"$f":"EOMONTH(VENTE!A577,-1)+1","v":{"$error":"#NUM!"}},{"$f":"EOMONTH(VENTE!I577,-1)+1","v":{"$error":"#NUM!"}},{"$f":"EOMONTH(ACHAT!M577,-1)+1","v":{"$error":"#NUM!"}},{"$f":"EOMONTH(ACHAT!L577,-1)+1","v":{"$error":"#NUM!"}}]
[null,{"$f":"EOMONTH(VENTE!A578,-1)+1","v":{"$error":"#NUM!"}},{"$f":"EOMONTH(VENTE!I578,-1)+1","v":{"$error":"#NUM!"}},{"$f":"EOMONTH(ACHAT!M578,-1)+1","v":{"$error":"#NUM!"}},{"$f":"EOMONTH(ACHAT!L578,-1)+1","v":{"$error":"#NUM!"}}]
[null,{"$f":"EOMONTH(VENTE!A579,-1)+1","v":{"$error":"#NUM!"}},{"$f":"EOMONTH(VENTE!I579,-1)+1","v":{"$error":"#NUM!"}},{"$f":"EOMONTH(ACHAT!M579,-1)+1","v":{"$error":"#NUM!"}},{"$f":"EOMONTH(ACHAT!L579,-1)+1","v":{"$error":"#NUM!"}}]
[null,{"$f":"EOMONTH(VENTE!A580,-1)+1","v":{"$error":"#NUM!"}},{"$f":"EOMONTH(VENTE!I580,-1)+1","v":{"$error":"#NUM!"}},{"$f":"EOMONTH(ACHAT!M580,-1)+1","v":{"$error":"#NUM!"}},{"$f":"EOMONTH(ACHAT!L580,-1)+1","v":{"$error":"#NUM!"}}]
[null,{"$f":"EOMONTH(VENTE!A581,-1)+1","v":{"$error":"#NUM!"}},{"$f":"EOMONTH(VENTE!I581,-1)+1","v":{"$error":"#NUM!"}},{"$f":"EOMONTH(ACHAT!M581,-1)+1","v":{"$error":"#NUM!"}},{"$f":"EOMONTH(ACHAT!L581,-1)+1","v":{"$error":"#NUM!"}}]
[null,{"$f":"EOMONTH(VENTE!A582,-1)+1","v":{"$error":"#NUM!"}},{"$f":"EOMONTH(VENTE!I582,-1)+1","v":{"$error":"#NUM!"}},{"$f":"EOMONTH(ACHAT!M582,-1)+1","v":{"$error":"#NUM!"}},{"$f":"EOMONTH(ACHAT!L582,-1)+1","v":{"$error":"#NUM!"}}]
[null,{"$f":"EOMONTH(VENTE!A583,-1)+1","v":{"$error":"#NUM!"}},{"$f":"EOMONTH(VENTE!I583,-1)+1","v":{"$error":"#NUM!"}},{"$f":"EOMONTH(ACHAT!M583,-1)+1","v":{"$error":"#NUM!"}},{"$f":"EOMONTH(ACHAT!L583,-1)+1","v":{"$error":"#NUM!"}}]
[null,{"$f":"EOMONTH(VENTE!A584,-1)+1","v":{"$error":"#NUM!"}},{"$f":"EOMONTH(VENTE!I584,-1)+1","v":{"$error":"#NUM!"}},{"$f":"EOMONTH(ACHAT!M584,-1)+1","v":{"$error":"#NUM!"}},{"$f":"EOMONTH(ACHAT!L584,-1)+1","v":{"$error":"#NUM!"}}]
[null,{"$f":"EOMONTH(VENTE!A585,-1)+1","v":{"$error":"#NUM!"}},{"$f":"EOMONTH(VENTE!I585,-1)+1","v":{"$error":"#NUM!"}},{"$f":"EOMONTH(ACHAT!M585,-1)+1","v":{"$error":"#NUM!"}},{"$f":"EOMONTH(ACHAT!L585,-1)+1","v":{"$error":"#NUM!"}}]
[null,{"$f":"EOMONTH(VENTE!A586,-1)+1","v":{"$error":"#NUM!"}},{"$f":"EOMONTH(VENTE!I586,-1)+1","v":{"$error":"#NUM!"}},{"$f":"EOMONTH(ACHAT!M586,-1)+1","v":{"$error":"#NUM!"}},{"$f":"EOMONTH(ACHAT!L586,-1)+1","v":{"$error":"#NUM!"}}]
[null,{"$f":"EOMONTH(VENTE!A587,-1)+1","v":{"$error":"#NUM!"}},{"$f":"EOMONTH(VENTE!I587,-1)+1","v":{"$error":"#NUM!"}},{"$f":"EOMONTH(ACHAT!M587,-1)+1","v":{"$error":"#NUM!"}},{"$f":"EOMONTH(ACHAT!L587,-1)+1","v":{"$error":"#NUM!"}}]
[null,{"$f":"EOMONTH(VENTE!A588,-1)+1","v":{"$error":"#NUM!"}},{"$f":"EOMONTH(VENTE!I588,-1)+1","v":{"$error":"#NUM!"}},{"$f":"EOMONTH(ACHAT!M588,-1)+1","v":{"$error":"#NUM!"}},{"$f":"EOMONTH(ACHAT!L588,-1)+1","v":{"$error":"#NUM!"}}]
[null,{"$f":"EOMONTH(VENTE!A589,-1)+1","v":{"$error":"#NUM!"}},{"$f":"EOMONTH(VENTE!I589,-1)+1","v":{"$error":"#NUM!"}},{"$f":"EOMONTH(ACHAT!M589,-1)+1","v":{"$error":"#NUM!"}},{"$f":"EOMONTH(ACHAT!L589,-1)+1","v":{"$error":"#NUM!"}}]
[null,{"$f":"EOMONTH(VENTE!A590,-1)+1","v":{"$error":"#NUM!"}},{"$f":"EOMONTH(VENTE!I590,-1)+1","v":{"$error":"#NUM!"}},{"$f":"EOMONTH(ACHAT!M590,-1)+1","v":{"$error":"#NUM!"}},{"$f":"EOMONTH(ACHAT!L590,-1)+1","v":{"$error":"#NUM!"}}]
[null,{"$f":"EOMONTH(VENTE!A591,-1)+1","v":{"$error":"#NUM!"}},{"$f":"EOMONTH(VENTE!I591,-1)+1","v":{"$error":"#NUM!"}},{"$f":"EOMONTH(ACHAT!M591,-1)+1","v":{"$error":"#NUM!"}},{"$f":"EOMONTH(ACHAT!L591,-1)+1","v":{"$error":"#NUM!"}}]
[null,{"$f":"EOMONTH(VENTE!A592,-1)+1","v":{"$error":"#NUM!"}},{"$f":"EOMONTH(VENTE!I592,-1)+1","v":{"$error":"#NUM!"}},{"$f":"EOMONTH(ACHAT!M592,-1)+1","v":{"$error":"#NUM!"}},{"$f":"EOMONTH(ACHAT!L592,-1)+1","v":{"$error":"#NUM!"}}]
[null,{"$f":"EOMONTH(VENTE!A593,-1)+1","v":{"$error":"#NUM!"}},{"$f":"EOMONTH(VENTE!I593,-1)+1","v":{"$error":"#NUM!"}},{"$f":"EOMONTH(ACHAT!M593,-1)+1","v":{"$error":"#NUM!"}},{"$f":"EOMONTH(ACHAT!L593,-1)+1","v":{"$error":"#NUM!"}}]
[null,{"$f":"EOMONTH(VENTE!A594,-1)+1","v":{"$error":"#NUM!"}},{"$f":"EOMONTH(VENTE!I594,-1)+1","v":{"$error":"#NUM!"}},{"$f":"EOMONTH(ACHAT!M594,-1)+1","v":{"$error":"#NUM!"}},{"$f":"EOMONTH(ACHAT!L594,-1)+1","v":{"$error":"#NUM!"}}]
[null,{"$f":"EOMONTH(VENTE!A595,-1)+1","v":{"$error":"#NUM!"}},{"$f":"EOMONTH(VENTE!I595,-1)+1","v":{"$error":"#NUM!"}},{"$f":"EOMONTH(ACHAT!M595,-1)+1","v":{"$error":"#NUM!"}},{"$f":"EOMONTH(ACHAT!L595,-1)+1","v":{"$error":"#NUM!"}}]
[null,{"$f":"EOMONTH(VENTE!A596,-1)+1","v":{"$error":"#NUM!"}},{"$f":"EOMONTH(VENTE!I596,-1)+1","v":{"$error":"#NUM!"}},{"$f":"EOMONTH(ACHAT!M596,-1)+1","v":{"$error":"#NUM!"}},{"$f":"EOMONTH(ACHAT!L596,-1)+1","v":{"$error":"#NUM!"}}]
[null,{"$f":"EOMONTH(VENTE!A597,-1)+1","v":{"$error":"#NUM!"}},{"$f":"EOMONTH(VENTE!I597,-1)+1","v":{"$error":"#NUM!"}},{"$f":"EOMONTH(ACHAT!M597,-1)+1","v":{"$error":"#NUM!"}},{"$f":"EOMONTH(ACHAT!L597,-1)+1","v":{"$error":"#NUM!"}}]
[null,{"$f":"EOMONTH(VENTE!A598,-1)+1","v":{"$error":"#NUM!"}},{"$f":"EOMONTH(VENTE!I598,-1)+1","v":{"$error":"#NUM!"}},{"$f":"EOMONTH(ACHAT!M598,-1)+1","v":{"$error":"#NUM!"}},{"$f":"EOMONTH(ACHAT!L598,-1)+1","v":{"$error":"#NUM!"}}]
[null,{"$f":"EOMONTH(VENTE!A599,-1)+1","v":{"$error":"#NUM!"}},{"$f":"EOMONTH(VENTE!I599,-1)+1","v":{"$error":"#NUM!"}},{"$f":"EOMONTH(ACHAT!M599,-1)+1","v":{"$error":"#NUM!"}},{"$f":"EOMONTH(ACHAT!L599,-1)+1","v":{"$error":"#NUM!"}}]
[null,{"$f":"EOMONTH(VENTE!A600,-1)+1","v":{"$error":"#NUM!"}},{"$f":"EOMONTH(VENTE!I600,-1)+1","v":{"$error":"#NUM!"}},{"$f":"EOMONTH(ACHAT!M600,-1)+1","v":{"$error":"#NUM!"}},{"$f":"EOMONTH(ACHAT!L600,-1)+1","v":{"$error":"#NUM!"}}]
[null,{"$f":"EOMONTH(VENTE!A601,-1)+1","v":{"$error":"#NUM!"}},{"$f":"EOMONTH(VENTE!I601,-1)+1","v":{"$error":"#NUM!"}},{"$f":"EOMONTH(ACHAT!M601,-1)+1","v":{"$error":"#NUM!"}},{"$f":"EOMONTH(ACHAT!L601,-1)+1","v":{"$error":"#NUM!"}}]
[null,{"$f":"EOMONTH(VENTE!A602,-1)+1","v":{"$error":"#NUM!"}},{"$f":"EOMONTH(VENTE!I602,-1)+1","v":{"$error":"#NUM!"}},{"$f":"EOMONTH(ACHAT!M602,-1)+1","v":{"$error":"#NUM!"}},{"$f":"EOMONTH(ACHAT!L602,-1)+1","v":{"$error":"#NUM!"}}]
[null,{"$f":"EOMONTH(VENTE!A603,-1)+1","v":{"$error":"#NUM!"}},{"$f":"EOMONTH(VENTE!I603,-1)+1","v":{"$error":"#NUM!"}},{"$f":"EOMONTH(ACHAT!M603,-1)+1","v":{"$error":"#NUM!"}},{"$f":"EOMONTH(ACHAT!L603,-1)+1","v":{"$error":"#NUM!"}}]
[null,{"$f":"EOMONTH(VENTE!A604,-1)+1","v":{"$error":"#NUM!"}},{"$f":"EOMONTH(VENTE!I604,-1)+1","v":{"$error":"#NUM!"}},{"$f":"EOMONTH(ACHAT!M604,-1)+1","v":{"$error":"#NUM!"}},{"$f":"EOMONTH(ACHAT!L604,-1)+1","v":{"$error":"#NUM!"}}]
[null,{"$f":"EOMONTH(VENTE!A605,-1)+1","v":{"$error":"#NUM!"}},{"$f":"EOMONTH(VENTE!I605,-1)+1","v":{"$error":"#NUM!"}},{"$f":"EOMONTH(ACHAT!M605,-1)+1","v":{"$error":"#NUM!"}},{"$f":"EOMONTH(ACHAT!L605,-1)+1","v":{"$error":"#NUM!"}}]
[null,{"$f":"EOMONTH(VENTE!A606,-1)+1","v":{"$error":"#NUM!"}},{"$f":"EOMONTH(VENTE!I606,-1)+1","v":{"$error":"#NUM!"}},{"$f":"EOMONTH(ACHAT!M606,-1)+1","v":{"$error":"#NUM!"}},{"$f":"EOMONTH(ACHAT!L606,-1)+1","v":{"$error":"#NUM!"}}]
[null,{"$f":"EOMONTH(VENTE!A607,-1)+1","v":{"$error":"#NUM!"}},{"$f":"EOMONTH(VENTE!I607,-1)+1","v":{"$error":"#NUM!"}},{"$f":"EOMONTH(ACHAT!M607,-1)+1","v":{"$error":"#NUM!"}},{"$f":"EOMONTH(ACHAT!L607,-1)+1","v":{"$error":"#NUM!"}}]
[null,{"$f":"EOMONTH(VENTE!A608,-1)+1","v":{"$error":"#NUM!"}},{"$f":"EOMONTH(VENTE!I608,-1)+1","v":{"$error":"#NUM!"}},{"$f":"EOMONTH(ACHAT!M608,-1)+1","v":{"$error":"#NUM!"}},{"$f":"EOMONTH(ACHAT!L608,-1)+1","v":{"$error":"#NUM!"}}]
[null,{"$f":"EOMONTH(VENTE!A609,-1)+1","v":{"$error":"#NUM!"}},{"$f":"EOMONTH(VENTE!I609,-1)+1","v":{"$error":"#NUM!"}},{"$f":"EOMONTH(ACHAT!M609,-1)+1","v":{"$error":"#NUM!"}},{"$f":"EOMONTH(ACHAT!L609,-1)+1","v":{"$error":"#NUM!"}}]
[null,{"$f":"EOMONTH(VENTE!A610,-1)+1","v":{"$error":"#NUM!"}},{"$f":"EOMONTH(VENTE!I610,-1)+1","v":{"$error":"#NUM!"}},{"$f":"EOMONTH(ACHAT!M610,-1)+1","v":{"$error":"#NUM!"}},{"$f":"EOMONTH(ACHAT!L610,-1)+1","v":{"$error":"#NUM!"}}]
[null,{"$f":"EOMONTH(VENTE!A611,-1)+1","v":{"$error":"#NUM!"}},{"$f":"EOMONTH(VENTE!I611,-1)+1","v":{"$error":"#NUM!"}},{"$f":"EOMONTH(ACHAT!M611,-1)+1","v":{"$error":"#NUM!"}},{"$f":"EOMONTH(ACHAT!L611,-1)+1","v":{"$error":"#NUM!"}}]
[null,{"$f":"EOMONTH(VENTE!A612,-1)+1","v":{"$error":"#NUM!"}},{"$f":"EOMONTH(VENTE!I612,-1)+1","v":{"$error":"#NUM!"}},{"$f":"EOMONTH(ACHAT!M612,-1)+1","v":{"$error":"#NUM!"}},{"$f":"EOMONTH(ACHAT!L612,-1)+1","v":{"$error":"#NUM!"}}]
[null,{"$f":"EOMONTH(VENTE!A613,-1)+1","v":{"$error":"#NUM!"}},{"$f":"EOMONTH(VENTE!I613,-1)+1","v":{"$error":"#NUM!"}},{"$f":"EOMONTH(ACHAT!M613,-1)+1","v":{"$error":"#NUM!"}},{"$f":"EOMONTH(ACHAT!L613,-1)+1","v":{"$error":"#NUM!"}}]
[null,{"$f":"EOMONTH(VENTE!A614,-1)+1","v":{"$error":"#NUM!"}},{"$f":"EOMONTH(VENTE!I614,-1)+1","v":{"$error":"#NUM!"}},{"$f":"EOMONTH(ACHAT!M614,-1)+1","v":{"$error":"#NUM!"}},{"$f":"EOMONTH(ACHAT!L614,-1)+1","v":{"$error":"#NUM!"}}]
[null,{"$f":"EOMONTH(VENTE!A615,-1)+1","v":{"$error":"#NUM!"}},{"$f":"EOMONTH(VENTE!I615,-1)+1","v":{"$error":"#NUM!"}},{"$f":"EOMONTH(ACHAT!M615,-1)+1","v":{"$error":"#NUM!"}},{"$f":"EOMONTH(ACHAT!L615,-1)+1","v":{"$error":"#NUM!"}}]
[null,{"$f":"EOMONTH(VENTE!A616,-1)+1","v":{"$error":"#NUM!"}},{"$f":"EOMONTH(VENTE!I616,-1)+1","v":{"$error":"#NUM!"}},{"$f":"EOMONTH(ACHAT!M616,-1)+1","v":{"$error":"#NUM!"}},{"$f":"EOMONTH(ACHAT!L616,-1)+1","v":{"$error":"#NUM!"}}]
[null,{"$f":"EOMONTH(VENTE!A617,-1)+1","v":{"$error":"#NUM!"}},{"$f":"EOMONTH(VENTE!I617,-1)+1","v":{"$error":"#NUM!"}},{"$f":"EOMONTH(ACHAT!M617,-1)+1","v":{"$error":"#NUM!"}},{"$f":"EOMONTH(ACHAT!L617,-1)+1","v":{"$error":"#NUM!"}}]
[null,{"$f":"EOMONTH(VENTE!A618,-1)+1","v":{"$error":"#NUM!"}},{"$f":"EOMONTH(VENTE!I618,-1)+1","v":{"$error":"#NUM!"}},{"$f":"EOMONTH(ACHAT!M618,-1)+1","v":{"$error":"#NUM!"}},{"$f":"EOMONTH(ACHAT!L618,-1)+1","v":{"$error":"#NUM!"}}]
[null,{"$f":"EOMONTH(VENTE!A619,-1)+1","v":{"$error":"#NUM!"}},{"$f":"EOMONTH(VENTE!I619,-1)+1","v":{"$error":"#NUM!"}},{"$f":"EOMONTH(ACHAT!M619,-1)+1","v":{"$error":"#NUM!"}},{"$f":"EOMONTH(ACHAT!L619,-1)+1","v":{"$error":"#NUM!"}}]
[null,{"$f":"EOMONTH(VENTE!A620,-1)+1","v":{"$error":"#NUM!"}},{"$f":"EOMONTH(VENTE!I620,-1)+1","v":{"$error":"#NUM!"}},{"$f":"EOMONTH(ACHAT!M620,-1)+1","v":{"$error":"#NUM!"}},{"$f":"EOMONTH(ACHAT!L620,-1)+1","v":{"$error":"#NUM!"}}]
[null,{"$f":"EOMONTH(VENTE!A621,-1)+1","v":{"$error":"#NUM!"}},{"$f":"EOMONTH(VENTE!I621,-1)+1","v":{"$error":"#NUM!"}},{"$f":"EOMONTH(ACHAT!M621,-1)+1","v":{"$error":"#NUM!"}},{"$f":"EOMONTH(ACHAT!L621,-1)+1","v":{"$error":"#NUM!"}}]
[null,{"$f":"EOMONTH(VENTE!A622,-1)+1","v":{"$error":"#NUM!"}},{"$f":"EOMONTH(VENTE!I622,-1)+1","v":{"$error":"#NUM!"}},{"$f":"EOMONTH(ACHAT!M622,-1)+1","v":{"$error":"#NUM!"}},{"$f":"EOMONTH(ACHAT!L622,-1)+1","v":{"$error":"#NUM!"}}]
[null,{"$f":"EOMONTH(VENTE!A623,-1)+1","v":{"$error":"#NUM!"}},{"$f":"EOMONTH(VENTE!I623,-1)+1","v":{"$error":"#NUM!"}},{"$f":"EOMONTH(ACHAT!M623,-1)+1","v":{"$error":"#NUM!"}},{"$f":"EOMONTH(ACHAT!L623,-1)+1","v":{"$error":"#NUM!"}}]
[null,{"$f":"EOMONTH(VENTE!A624,-1)+1","v":{"$error":"#NUM!"}},{"$f":"EOMONTH(VENTE!I624,-1)+1","v":{"$error":"#NUM!"}},{"$f":"EOMONTH(ACHAT!M624,-1)+1","v":{"$error":"#NUM!"}},{"$f":"EOMONTH(ACHAT!L624,-1)+1","v":{"$error":"#NUM!"}}]
[null,{"$f":"EOMONTH(VENTE!A625,-1)+1","v":{"$error":"#NUM!"}},{"$f":"EOMONTH(VENTE!I625,-1)+1","v":{"$error":"#NUM!"}},{"$f":"EOMONTH(ACHAT!M625,-1)+1","v":{"$error":"#NUM!"}},{"$f":"EOMONTH(ACHAT!L625,-1)+1","v":{"$error":"#NUM!"}}]
[null,{"$f":"EOMONTH(VENTE!A626,-1)+1","v":{"$error":"#NUM!"}},{"$f":"EOMONTH(VENTE!I626,-1)+1","v":{"$error":"#NUM!"}},{"$f":"EOMONTH(ACHAT!M626,-1)+1","v":{"$error":"#NUM!"}},{"$f":"EOMONTH(ACHAT!L626,-1)+1","v":{"$error":"#NUM!"}}]
[null,{"$f":"EOMONTH(VENTE!A627,-1)+1","v":{"$error":"#NUM!"}},{"$f":"EOMONTH(VENTE!I627,-1)+1","v":{"$error":"#NUM!"}},{"$f":"EOMONTH(ACHAT!M627,-1)+1","v":{"$error":"#NUM!"}},{"$f":"EOMONTH(ACHAT!L627,-1)+1","v":{"$error":"#NUM!"}}]
[null,{"$f":"EOMONTH(VENTE!A628,-1)+1","v":{"$error":"#NUM!"}},{"$f":"EOMONTH(VENTE!I628,-1)+1","v":{"$error":"#NUM!"}},{"$f":"EOMONTH(ACHAT!M628,-1)+1","v":{"$error":"#NUM!"}},{"$f":"EOMONTH(ACHAT!L628,-1)+1","v":{"$error":"#NUM!"}}]
[null,{"$f":"EOMONTH(VENTE!A629,-1)+1","v":{"$error":"#NUM!"}},{"$f":"EOMONTH(VENTE!I629,-1)+1","v":{"$error":"#NUM!"}},{"$f":"EOMONTH(ACHAT!M629,-1)+1","v":{"$error":"#NUM!"}},{"$f":"EOMONTH(ACHAT!L629,-1)+1","v":{"$error":"#NUM!"}}]
[null,{"$f":"EOMONTH(VENTE!A630,-1)+1","v":{"$error":"#NUM!"}},{"$f":"EOMONTH(VENTE!I630,-1)+1","v":{"$error":"#NUM!"}},{"$f":"EOMONTH(ACHAT!M630,-1)+1","v":{"$error":"#NUM!"}},{"$f":"EOMONTH(ACHAT!L630,-1)+1","v":{"$error":"#NUM!"}}]
[null,{"$f":"EOMONTH(VENTE!A631,-1)+1","v":{"$error":"#NUM!"}},{"$f":"EOMONTH(VENTE!I631,-1)+1","v":{"$error":"#NUM!"}},{"$f":"EOMONTH(ACHAT!M631,-1)+1","v":{"$error":"#NUM!"}},{"$f":"EOMONTH(ACHAT!L631,-1)+1","v":{"$error":"#NUM!"}}]
[null,{"$f":"EOMONTH(VENTE!A632,-1)+1","v":{"$error":"#NUM!"}},{"$f":"EOMONTH(VENTE!I632,-1)+1","v":{"$error":"#NUM!"}},{"$f":"EOMONTH(ACHAT!M632,-1)+1","v":{"$error":"#NUM!"}},{"$f":"EOMONTH(ACHAT!L632,-1)+1","v":{"$error":"#NUM!"}}]
[null,{"$f":"EOMONTH(VENTE!A633,-1)+1","v":{"$error":"#NUM!"}},{"$f":"EOMONTH(VENTE!I633,-1)+1","v":{"$error":"#NUM!"}},{"$f":"EOMONTH(ACHAT!M633,-1)+1","v":{"$error":"#NUM!"}},{"$f":"EOMONTH(ACHAT!L633,-1)+1","v":{"$error":"#NUM!"}}]
[null,{"$f":"EOMONTH(VENTE!A634,-1)+1","v":{"$error":"#NUM!"}},{"$f":"EOMONTH(VENTE!I634,-1)+1","v":{"$error":"#NUM!"}},{"$f":"EOMONTH(ACHAT!M634,-1)+1","v":{"$error":"#NUM!"}},{"$f":"EOMONTH(ACHAT!L634,-1)+1","v":{"$error":"#NUM!"}}]
[null,{"$f":"EOMONTH(VENTE!A635,-1)+1","v":{"$error":"#NUM!"}},{"$f":"EOMONTH(VENTE!I635,-1)+1","v":{"$error":"#NUM!"}},{"$f":"EOMONTH(ACHAT!M635,-1)+1","v":{"$error":"#NUM!"}},{"$f":"EOMONTH(ACHAT!L635,-1)+1","v":{"$error":"#NUM!"}}]
[null,{"$f":"EOMONTH(VENTE!A636,-1)+1","v":{"$error":"#NUM!"}},{"$f":"EOMONTH(VENTE!I636,-1)+1","v":{"$error":"#NUM!"}},{"$f":"EOMONTH(ACHAT!M636,-1)+1","v":{"$error":"#NUM!"}},{"$f":"EOMONTH(ACHAT!L636,-1)+1","v":{"$error":"#NUM!"}}]
[null,{"$f":"EOMONTH(VENTE!A637,-1)+1","v":{"$error":"#NUM!"}},{"$f":"EOMONTH(VENTE!I637,-1)+1","v":{"$error":"#NUM!"}},{"$f":"EOMONTH(ACHAT!M637,-1)+1","v":{"$error":"#NUM!"}},{"$f":"EOMONTH(ACHAT!L637,-1)+1","v":{"$error":"#NUM!"}}]
[null,{"$f":"EOMONTH(VENTE!A638,-1)+1","v":{"$error":"#NUM!"}},{"$f":"EOMONTH(VENTE!I638,-1)+1","v":{"$error":"#NUM!"}},{"$f":"EOMONTH(ACHAT!M638,-1)+1","v":{"$error":"#NUM!"}},{"$f":"EOMONTH(ACHAT!L638,-1)+1","v":{"$error":"#NUM!"}}]
[null,{"$f":"EOMONTH(VENTE!A639,-1)+1","v":{"$error":"#NUM!"}},{"$f":"EOMONTH(VENTE!I639,-1)+1","v":{"$error":"#NUM!"}},{"$f":"EOMONTH(ACHAT!M639,-1)+1","v":{"$error":"#NUM!"}},{"$f":"EOMONTH(ACHAT!L639,-1)+1","v":{"$error":"#NUM!"}}]
[null,{"$f":"EOMONTH(VENTE!A640,-1)+1","v":{"$error":"#NUM!"}},{"$f":"EOMONTH(VENTE!I640,-1)+1","v":{"$error":"#NUM!"}},{"$f":"EOMONTH(ACHAT!M640,-1)+1","v":{"$error":"#NUM!"}},{"$f":"EOMONTH(ACHAT!L640,-1)+1","v":{"$error":"#NUM!"}}]
[null,{"$f":"EOMONTH(VENTE!A641,-1)+1","v":{"$error":"#NUM!"}},{"$f":"EOMONTH(VENTE!I641,-1)+1","v":{"$error":"#NUM!"}},{"$f":"EOMONTH(ACHAT!M641,-1)+1","v":{"$error":"#NUM!"}},{"$f":"EOMONTH(ACHAT!L641,-1)+1","v":{"$error":"#NUM!"}}]
[null,{"$f":"EOMONTH(VENTE!A642,-1)+1","v":{"$error":"#NUM!"}},{"$f":"EOMONTH(VENTE!I642,-1)+1","v":{"$error":"#NUM!"}},{"$f":"EOMONTH(ACHAT!M642,-1)+1","v":{"$error":"#NUM!"}},{"$f":"EOMONTH(ACHAT!L642,-1)+1","v":{"$error":"#NUM!"}}]
[null,{"$f":"EOMONTH(VENTE!A643,-1)+1","v":{"$error":"#NUM!"}},{"$f":"EOMONTH(VENTE!I643,-1)+1","v":{"$error":"#NUM!"}},{"$f":"EOMONTH(ACHAT!M643,-1)+1","v":{"$error":"#NUM!"}},{"$f":"EOMONTH(ACHAT!L643,-1)+1","v":{"$error":"#NUM!"}}]
[null,{"$f":"EOMONTH(VENTE!A644,-1)+1","v":{"$error":"#NUM!"}},{"$f":"EOMONTH(VENTE!I644,-1)+1","v":{"$error":"#NUM!"}},{"$f":"EOMONTH(ACHAT!M644,-1)+1","v":{"$error":"#NUM!"}},{"$f":"EOMONTH(ACHAT!L644,-1)+1","v":{"$error":"#NUM!"}}]
[null,{"$f":"EOMONTH(VENTE!A645,-1)+1","v":{"$error":"#NUM!"}},{"$f":"EOMONTH(VENTE!I645,-1)+1","v":{"$error":"#NUM!"}},{"$f":"EOMONTH(ACHAT!M645,-1)+1","v":{"$error":"#NUM!"}},{"$f":"EOMONTH(ACHAT!L645,-1)+1","v":{"$error":"#NUM!"}}]
[null,{"$f":"EOMONTH(VENTE!A646,-1)+1","v":{"$error":"#NUM!"}},{"$f":"EOMONTH(VENTE!I646,-1)+1","v":{"$error":"#NUM!"}},{"$f":"EOMONTH(ACHAT!M646,-1)+1","v":{"$error":"#NUM!"}},{"$f":"EOMONTH(ACHAT!L646,-1)+1","v":{"$error":"#NUM!"}}]
[null,{"$f":"EOMONTH(VENTE!A647,-1)+1","v":{"$error":"#NUM!"}},{"$f":"EOMONTH(VENTE!I647,-1)+1","v":{"$error":"#NUM!"}},{"$f":"EOMONTH(ACHAT!M647,-1)+1","v":{"$error":"#NUM!"}},{"$f":"EOMONTH(ACHAT!L647,-1)+1","v":{"$error":"#NUM!"}}]
[null,{"$f":"EOMONTH(VENTE!A648,-1)+1","v":{"$error":"#NUM!"}},{"$f":"EOMONTH(VENTE!I648,-1)+1","v":{"$error":"#NUM!"}},{"$f":"EOMONTH(ACHAT!M648,-1)+1","v":{"$error":"#NUM!"}},{"$f":"EOMONTH(ACHAT!L648,-1)+1","v":{"$error":"#NUM!"}}]
[null,{"$f":"EOMONTH(VENTE!A649,-1)+1","v":{"$error":"#NUM!"}},{"$f":"EOMONTH(VENTE!I649,-1)+1","v":{"$error":"#NUM!"}},{"$f":"EOMONTH(ACHAT!M649,-1)+1","v":{"$error":"#NUM!"}},{"$f":"EOMONTH(ACHAT!L649,-1)+1","v":{"$error":"#NUM!"}}]
[null,{"$f":"EOMONTH(VENTE!A650,-1)+1","v":{"$error":"#NUM!"}},{"$f":"EOMONTH(VENTE!I650,-1)+1","v":{"$error":"#NUM!"}},{"$f":"EOMONTH(ACHAT!M650,-1)+1","v":{"$error":"#NUM!"}},{"$f":"EOMONTH(ACHAT!L650,-1)+1","v":{"$error":"#NUM!"}}]
[null,{"$f":"EOMONTH(VENTE!A651,-1)+1","v":{"$error":"#NUM!"}},{"$f":"EOMONTH(VENTE!I651,-1)+1","v":{"$error":"#NUM!"}},{"$f":"EOMONTH(ACHAT!M651,-1)+1","v":{"$error":"#NUM!"}},{"$f":"EOMONTH(ACHAT!L651,-1)+1","v":{"$error":"#NUM!"}}]
[null,{"$f":"EOMONTH(VENTE!A652,-1)+1","v":{"$error":"#NUM!"}},{"$f":"EOMONTH(VENTE!I652,-1)+1","v":{"$error":"#NUM!"}},{"$f":"EOMONTH(ACHAT!M652,-1)+1","v":{"$error":"#NUM!"}},{"$f":"EOMONTH(ACHAT!L652,-1)+1","v":{"$error":"#NUM!"}}]
[null,{"$f":"EOMONTH(VENTE!A653,-1)+1","v":{"$error":"#NUM!"}},{"$f":"EOMONTH(VENTE!I653,-1)+1","v":{"$error":"#NUM!"}},{"$f":"EOMONTH(ACHAT!M653,-1)+1","v":{"$error":"#NUM!"}},{"$f":"EOMONTH(ACHAT!L653,-1)+1","v":{"$error":"#NUM!"}}]
[null,{"$f":"EOMONTH(VENTE!A654,-1)+1","v":{"$error":"#NUM!"}},{"$f":"EOMONTH(VENTE!I654,-1)+1","v":{"$error":"#NUM!"}},{"$f":"EOMONTH(ACHAT!M654,-1)+1","v":{"$error":"#NUM!"}},{"$f":"EOMONTH(ACHAT!L654,-1)+1","v":{"$error":"#NUM!"}}]
[null,{"$f":"EOMONTH(VENTE!A655,-1)+1","v":{"$error":"#NUM!"}},{"$f":"EOMONTH(VENTE!I655,-1)+1","v":{"$error":"#NUM!"}},{"$f":"EOMONTH(ACHAT!M655,-1)+1","v":{"$error":"#NUM!"}},{"$f":"EOMONTH(ACHAT!L655,-1)+1","v":{"$error":"#NUM!"}}]
[null,{"$f":"EOMONTH(VENTE!A656,-1)+1","v":{"$error":"#NUM!"}},{"$f":"EOMONTH(VENTE!I656,-1)+1","v":{"$error":"#NUM!"}},{"$f":"EOMONTH(ACHAT!M656,-1)+1","v":{"$error":"#NUM!"}},{"$f":"EOMONTH(ACHAT!L656,-1)+1","v":{"$error":"#NUM!"}}]
[null,{"$f":"EOMONTH(VENTE!A657,-1)+1","v":{"$error":"#NUM!"}},{"$f":"EOMONTH(VENTE!I657,-1)+1","v":{"$error":"#NUM!"}},{"$f":"EOMONTH(ACHAT!M657,-1)+1","v":{"$error":"#NUM!"}},{"$f":"EOMONTH(ACHAT!L657,-1)+1","v":{"$error":"#NUM!"}}]
[null,{"$f":"EOMONTH(VENTE!A658,-1)+1","v":{"$error":"#NUM!"}},{"$f":"EOMONTH(VENTE!I658,-1)+1","v":{"$error":"#NUM!"}},{"$f":"EOMONTH(ACHAT!M658,-1)+1","v":{"$error":"#NUM!"}},{"$f":"EOMONTH(ACHAT!L658,-1)+1","v":{"$error":"#NUM!"}}]
[null,{"$f":"EOMONTH(VENTE!A659,-1)+1","v":{"$error":"#NUM!"}},{"$f":"EOMONTH(VENTE!I659,-1)+1","v":{"$error":"#NUM!"}},{"$f":"EOMONTH(ACHAT!M659,-1)+1","v":{"$error":"#NUM!"}},{"$f":"EOMONTH(ACHAT!L659,-1)+1","v":{"$error":"#NUM!"}}]
[null,{"$f":"EOMONTH(VENTE!A660,-1)+1","v":{"$error":"#NUM!"}},{"$f":"EOMONTH(VENTE!I660,-1)+1","v":{"$error":"#NUM!"}},{"$f":"EOMONTH(ACHAT!M660,-1)+1","v":{"$error":"#NUM!"}},{"$f":"EOMONTH(ACHAT!L660,-1)+1","v":{"$error":"#NUM!"}}]
[null,{"$f":"EOMONTH(VENTE!A661,-1)+1","v":{"$error":"#NUM!"}},{"$f":"EOMONTH(VENTE!I661,-1)+1","v":{"$error":"#NUM!"}},{"$f":"EOMONTH(ACHAT!M661,-1)+1","v":{"$error":"#NUM!"}},{"$f":"EOMONTH(ACHAT!L661,-1)+1","v":{"$error":"#NUM!"}}]
[null,{"$f":"EOMONTH(VENTE!A662,-1)+1","v":{"$error":"#NUM!"}},{"$f":"EOMONTH(VENTE!I662,-1)+1","v":{"$error":"#NUM!"}},{"$f":"EOMONTH(ACHAT!M662,-1)+1","v":{"$error":"#NUM!"}},{"$f":"EOMONTH(ACHAT!L662,-1)+1","v":{"$error":"#NUM!"}}]
[null,{"$f":"EOMONTH(VENTE!A663,-1)+1","v":{"$error":"#NUM!"}},{"$f":"EOMONTH(VENTE!I663,-1)+1","v":{"$error":"#NUM!"}},{"$f":"EOMONTH(ACHAT!M663,-1)+1","v":{"$error":"#NUM!"}},{"$f":"EOMONTH(ACHAT!L663,-1)+1","v":{"$error":"#NUM!"}}]
[null,{"$f":"EOMONTH(VENTE!A664,-1)+1","v":{"$error":"#NUM!"}},{"$f":"EOMONTH(VENTE!I664,-1)+1","v":{"$error":"#NUM!"}},{"$f":"EOMONTH(ACHAT!M664,-1)+1","v":{"$error":"#NUM!"}},{"$f":"EOMONTH(ACHAT!L664,-1)+1","v":{"$error":"#NUM!"}}]
[null,{"$f":"EOMONTH(VENTE!A665,-1)+1","v":{"$error":"#NUM!"}},{"$f":"EOMONTH(VENTE!I665,-1)+1","v":{"$error":"#NUM!"}},{"$f":"EOMONTH(ACHAT!M665,-1)+1","v":{"$error":"#NUM!"}},{"$f":"EOMONTH(ACHAT!L665,-1)+1","v":{"$error":"#NUM!"}}]
[null,{"$f":"EOMONTH(VENTE!A666,-1)+1","v":{"$error":"#NUM!"}},{"$f":"EOMONTH(VENTE!I666,-1)+1","v":{"$error":"#NUM!"}},{"$f":"EOMONTH(ACHAT!M666,-1)+1","v":{"$error":"#NUM!"}},{"$f":"EOMONTH(ACHAT!L666,-1)+1","v":{"$error":"#NUM!"}}]
[null,{"$f":"EOMONTH(VENTE!A667,-1)+1","v":{"$error":"#NUM!"}},{"$f":"EOMONTH(VENTE!I667,-1)+1","v":{"$error":"#NUM!"}},{"$f":"EOMONTH(ACHAT!M667,-1)+1","v":{"$error":"#NUM!"}},{"$f":"EOMONTH(ACHAT!L667,-1)+1","v":{"$error":"#NUM!"}}]
[null,{"$f":"EOMONTH(VENTE!A668,-1)+1","v":{"$error":"#NUM!"}},{"$f":"EOMONTH(VENTE!I668,-1)+1","v":{"$error":"#NUM!"}},{"$f":"EOMONTH(ACHAT!M668,-1)+1","v":{"$error":"#NUM!"}},{"$f":"EOMONTH(ACHAT!L668,-1)+1","v":{"$error":"#NUM!"}}]
[null,{"$f":"EOMONTH(VENTE!A669,-1)+1","v":{"$error":"#NUM!"}},{"$f":"EOMONTH(VENTE!I669,-1)+1","v":{"$error":"#NUM!"}},{"$f":"EOMONTH(ACHAT!M669,-1)+1","v":{"$error":"#NUM!"}},{"$f":"EOMONTH(ACHAT!L669,-1)+1","v":{"$error":"#NUM!"}}]
[null,{"$f":"EOMONTH(VENTE!A670,-1)+1","v":{"$error":"#NUM!"}},{"$f":"EOMONTH(VENTE!I670,-1)+1","v":{"$error":"#NUM!"}},{"$f":"EOMONTH(ACHAT!M670,-1)+1","v":{"$error":"#NUM!"}},{"$f":"EOMONTH(ACHAT!L670,-1)+1","v":{"$error":"#NUM!"}}]
[null,{"$f":"EOMONTH(VENTE!A671,-1)+1","v":{"$error":"#NUM!"}},{"$f":"EOMONTH(VENTE!I671,-1)+1","v":{"$error":"#NUM!"}},{"$f":"EOMONTH(ACHAT!M671,-1)+1","v":{"$error":"#NUM!"}},{"$f":"EOMONTH(ACHAT!L671,-1)+1","v":{"$error":"#NUM!"}}]
[null,{"$f":"EOMONTH(VENTE!A672,-1)+1","v":{"$error":"#NUM!"}},{"$f":"EOMONTH(VENTE!I672,-1)+1","v":{"$error":"#NUM!"}},{"$f":"EOMONTH(ACHAT!M672,-1)+1","v":{"$error":"#NUM!"}},{"$f":"EOMONTH(ACHAT!L672,-1)+1","v":{"$error":"#NUM!"}}]
[null,{"$f":"EOMONTH(VENTE!A673,-1)+1","v":{"$error":"#NUM!"}},{"$f":"EOMONTH(VENTE!I673,-1)+1","v":{"$error":"#NUM!"}},{"$f":"EOMONTH(ACHAT!M673,-1)+1","v":{"$error":"#NUM!"}},{"$f":"EOMONTH(ACHAT!L673,-1)+1","v":{"$error":"#NUM!"}}]
[null,{"$f":"EOMONTH(VENTE!A674,-1)+1","v":{"$error":"#NUM!"}},{"$f":"EOMONTH(VENTE!I674,-1)+1","v":{"$error":"#NUM!"}},{"$f":"EOMONTH(ACHAT!M674,-1)+1","v":{"$error":"#NUM!"}},{"$f":"EOMONTH(ACHAT!L674,-1)+1","v":{"$error":"#NUM!"}}]
[null,{"$f":"EOMONTH(VENTE!A675,-1)+1","v":{"$error":"#NUM!"}},{"$f":"EOMONTH(VENTE!I675,-1)+1","v":{"$error":"#NUM!"}},{"$f":"EOMONTH(ACHAT!M675,-1)+1","v":{"$error":"#NUM!"}},{"$f":"EOMONTH(ACHAT!L675,-1)+1","v":{"$error":"#NUM!"}}]
[null,{"$f":"EOMONTH(VENTE!A676,-1)+1","v":{"$error":"#NUM!"}},{"$f":"EOMONTH(VENTE!I676,-1)+1","v":{"$error":"#NUM!"}},{"$f":"EOMONTH(ACHAT!M676,-1)+1","v":{"$error":"#NUM!"}},{"$f":"EOMONTH(ACHAT!L676,-1)+1","v":{"$error":"#NUM!"}}]
[null,{"$f":"EOMONTH(VENTE!A677,-1)+1","v":{"$error":"#NUM!"}},{"$f":"EOMONTH(VENTE!I677,-1)+1","v":{"$error":"#NUM!"}},{"$f":"EOMONTH(ACHAT!M677,-1)+1","v":{"$error":"#NUM!"}},{"$f":"EOMONTH(ACHAT!L677,-1)+1","v":{"$error":"#NUM!"}}]
[null,{"$f":"EOMONTH(VENTE!A678,-1)+1","v":{"$error":"#NUM!"}},{"$f":"EOMONTH(VENTE!I678,-1)+1","v":{"$error":"#NUM!"}},{"$f":"EOMONTH(ACHAT!M678,-1)+1","v":{"$error":"#NUM!"}},{"$f":"EOMONTH(ACHAT!L678,-1)+1","v":{"$error":"#NUM!"}}]
[null,{"$f":"EOMONTH(VENTE!A679,-1)+1","v":{"$error":"#NUM!"}},{"$f":"EOMONTH(VENTE!I679,-1)+1","v":{"$error":"#NUM!"}},{"$f":"EOMONTH(ACHAT!M679,-1)+1","v":{"$error":"#NUM!"}},{"$f":"EOMONTH(ACHAT!L679,-1)+1","v":{"$error":"#NUM!"}}]
[null,{"$f":"EOMONTH(VENTE!A680,-1)+1","v":{"$error":"#NUM!"}},{"$f":"EOMONTH(VENTE!I680,-1)+1","v":{"$error":"#NUM!"}},{"$f":"EOMONTH(ACHAT!M680,-1)+1","v":{"$error":"#NUM!"}},{"$f":"EOMONTH(ACHAT!L680,-1)+1","v":{"$error":"#NUM!"}}]
[null,{"$f":"EOMONTH(VENTE!A681,-1)+1","v":{"$error":"#NUM!"}},{"$f":"EOMONTH(VENTE!I681,-1)+1","v":{"$error":"#NUM!"}},{"$f":"EOMONTH(ACHAT!M681,-1)+1","v":{"$error":"#NUM!"}},{"$f":"EOMONTH(ACHAT!L681,-1)+1","v":{"$error":"#NUM!"}}]
[null,{"$f":"EOMONTH(VENTE!A682,-1)+1","v":{"$error":"#NUM!"}},{"$f":"EOMONTH(VENTE!I682,-1)+1","v":{"$error":"#NUM!"}},{"$f":"EOMONTH(ACHAT!M682,-1)+1","v":{"$error":"#NUM!"}},{"$f":"EOMONTH(ACHAT!L682,-1)+1","v":{"$error":"#NUM!"}}]
[null,{"$f":"EOMONTH(VENTE!A683,-1)+1","v":{"$error":"#NUM!"}},{"$f":"EOMONTH(VENTE!I683,-1)+1","v":{"$error":"#NUM!"}},{"$f":"EOMONTH(ACHAT!M683,-1)+1","v":{"$error":"#NUM!"}},{"$f":"EOMONTH(ACHAT!L683,-1)+1","v":{"$error":"#NUM!"}}]
[null,{"$f":"EOMONTH(VENTE!A684,-1)+1","v":{"$error":"#NUM!"}},{"$f":"EOMONTH(VENTE!I684,-1)+1","v":{"$error":"#NUM!"}},{"$f":"EOMONTH(ACHAT!M684,-1)+1","v":{"$error":"#NUM!"}},{"$f":"EOMONTH(ACHAT!L684,-1)+1","v":{"$error":"#NUM!"}}]
[null,{"$f":"EOMONTH(VENTE!A685,-1)+1","v":{"$error":"#NUM!"}},{"$f":"EOMONTH(VENTE!I685,-1)+1","v":{"$error":"#NUM!"}},{"$f":"EOMONTH(ACHAT!M685,-1)+1","v":{"$error":"#NUM!"}},{"$f":"EOMONTH(ACHAT!L685,-1)+1","v":{"$error":"#NUM!"}}]
[null,{"$f":"EOMONTH(VENTE!A686,-1)+1","v":{"$error":"#NUM!"}},{"$f":"EOMONTH(VENTE!I686,-1)+1","v":{"$error":"#NUM!"}},{"$f":"EOMONTH(ACHAT!M686,-1)+1","v":{"$error":"#NUM!"}},{"$f":"EOMONTH(ACHAT!L686,-1)+1","v":{"$error":"#NUM!"}}]
[null,{"$f":"EOMONTH(VENTE!A687,-1)+1","v":{"$error":"#NUM!"}},{"$f":"EOMONTH(VENTE!I687,-1)+1","v":{"$error":"#NUM!"}},{"$f":"EOMONTH(ACHAT!M687,-1)+1","v":{"$error":"#NUM!"}},{"$f":"EOMONTH(ACHAT!L687,-1)+1","v":{"$error":"#NUM!"}}]
[null,{"$f":"EOMONTH(VENTE!A688,-1)+1","v":{"$error":"#NUM!"}},{"$f":"EOMONTH(VENTE!I688,-1)+1","v":{"$error":"#NUM!"}},{"$f":"EOMONTH(ACHAT!M688,-1)+1","v":{"$error":"#NUM!"}},{"$f":"EOMONTH(ACHAT!L688,-1)+1","v":{"$error":"#NUM!"}}]
[null,{"$f":"EOMONTH(VENTE!A689,-1)+1","v":{"$error":"#NUM!"}},{"$f":"EOMONTH(VENTE!I689,-1)+1","v":{"$error":"#NUM!"}},{"$f":"EOMONTH(ACHAT!M689,-1)+1","v":{"$error":"#NUM!"}},{"$f":"EOMONTH(ACHAT!L689,-1)+1","v":{"$error":"#NUM!"}}]
[null,{"$f":"EOMONTH(VENTE!A690,-1)+1","v":{"$error":"#NUM!"}},{"$f":"EOMONTH(VENTE!I690,-1)+1","v":{"$error":"#NUM!"}},{"$f":"EOMONTH(ACHAT!M690,-1)+1","v":{"$error":"#NUM!"}},{"$f":"EOMONTH(ACHAT!L690,-1)+1","v":{"$error":"#NUM!"}}]
[null,{"$f":"EOMONTH(VENTE!A691,-1)+1","v":{"$error":"#NUM!"}},{"$f":"EOMONTH(VENTE!I691,-1)+1","v":{"$error":"#NUM!"}},{"$f":"EOMONTH(ACHAT!M691,-1)+1","v":{"$error":"#NUM!"}},{"$f":"EOMONTH(ACHAT!L691,-1)+1","v":{"$error":"#NUM!"}}]
[null,{"$f":"EOMONTH(VENTE!A692,-1)+1","v":{"$error":"#NUM!"}},{"$f":"EOMONTH(VENTE!I692,-1)+1","v":{"$error":"#NUM!"}},{"$f":"EOMONTH(ACHAT!M692,-1)+1","v":{"$error":"#NUM!"}},{"$f":"EOMONTH(ACHAT!L692,-1)+1","v":{"$error":"#NUM!"}}]
[null,{"$f":"EOMONTH(VENTE!A693,-1)+1","v":{"$error":"#NUM!"}},{"$f":"EOMONTH(VENTE!I693,-1)+1","v":{"$error":"#NUM!"}},{"$f":"EOMONTH(ACHAT!M693,-1)+1","v":{"$error":"#NUM!"}},{"$f":"EOMONTH(ACHAT!L693,-1)+1","v":{"$error":"#NUM!"}}]
[null,{"$f":"EOMONTH(VENTE!A694,-1)+1","v":{"$error":"#NUM!"}},{"$f":"EOMONTH(VENTE!I694,-1)+1","v":{"$error":"#NUM!"}},{"$f":"EOMONTH(ACHAT!M694,-1)+1","v":{"$error":"#NUM!"}},{"$f":"EOMONTH(ACHAT!L694,-1)+1","v":{"$error":"#NUM!"}}]
[null,{"$f":"EOMONTH(VENTE!A695,-1)+1","v":{"$error":"#NUM!"}},{"$f":"EOMONTH(VENTE!I695,-1)+1","v":{"$error":"#NUM!"}},{"$f":"EOMONTH(ACHAT!M695,-1)+1","v":{"$error":"#NUM!"}},{"$f":"EOMONTH(ACHAT!L695,-1)+1","v":{"$error":"#NUM!"}}]
[null,{"$f":"EOMONTH(VENTE!A696,-1)+1","v":{"$error":"#NUM!"}},{"$f":"EOMONTH(VENTE!I696,-1)+1","v":{"$error":"#NUM!"}},{"$f":"EOMONTH(ACHAT!M696,-1)+1","v":{"$error":"#NUM!"}},{"$f":"EOMONTH(ACHAT!L696,-1)+1","v":{"$error":"#NUM!"}}]
[null,{"$f":"EOMONTH(VENTE!A697,-1)+1","v":{"$error":"#NUM!"}},{"$f":"EOMONTH(VENTE!I697,-1)+1","v":{"$error":"#NUM!"}},{"$f":"EOMONTH(ACHAT!M697,-1)+1","v":{"$error":"#NUM!"}},{"$f":"EOMONTH(ACHAT!L697,-1)+1","v":{"$error":"#NUM!"}}]
[null,{"$f":"EOMONTH(VENTE!A698,-1)+1","v":{"$error":"#NUM!"}},{"$f":"EOMONTH(VENTE!I698,-1)+1","v":{"$error":"#NUM!"}},{"$f":"EOMONTH(ACHAT!M698,-1)+1","v":{"$error":"#NUM!"}},{"$f":"EOMONTH(ACHAT!L698,-1)+1","v":{"$error":"#NUM!"}}]
[null,{"$f":"EOMONTH(VENTE!A699,-1)+1","v":{"$error":"#NUM!"}},{"$f":"EOMONTH(VENTE!I699,-1)+1","v":{"$error":"#NUM!"}},{"$f":"EOMONTH(ACHAT!M699,-1)+1","v":{"$error":"#NUM!"}},{"$f":"EOMONTH(ACHAT!L699,-1)+1","v":{"$error":"#NUM!"}}]
[null,{"$f":"EOMONTH(VENTE!A700,-1)+1","v":{"$error":"#NUM!"}},{"$f":"EOMONTH(VENTE!I700,-1)+1","v":{"$error":"#NUM!"}},{"$f":"EOMONTH(ACHAT!M700,-1)+1","v":{"$error":"#NUM!"}},{"$f":"EOMONTH(ACHAT!L700,-1)+1","v":{"$error":"#NUM!"}}]
[null,{"$f":"EOMONTH(VENTE!A701,-1)+1","v":{"$error":"#NUM!"}},{"$f":"EOMONTH(VENTE!I701,-1)+1","v":{"$error":"#NUM!"}},{"$f":"EOMONTH(ACHAT!M701,-1)+1","v":{"$error":"#NUM!"}},{"$f":"EOMONTH(ACHAT!L701,-1)+1","v":{"$error":"#NUM!"}}]
[null,{"$f":"EOMONTH(VENTE!A702,-1)+1","v":{"$error":"#NUM!"}},{"$f":"EOMONTH(VENTE!I702,-1)+1","v":{"$error":"#NUM!"}},{"$f":"EOMONTH(ACHAT!M702,-1)+1","v":{"$error":"#NUM!"}},{"$f":"EOMONTH(ACHAT!L702,-1)+1","v":{"$error":"#NUM!"}}]
[null,{"$f":"EOMONTH(VENTE!A703,-1)+1","v":{"$error":"#NUM!"}},{"$f":"EOMONTH(VENTE!I703,-1)+1","v":{"$error":"#NUM!"}},{"$f":"EOMONTH(ACHAT!M703,-1)+1","v":{"$error":"#NUM!"}},{"$f":"EOMONTH(ACHAT!L703,-1)+1","v":{"$error":"#NUM!"}}]
[null,{"$f":"EOMONTH(VENTE!A704,-1)+1","v":{"$error":"#NUM!"}},{"$f":"EOMONTH(VENTE!I704,-1)+1","v":{"$error":"#NUM!"}},{"$f":"EOMONTH(ACHAT!M704,-1)+1","v":{"$error":"#NUM!"}},{"$f":"EOMONTH(ACHAT!L704,-1)+1","v":{"$error":"#NUM!"}}]
[null,{"$f":"EOMONTH(VENTE!A705,-1)+1","v":{"$error":"#NUM!"}},{"$f":"EOMONTH(VENTE!I705,-1)+1","v":{"$error":"#NUM!"}},{"$f":"EOMONTH(ACHAT!M705,-1)+1","v":{"$error":"#NUM!"}},{"$f":"EOMONTH(ACHAT!L705,-1)+1","v":{"$error":"#NUM!"}}]
[null,{"$f":"EOMONTH(VENTE!A706,-1)+1","v":{"$error":"#NUM!"}},{"$f":"EOMONTH(VENTE!I706,-1)+1","v":{"$error":"#NUM!"}},{"$f":"EOMONTH(ACHAT!M706,-1)+1","v":{"$error":"#NUM!"}},{"$f":"EOMONTH(ACHAT!L706,-1)+1","v":{"$error":"#NUM!"}}]
[null,{"$f":"EOMONTH(VENTE!A707,-1)+1","v":{"$error":"#NUM!"}},{"$f":"EOMONTH(VENTE!I707,-1)+1","v":{"$error":"#NUM!"}},{"$f":"EOMONTH(ACHAT!M707,-1)+1","v":{"$error":"#NUM!"}},{"$f":"EOMONTH(ACHAT!L707,-1)+1","v":{"$error":"#NUM!"}}]
[null,{"$f":"EOMONTH(VENTE!A708,-1)+1","v":{"$error":"#NUM!"}},{"$f":"EOMONTH(VENTE!I708,-1)+1","v":{"$error":"#NUM!"}},{"$f":"EOMONTH(ACHAT!M708,-1)+1","v":{"$error":"#NUM!"}},{"$f":"EOMONTH(ACHAT!L708,-1)+1","v":{"$error":"#NUM!"}}]
[null,{"$f":"EOMONTH(VENTE!A709,-1)+1","v":{"$error":"#NUM!"}},{"$f":"EOMONTH(VENTE!I709,-1)+1","v":{"$error":"#NUM!"}},{"$f":"EOMONTH(ACHAT!M709,-1)+1","v":{"$error":"#NUM!"}},{"$f":"EOMONTH(ACHAT!L709,-1)+1","v":{"$error":"#NUM!"}}]
[null,{"$f":"EOMONTH(VENTE!A710,-1)+1","v":{"$error":"#NUM!"}},{"$f":"EOMONTH(VENTE!I710,-1)+1","v":{"$error":"#NUM!"}},{"$f":"EOMONTH(ACHAT!M710,-1)+1","v":{"$error":"#NUM!"}},{"$f":"EOMONTH(ACHAT!L710,-1)+1","v":{"$error":"#NUM!"}}]
[null,{"$f":"EOMONTH(VENTE!A711,-1)+1","v":{"$error":"#NUM!"}},{"$f":"EOMONTH(VENTE!I711,-1)+1","v":{"$error":"#NUM!"}},{"$f":"EOMONTH(ACHAT!M711,-1)+1","v":{"$error":"#NUM!"}},{"$f":"EOMONTH(ACHAT!L711,-1)+1","v":{"$error":"#NUM!"}}]
[null,{"$f":"EOMONTH(VENTE!A712,-1)+1","v":{"$error":"#NUM!"}},{"$f":"EOMONTH(VENTE!I712,-1)+1","v":{"$error":"#NUM!"}},{"$f":"EOMONTH(ACHAT!M712,-1)+1","v":{"$error":"#NUM!"}},{"$f":"EOMONTH(ACHAT!L712,-1)+1","v":{"$error":"#NUM!"}}]
[null,{"$f":"EOMONTH(VENTE!A713,-1)+1","v":{"$error":"#NUM!"}},{"$f":"EOMONTH(VENTE!I713,-1)+1","v":{"$error":"#NUM!"}},{"$f":"EOMONTH(ACHAT!M713,-1)+1","v":{"$error":"#NUM!"}},{"$f":"EOMONTH(ACHAT!L713,-1)+1","v":{"$error":"#NUM!"}}]
[null,{"$f":"EOMONTH(VENTE!A714,-1)+1","v":{"$error":"#NUM!"}},{"$f":"EOMONTH(VENTE!I714,-1)+1","v":{"$error":"#NUM!"}},{"$f":"EOMONTH(ACHAT!M714,-1)+1","v":{"$error":"#NUM!"}},{"$f":"EOMONTH(ACHAT!L714,-1)+1","v":{"$error":"#NUM!"}}]
[null,{"$f":"EOMONTH(VENTE!A715,-1)+1","v":{"$error":"#NUM!"}},{"$f":"EOMONTH(VENTE!I715,-1)+1","v":{"$error":"#NUM!"}},{"$f":"EOMONTH(ACHAT!M715,-1)+1","v":{"$error":"#NUM!"}},{"$f":"EOMONTH(ACHAT!L715,-1)+1","v":{"$error":"#NUM!"}}]
[null,{"$f":"EOMONTH(VENTE!A716,-1)+1","v":{"$error":"#NUM!"}},{"$f":"EOMONTH(VENTE!I716,-1)+1","v":{"$error":"#NUM!"}},{"$f":"EOMONTH(ACHAT!M716,-1)+1","v":{"$error":"#NUM!"}},{"$f":"EOMONTH(ACHAT!L716,-1)+1","v":{"$error":"#NUM!"}}]
[null,{"$f":"EOMONTH(VENTE!A717,-1)+1","v":{"$error":"#NUM!"}},{"$f":"EOMONTH(VENTE!I717,-1)+1","v":{"$error":"#NUM!"}},{"$f":"EOMONTH(ACHAT!M717,-1)+1","v":{"$error":"#NUM!"}},{"$f":"EOMONTH(ACHAT!L717,-1)+1","v":{"$error":"#NUM!"}}]
[null,{"$f":"EOMONTH(VENTE!A718,-1)+1","v":{"$error":"#NUM!"}},{"$f":"EOMONTH(VENTE!I718,-1)+1","v":{"$error":"#NUM!"}},{"$f":"EOMONTH(ACHAT!M718,-1)+1","v":{"$error":"#NUM!"}},{"$f":"EOMONTH(ACHAT!L718,-1)+1","v":{"$error":"#NUM!"}}]
[null,{"$f":"EOMONTH(VENTE!A719,-1)+1","v":{"$error":"#NUM!"}},{"$f":"EOMONTH(VENTE!I719,-1)+1","v":{"$error":"#NUM!"}},{"$f":"EOMONTH(ACHAT!M719,-1)+1","v":{"$error":"#NUM!"}},{"$f":"EOMONTH(ACHAT!L719,-1)+1","v":{"$error":"#NUM!"}}]
[null,{"$f":"EOMONTH(VENTE!A720,-1)+1","v":{"$error":"#NUM!"}},{"$f":"EOMONTH(VENTE!I720,-1)+1","v":{"$error":"#NUM!"}},{"$f":"EOMONTH(ACHAT!M720,-1)+1","v":{"$error":"#NUM!"}},{"$f":"EOMONTH(ACHAT!L720,-1)+1","v":{"$error":"#NUM!"}}]
[null,{"$f":"EOMONTH(VENTE!A721,-1)+1","v":{"$error":"#NUM!"}},{"$f":"EOMONTH(VENTE!I721,-1)+1","v":{"$error":"#NUM!"}},{"$f":"EOMONTH(ACHAT!M721,-1)+1","v":{"$error":"#NUM!"}},{"$f":"EOMONTH(ACHAT!L721,-1)+1","v":{"$error":"#NUM!"}}]
[null,{"$f":"EOMONTH(VENTE!A722,-1)+1","v":{"$error":"#NUM!"}},{"$f":"EOMONTH(VENTE!I722,-1)+1","v":{"$error":"#NUM!"}},{"$f":"EOMONTH(ACHAT!M722,-1)+1","v":{"$error":"#NUM!"}},{"$f":"EOMONTH(ACHAT!L722,-1)+1","v":{"$error":"#NUM!"}}]
[null,{"$f":"EOMONTH(VENTE!A723,-1)+1","v":{"$error":"#NUM!"}},{"$f":"EOMONTH(VENTE!I723,-1)+1","v":{"$error":"#NUM!"}},{"$f":"EOMONTH(ACHAT!M723,-1)+1","v":{"$error":"#NUM!"}},{"$f":"EOMONTH(ACHAT!L723,-1)+1","v":{"$error":"#NUM!"}}]
[null,{"$f":"EOMONTH(VENTE!A724,-1)+1","v":{"$error":"#NUM!"}},{"$f":"EOMONTH(VENTE!I724,-1)+1","v":{"$error":"#NUM!"}},{"$f":"EOMONTH(ACHAT!M724,-1)+1","v":{"$error":"#NUM!"}},{"$f":"EOMONTH(ACHAT!L724,-1)+1","v":{"$error":"#NUM!"}}]
[null,{"$f":"EOMONTH(VENTE!A725,-1)+1","v":{"$error":"#NUM!"}},{"$f":"EOMONTH(VENTE!I725,-1)+1","v":{"$error":"#NUM!"}},{"$f":"EOMONTH(ACHAT!M725,-1)+1","v":{"$error":"#NUM!"}},{"$f":"EOMONTH(ACHAT!L725,-1)+1","v":{"$error":"#NUM!"}}]
[null,{"$f":"EOMONTH(VENTE!A726,-1)+1","v":{"$error":"#NUM!"}},{"$f":"EOMONTH(VENTE!I726,-1)+1","v":{"$error":"#NUM!"}},{"$f":"EOMONTH(ACHAT!M726,-1)+1","v":{"$error":"#NUM!"}},{"$f":"EOMONTH(ACHAT!L726,-1)+1","v":{"$error":"#NUM!"}}]
[null,{"$f":"EOMONTH(VENTE!A727,-1)+1","v":{"$error":"#NUM!"}},{"$f":"EOMONTH(VENTE!I727,-1)+1","v":{"$error":"#NUM!"}},{"$f":"EOMONTH(ACHAT!M727,-1)+1","v":{"$error":"#NUM!"}},{"$f":"EOMONTH(ACHAT!L727,-1)+1","v":{"$error":"#NUM!"}}]
[null,{"$f":"EOMONTH(VENTE!A728,-1)+1","v":{"$error":"#NUM!"}},{"$f":"EOMONTH(VENTE!I728,-1)+1","v":{"$error":"#NUM!"}},{"$f":"EOMONTH(ACHAT!M728,-1)+1","v":{"$error":"#NUM!"}},{"$f":"EOMONTH(ACHAT!L728,-1)+1","v":{"$error":"#NUM!"}}]
[null,{"$f":"EOMONTH(VENTE!A729,-1)+1","v":{"$error":"#NUM!"}},{"$f":"EOMONTH(VENTE!I729,-1)+1","v":{"$error":"#NUM!"}},{"$f":"EOMONTH(ACHAT!M729,-1)+1","v":{"$error":"#NUM!"}},{"$f":"EOMONTH(ACHAT!L729,-1)+1","v":{"$error":"#NUM!"}}]
[null,{"$f":"EOMONTH(VENTE!A730,-1)+1","v":{"$error":"#NUM!"}},{"$f":"EOMONTH(VENTE!I730,-1)+1","v":{"$error":"#NUM!"}},{"$f":"EOMONTH(ACHAT!M730,-1)+1","v":{"$error":"#NUM!"}},{"$f":"EOMONTH(ACHAT!L730,-1)+1","v":{"$error":"#NUM!"}}]
[null,{"$f":"EOMONTH(VENTE!A731,-1)+1","v":{"$error":"#NUM!"}},{"$f":"EOMONTH(VENTE!I731,-1)+1","v":{"$error":"#NUM!"}},{"$f":"EOMONTH(ACHAT!M731,-1)+1","v":{"$error":"#NUM!"}},{"$f":"EOMONTH(ACHAT!L731,-1)+1","v":{"$error":"#NUM!"}}]
[null,{"$f":"EOMONTH(VENTE!A732,-1)+1","v":{"$error":"#NUM!"}},{"$f":"EOMONTH(VENTE!I732,-1)+1","v":{"$error":"#NUM!"}},{"$f":"EOMONTH(ACHAT!M732,-1)+1","v":{"$error":"#NUM!"}},{"$f":"EOMONTH(ACHAT!L732,-1)+1","v":{"$error":"#NUM!"}}]
[null,{"$f":"EOMONTH(VENTE!A733,-1)+1","v":{"$error":"#NUM!"}},{"$f":"EOMONTH(VENTE!I733,-1)+1","v":{"$error":"#NUM!"}},{"$f":"EOMONTH(ACHAT!M733,-1)+1","v":{"$error":"#NUM!"}},{"$f":"EOMONTH(ACHAT!L733,-1)+1","v":{"$error":"#NUM!"}}]
[null,{"$f":"EOMONTH(VENTE!A734,-1)+1","v":{"$error":"#NUM!"}},{"$f":"EOMONTH(VENTE!I734,-1)+1","v":{"$error":"#NUM!"}},{"$f":"EOMONTH(ACHAT!M734,-1)+1","v":{"$error":"#NUM!"}},{"$f":"EOMONTH(ACHAT!L734,-1)+1","v":{"$error":"#NUM!"}}]
[null,{"$f":"EOMONTH(VENTE!A735,-1)+1","v":{"$error":"#NUM!"}},{"$f":"EOMONTH(VENTE!I735,-1)+1","v":{"$error":"#NUM!"}},{"$f":"EOMONTH(ACHAT!M735,-1)+1","v":{"$error":"#NUM!"}},{"$f":"EOMONTH(ACHAT!L735,-1)+1","v":{"$error":"#NUM!"}}]
[null,{"$f":"EOMONTH(VENTE!A736,-1)+1","v":{"$error":"#NUM!"}},{"$f":"EOMONTH(VENTE!I736,-1)+1","v":{"$error":"#NUM!"}},{"$f":"EOMONTH(ACHAT!M736,-1)+1","v":{"$error":"#NUM!"}},{"$f":"EOMONTH(ACHAT!L736,-1)+1","v":{"$error":"#NUM!"}}]
[null,{"$f":"EOMONTH(VENTE!A737,-1)+1","v":{"$error":"#NUM!"}},{"$f":"EOMONTH(VENTE!I737,-1)+1","v":{"$error":"#NUM!"}},{"$f":"EOMONTH(ACHAT!M737,-1)+1","v":{"$error":"#NUM!"}},{"$f":"EOMONTH(ACHAT!L737,-1)+1","v":{"$error":"#NUM!"}}]
[null,{"$f":"EOMONTH(VENTE!A738,-1)+1","v":{"$error":"#NUM!"}},{"$f":"EOMONTH(VENTE!I738,-1)+1","v":{"$error":"#NUM!"}},{"$f":"EOMONTH(ACHAT!M738,-1)+1","v":{"$error":"#NUM!"}},{"$f":"EOMONTH(ACHAT!L738,-1)+1","v":{"$error":"#NUM!"}}]
[null,{"$f":"EOMONTH(VENTE!A739,-1)+1","v":{"$error":"#NUM!"}},{"$f":"EOMONTH(VENTE!I739,-1)+1","v":{"$error":"#NUM!"}},{"$f":"EOMONTH(ACHAT!M739,-1)+1","v":{"$error":"#NUM!"}},{"$f":"EOMONTH(ACHAT!L739,-1)+1","v":{"$error":"#NUM!"}}]
[null,{"$f":"EOMONTH(VENTE!A740,-1)+1","v":{"$error":"#NUM!"}},{"$f":"EOMONTH(VENTE!I740,-1)+1","v":{"$error":"#NUM!"}},{"$f":"EOMONTH(ACHAT!M740,-1)+1","v":{"$error":"#NUM!"}},{"$f":"EOMONTH(ACHAT!L740,-1)+1","v":{"$error":"#NUM!"}}]
[null,{"$f":"EOMONTH(VENTE!A741,-1)+1","v":{"$error":"#NUM!"}},{"$f":"EOMONTH(VENTE!I741,-1)+1","v":{"$error":"#NUM!"}},{"$f":"EOMONTH(ACHAT!M741,-1)+1","v":{"$error":"#NUM!"}},{"$f":"EOMONTH(ACHAT!L741,-1)+1","v":{"$error":"#NUM!"}}]
[null,{"$f":"EOMONTH(VENTE!A742,-1)+1","v":{"$error":"#NUM!"}},{"$f":"EOMONTH(VENTE!I742,-1)+1","v":{"$error":"#NUM!"}},{"$f":"EOMONTH(ACHAT!M742,-1)+1","v":{"$error":"#NUM!"}},{"$f":"EOMONTH(ACHAT!L742,-1)+1","v":{"$error":"#NUM!"}}]
[null,{"$f":"EOMONTH(VENTE!A743,-1)+1","v":{"$error":"#NUM!"}},{"$f":"EOMONTH(VENTE!I743,-1)+1","v":{"$error":"#NUM!"}},{"$f":"EOMONTH(ACHAT!M743,-1)+1","v":{"$error":"#NUM!"}},{"$f":"EOMONTH(ACHAT!L743,-1)+1","v":{"$error":"#NUM!"}}]
[null,{"$f":"EOMONTH(VENTE!A744,-1)+1","v":{"$error":"#NUM!"}},{"$f":"EOMONTH(VENTE!I744,-1)+1","v":{"$error":"#NUM!"}},{"$f":"EOMONTH(ACHAT!M744,-1)+1","v":{"$error":"#NUM!"}},{"$f":"EOMONTH(ACHAT!L744,-1)+1","v":{"$error":"#NUM!"}}]
[null,{"$f":"EOMONTH(VENTE!A745,-1)+1","v":{"$error":"#NUM!"}},{"$f":"EOMONTH(VENTE!I745,-1)+1","v":{"$error":"#NUM!"}},{"$f":"EOMONTH(ACHAT!M745,-1)+1","v":{"$error":"#NUM!"}},{"$f":"EOMONTH(ACHAT!L745,-1)+1","v":{"$error":"#NUM!"}}]
[null,{"$f":"EOMONTH(VENTE!A746,-1)+1","v":{"$error":"#NUM!"}},{"$f":"EOMONTH(VENTE!I746,-1)+1","v":{"$error":"#NUM!"}},{"$f":"EOMONTH(ACHAT!M746,-1)+1","v":{"$error":"#NUM!"}},{"$f":"EOMONTH(ACHAT!L746,-1)+1","v":{"$error":"#NUM!"}}]
[null,{"$f":"EOMONTH(VENTE!A747,-1)+1","v":{"$error":"#NUM!"}},{"$f":"EOMONTH(VENTE!I747,-1)+1","v":{"$error":"#NUM!"}},{"$f":"EOMONTH(ACHAT!M747,-1)+1","v":{"$error":"#NUM!"}},{"$f":"EOMONTH(ACHAT!L747,-1)+1","v":{"$error":"#NUM!"}}]
[null,{"$f":"EOMONTH(VENTE!A748,-1)+1","v":{"$error":"#NUM!"}},{"$f":"EOMONTH(VENTE!I748,-1)+1","v":{"$error":"#NUM!"}},{"$f":"EOMONTH(ACHAT!M748,-1)+1","v":{"$error":"#NUM!"}},{"$f":"EOMONTH(ACHAT!L748,-1)+1","v":{"$error":"#NUM!"}}]
[null,{"$f":"EOMONTH(VENTE!A749,-1)+1","v":{"$error":"#NUM!"}},{"$f":"EOMONTH(VENTE!I749,-1)+1","v":{"$error":"#NUM!"}},{"$f":"EOMONTH(ACHAT!M749,-1)+1","v":{"$error":"#NUM!"}},{"$f":"EOMONTH(ACHAT!L749,-1)+1","v":{"$error":"#NUM!"}}]
[null,{"$f":"EOMONTH(VENTE!A750,-1)+1","v":{"$error":"#NUM!"}},{"$f":"EOMONTH(VENTE!I750,-1)+1","v":{"$error":"#NUM!"}},{"$f":"EOMONTH(ACHAT!M750,-1)+1","v":{"$error":"#NUM!"}},{"$f":"EOMONTH(ACHAT!L750,-1)+1","v":{"$error":"#NUM!"}}]
[null,{"$f":"EOMONTH(VENTE!A751,-1)+1","v":{"$error":"#NUM!"}},{"$f":"EOMONTH(VENTE!I751,-1)+1","v":{"$error":"#NUM!"}},{"$f":"EOMONTH(ACHAT!M751,-1)+1","v":{"$error":"#NUM!"}},{"$f":"EOMONTH(ACHAT!L751,-1)+1","v":{"$error":"#NUM!"}}]
[null,{"$f":"EOMONTH(VENTE!A752,-1)+1","v":{"$error":"#NUM!"}},{"$f":"EOMONTH(VENTE!I752,-1)+1","v":{"$error":"#NUM!"}},{"$f":"EOMONTH(ACHAT!M752,-1)+1","v":{"$error":"#NUM!"}},{"$f":"EOMONTH(ACHAT!L752,-1)+1","v":{"$error":"#NUM!"}}]
[null,{"$f":"EOMONTH(VENTE!A753,-1)+1","v":{"$error":"#NUM!"}},{"$f":"EOMONTH(VENTE!I753,-1)+1","v":{"$error":"#NUM!"}},{"$f":"EOMONTH(ACHAT!M753,-1)+1","v":{"$error":"#NUM!"}},{"$f":"EOMONTH(ACHAT!L753,-1)+1","v":{"$error":"#NUM!"}}]
[null,{"$f":"EOMONTH(VENTE!A754,-1)+1","v":{"$error":"#NUM!"}},{"$f":"EOMONTH(VENTE!I754,-1)+1","v":{"$error":"#NUM!"}},{"$f":"EOMONTH(ACHAT!M754,-1)+1","v":{"$error":"#NUM!"}},{"$f":"EOMONTH(ACHAT!L754,-1)+1","v":{"$error":"#NUM!"}}]
[null,{"$f":"EOMONTH(VENTE!A755,-1)+1","v":{"$error":"#NUM!"}},{"$f":"EOMONTH(VENTE!I755,-1)+1","v":{"$error":"#NUM!"}},{"$f":"EOMONTH(ACHAT!M755,-1)+1","v":{"$error":"#NUM!"}},{"$f":"EOMONTH(ACHAT!L755,-1)+1","v":{"$error":"#NUM!"}}]
[null,{"$f":"EOMONTH(VENTE!A756,-1)+1","v":{"$error":"#NUM!"}},{"$f":"EOMONTH(VENTE!I756,-1)+1","v":{"$error":"#NUM!"}},{"$f":"EOMONTH(ACHAT!M756,-1)+1","v":{"$error":"#NUM!"}},{"$f":"EOMONTH(ACHAT!L756,-1)+1","v":{"$error":"#NUM!"}}]
[null,{"$f":"EOMONTH(VENTE!A757,-1)+1","v":{"$error":"#NUM!"}},{"$f":"EOMONTH(VENTE!I757,-1)+1","v":{"$error":"#NUM!"}},{"$f":"EOMONTH(ACHAT!M757,-1)+1","v":{"$error":"#NUM!"}},{"$f":"EOMONTH(ACHAT!L757,-1)+1","v":{"$error":"#NUM!"}}]
[null,{"$f":"EOMONTH(VENTE!A758,-1)+1","v":{"$error":"#NUM!"}},{"$f":"EOMONTH(VENTE!I758,-1)+1","v":{"$error":"#NUM!"}},{"$f":"EOMONTH(ACHAT!M758,-1)+1","v":{"$error":"#NUM!"}},{"$f":"EOMONTH(ACHAT!L758,-1)+1","v":{"$error":"#NUM!"}}]
[null,{"$f":"EOMONTH(VENTE!A759,-1)+1","v":{"$error":"#NUM!"}},{"$f":"EOMONTH(VENTE!I759,-1)+1","v":{"$error":"#NUM!"}},{"$f":"EOMONTH(ACHAT!M759,-1)+1","v":{"$error":"#NUM!"}},{"$f":"EOMONTH(ACHAT!L759,-1)+1","v":{"$error":"#NUM!"}}]
[null,{"$f":"EOMONTH(VENTE!A760,-1)+1","v":{"$error":"#NUM!"}},{"$f":"EOMONTH(VENTE!I760,-1)+1","v":{"$error":"#NUM!"}},{"$f":"EOMONTH(ACHAT!M760,-1)+1","v":{"$error":"#NUM!"}},{"$f":"EOMONTH(ACHAT!L760,-1)+1","v":{"$error":"#NUM!"}}]
[null,{"$f":"EOMONTH(VENTE!A761,-1)+1","v":{"$error":"#NUM!"}},{"$f":"EOMONTH(VENTE!I761,-1)+1","v":{"$error":"#NUM!"}},{"$f":"EOMONTH(ACHAT!M761,-1)+1","v":{"$error":"#NUM!"}},{"$f":"EOMONTH(ACHAT!L761,-1)+1","v":{"$error":"#NUM!"}}]
[null,{"$f":"EOMONTH(VENTE!A762,-1)+1","v":{"$error":"#NUM!"}},{"$f":"EOMONTH(VENTE!I762,-1)+1","v":{"$error":"#NUM!"}},{"$f":"EOMONTH(ACHAT!M762,-1)+1","v":{"$error":"#NUM!"}},{"$f":"EOMONTH(ACHAT!L762,-1)+1","v":{"$error":"#NUM!"}}]
[null,{"$f":"EOMONTH(VENTE!A763,-1)+1","v":{"$error":"#NUM!"}},{"$f":"EOMONTH(VENTE!I763,-1)+1","v":{"$error":"#NUM!"}},{"$f":"EOMONTH(ACHAT!M763,-1)+1","v":{"$error":"#NUM!"}},{"$f":"EOMONTH(ACHAT!L763,-1)+1","v":{"$error":"#NUM!"}}]
[null,{"$f":"EOMONTH(VENTE!A764,-1)+1","v":{"$error":"#NUM!"}},{"$f":"EOMONTH(VENTE!I764,-1)+1","v":{"$error":"#NUM!"}},{"$f":"EOMONTH(ACHAT!M764,-1)+1","v":{"$error":"#NUM!"}},{"$f":"EOMONTH(ACHAT!L764,-1)+1","v":{"$error":"#NUM!"}}]
[null,{"$f":"EOMONTH(VENTE!A765,-1)+1","v":{"$error":"#NUM!"}},{"$f":"EOMONTH(VENTE!I765,-1)+1","v":{"$error":"#NUM!"}},{"$f":"EOMONTH(ACHAT!M765,-1)+1","v":{"$error":"#NUM!"}},{"$f":"EOMONTH(ACHAT!L765,-1)+1","v":{"$error":"#NUM!"}}]
[null,{"$f":"EOMONTH(VENTE!A766,-1)+1","v":{"$error":"#NUM!"}},{"$f":"EOMONTH(VENTE!I766,-1)+1","v":{"$error":"#NUM!"}},{"$f":"EOMONTH(ACHAT!M766,-1)+1","v":{"$error":"#NUM!"}},{"$f":"EOMONTH(ACHAT!L766,-1)+1","v":{"$error":"#NUM!"}}]
[null,{"$f":"EOMONTH(VENTE!A767,-1)+1","v":{"$error":"#NUM!"}},{"$f":"EOMONTH(VENTE!I767,-1)+1","v":{"$error":"#NUM!"}},{"$f":"EOMONTH(ACHAT!M767,-1)+1","v":{"$error":"#NUM!"}},{"$f":"EOMONTH(ACHAT!L767,-1)+1","v":{"$error":"#NUM!"}}]
[null,{"$f":"EOMONTH(VENTE!A768,-1)+1","v":{"$error":"#NUM!"}},{"$f":"EOMONTH(VENTE!I768,-1)+1","v":{"$error":"#NUM!"}},{"$f":"EOMONTH(ACHAT!M768,-1)+1","v":{"$error":"#NUM!"}},{"$f":"EOMONTH(ACHAT!L768,-1)+1","v":{"$error":"#NUM!"}}]
[null,{"$f":"EOMONTH(VENTE!A769,-1)+1","v":{"$error":"#NUM!"}},{"$f":"EOMONTH(VENTE!I769,-1)+1","v":{"$error":"#NUM!"}},{"$f":"EOMONTH(ACHAT!M769,-1)+1","v":{"$error":"#NUM!"}},{"$f":"EOMONTH(ACHAT!L769,-1)+1","v":{"$error":"#NUM!"}}]
[null,{"$f":"EOMONTH(VENTE!A770,-1)+1","v":{"$error":"#NUM!"}},{"$f":"EOMONTH(VENTE!I770,-1)+1","v":{"$error":"#NUM!"}},{"$f":"EOMONTH(ACHAT!M770,-1)+1","v":{"$error":"#NUM!"}},{"$f":"EOMONTH(ACHAT!L770,-1)+1","v":{"$error":"#NUM!"}}]
[null,{"$f":"EOMONTH(VENTE!A771,-1)+1","v":{"$error":"#NUM!"}},{"$f":"EOMONTH(VENTE!I771,-1)+1","v":{"$error":"#NUM!"}},{"$f":"EOMONTH(ACHAT!M771,-1)+1","v":{"$error":"#NUM!"}},{"$f":"EOMONTH(ACHAT!L771,-1)+1","v":{"$error":"#NUM!"}}]
[null,{"$f":"EOMONTH(VENTE!A772,-1)+1","v":{"$error":"#NUM!"}},{"$f":"EOMONTH(VENTE!I772,-1)+1","v":{"$error":"#NUM!"}},{"$f":"EOMONTH(ACHAT!M772,-1)+1","v":{"$error":"#NUM!"}},{"$f":"EOMONTH(ACHAT!L772,-1)+1","v":{"$error":"#NUM!"}}]
[null,{"$f":"EOMONTH(VENTE!A773,-1)+1","v":{"$error":"#NUM!"}},{"$f":"EOMONTH(VENTE!I773,-1)+1","v":{"$error":"#NUM!"}},{"$f":"EOMONTH(ACHAT!M773,-1)+1","v":{"$error":"#NUM!"}},{"$f":"EOMONTH(ACHAT!L773,-1)+1","v":{"$error":"#NUM!"}}]
[null,{"$f":"EOMONTH(VENTE!A774,-1)+1","v":{"$error":"#NUM!"}},{"$f":"EOMONTH(VENTE!I774,-1)+1","v":{"$error":"#NUM!"}},{"$f":"EOMONTH(ACHAT!M774,-1)+1","v":{"$error":"#NUM!"}},{"$f":"EOMONTH(ACHAT!L774,-1)+1","v":{"$error":"#NUM!"}}]
[null,{"$f":"EOMONTH(VENTE!A775,-1)+1","v":{"$error":"#NUM!"}},{"$f":"EOMONTH(VENTE!I775,-1)+1","v":{"$error":"#NUM!"}},{"$f":"EOMONTH(ACHAT!M775,-1)+1","v":{"$error":"#NUM!"}},{"$f":"EOMONTH(ACHAT!L775,-1)+1","v":{"$error":"#NUM!"}}]
[null,{"$f":"EOMONTH(VENTE!A776,-1)+1","v":{"$error":"#NUM!"}},{"$f":"EOMONTH(VENTE!I776,-1)+1","v":{"$error":"#NUM!"}},{"$f":"EOMONTH(ACHAT!M776,-1)+1","v":{"$error":"#NUM!"}},{"$f":"EOMONTH(ACHAT!L776,-1)+1","v":{"$error":"#NUM!"}}]
[null,{"$f":"EOMONTH(VENTE!A777,-1)+1","v":{"$error":"#NUM!"}},{"$f":"EOMONTH(VENTE!I777,-1)+1","v":{"$error":"#NUM!"}},{"$f":"EOMONTH(ACHAT!M777,-1)+1","v":{"$error":"#NUM!"}},{"$f":"EOMONTH(ACHAT!L777,-1)+1","v":{"$error":"#NUM!"}}]
[null,{"$f":"EOMONTH(VENTE!A778,-1)+1","v":{"$error":"#NUM!"}},{"$f":"EOMONTH(VENTE!I778,-1)+1","v":{"$error":"#NUM!"}},{"$f":"EOMONTH(ACHAT!M778,-1)+1","v":{"$error":"#NUM!"}},{"$f":"EOMONTH(ACHAT!L778,-1)+1","v":{"$error":"#NUM!"}}]
[null,{"$f":"EOMONTH(VENTE!A779,-1)+1","v":{"$error":"#NUM!"}},{"$f":"EOMONTH(VENTE!I779,-1)+1","v":{"$error":"#NUM!"}},{"$f":"EOMONTH(ACHAT!M779,-1)+1","v":{"$error":"#NUM!"}},{"$f":"EOMONTH(ACHAT!L779,-1)+1","v":{"$error":"#NUM!"}}]
[null,{"$f":"EOMONTH(VENTE!A780,-1)+1","v":{"$error":"#NUM!"}},{"$f":"EOMONTH(VENTE!I780,-1)+1","v":{"$error":"#NUM!"}},{"$f":"EOMONTH(ACHAT!M780,-1)+1","v":{"$error":"#NUM!"}},{"$f":"EOMONTH(ACHAT!L780,-1)+1","v":{"$error":"#NUM!"}}]
[null,{"$f":"EOMONTH(VENTE!A781,-1)+1","v":{"$error":"#NUM!"}},{"$f":"EOMONTH(VENTE!I781,-1)+1","v":{"$error":"#NUM!"}},{"$f":"EOMONTH(ACHAT!M781,-1)+1","v":{"$error":"#NUM!"}},{"$f":"EOMONTH(ACHAT!L781,-1)+1","v":{"$error":"#NUM!"}}]
[null,{"$f":"EOMONTH(VENTE!A782,-1)+1","v":{"$error":"#NUM!"}},{"$f":"EOMONTH(VENTE!I782,-1)+1","v":{"$error":"#NUM!"}},{"$f":"EOMONTH(ACHAT!M782,-1)+1","v":{"$error":"#NUM!"}},{"$f":"EOMONTH(ACHAT!L782,-1)+1","v":{"$error":"#NUM!"}}]
[null,{"$f":"EOMONTH(VENTE!A783,-1)+1","v":{"$error":"#NUM!"}},{"$f":"EOMONTH(VENTE!I783,-1)+1","v":{"$error":"#NUM!"}},{"$f":"EOMONTH(ACHAT!M783,-1)+1","v":{"$error":"#NUM!"}},{"$f":"EOMONTH(ACHAT!L783,-1)+1","v":{"$error":"#NUM!"}}]
[null,{"$f":"EOMONTH(VENTE!A784,-1)+1","v":{"$error":"#NUM!"}},{"$f":"EOMONTH(VENTE!I784,-1)+1","v":{"$error":"#NUM!"}},{"$f":"EOMONTH(ACHAT!M784,-1)+1","v":{"$error":"#NUM!"}},{"$f":"EOMONTH(ACHAT!L784,-1)+1","v":{"$error":"#NUM!"}}]
[null,{"$f":"EOMONTH(VENTE!A785,-1)+1","v":{"$error":"#NUM!"}},{"$f":"EOMONTH(VENTE!I785,-1)+1","v":{"$error":"#NUM!"}},{"$f":"EOMONTH(ACHAT!M785,-1)+1","v":{"$error":"#NUM!"}},{"$f":"EOMONTH(ACHAT!L785,-1)+1","v":{"$error":"#NUM!"}}]
[null,{"$f":"EOMONTH(VENTE!A786,-1)+1","v":{"$error":"#NUM!"}},{"$f":"EOMONTH(VENTE!I786,-1)+1","v":{"$error":"#NUM!"}},{"$f":"EOMONTH(ACHAT!M786,-1)+1","v":{"$error":"#NUM!"}},{"$f":"EOMONTH(ACHAT!L786,-1)+1","v":{"$error":"#NUM!"}}]
[null,{"$f":"EOMONTH(VENTE!A787,-1)+1","v":{"$error":"#NUM!"}},{"$f":"EOMONTH(VENTE!I787,-1)+1","v":{"$error":"#NUM!"}},{"$f":"EOMONTH(ACHAT!M787,-1)+1","v":{"$error":"#NUM!"}},{"$f":"EOMONTH(ACHAT!L787,-1)+1","v":{"$error":"#NUM!"}}]
[null,{"$f":"EOMONTH(VENTE!A788,-1)+1","v":{"$error":"#NUM!"}},{"$f":"EOMONTH(VENTE!I788,-1)+1","v":{"$error":"#NUM!"}},{"$f":"EOMONTH(ACHAT!M788,-1)+1","v":{"$error":"#NUM!"}},{"$f":"EOMONTH(ACHAT!L788,-1)+1","v":{"$error":"#NUM!"}}]
[null,{"$f":"EOMONTH(VENTE!A789,-1)+1","v":{"$error":"#NUM!"}},{"$f":"EOMONTH(VENTE!I789,-1)+1","v":{"$error":"#NUM!"}},{"$f":"EOMONTH(ACHAT!M789,-1)+1","v":{"$error":"#NUM!"}},{"$f":"EOMONTH(ACHAT!L789,-1)+1","v":{"$error":"#NUM!"}}]
[null,{"$f":"EOMONTH(VENTE!A790,-1)+1","v":{"$error":"#NUM!"}},{"$f":"EOMONTH(VENTE!I790,-1)+1","v":{"$error":"#NUM!"}},{"$f":"EOMONTH(ACHAT!M790,-1)+1","v":{"$error":"#NUM!"}},{"$f":"EOMONTH(ACHAT!L790,-1)+1","v":{"$error":"#NUM!"}}]
[null,{"$f":"EOMONTH(VENTE!A791,-1)+1","v":{"$error":"#NUM!"}},{"$f":"EOMONTH(VENTE!I791,-1)+1","v":{"$error":"#NUM!"}},{"$f":"EOMONTH(ACHAT!M791,-1)+1","v":{"$error":"#NUM!"}},{"$f":"EOMONTH(ACHAT!L791,-1)+1","v":{"$error":"#NUM!"}}]
[null,{"$f":"EOMONTH(VENTE!A792,-1)+1","v":{"$error":"#NUM!"}},{"$f":"EOMONTH(VENTE!I792,-1)+1","v":{"$error":"#NUM!"}},{"$f":"EOMONTH(ACHAT!M792,-1)+1","v":{"$error":"#NUM!"}},{"$f":"EOMONTH(ACHAT!L792,-1)+1","v":{"$error":"#NUM!"}}]
[null,{"$f":"EOMONTH(VENTE!A793,-1)+1","v":{"$error":"#NUM!"}},{"$f":"EOMONTH(VENTE!I793,-1)+1","v":{"$error":"#NUM!"}},{"$f":"EOMONTH(ACHAT!M793,-1)+1","v":{"$error":"#NUM!"}},{"$f":"EOMONTH(ACHAT!L793,-1)+1","v":{"$error":"#NUM!"}}]
[null,{"$f":"EOMONTH(VENTE!A794,-1)+1","v":{"$error":"#NUM!"}},{"$f":"EOMONTH(VENTE!I794,-1)+1","v":{"$error":"#NUM!"}},{"$f":"EOMONTH(ACHAT!M794,-1)+1","v":{"$error":"#NUM!"}},{"$f":"EOMONTH(ACHAT!L794,-1)+1","v":{"$error":"#NUM!"}}]
[null,{"$f":"EOMONTH(VENTE!A795,-1)+1","v":{"$error":"#NUM!"}},{"$f":"EOMONTH(VENTE!I795,-1)+1","v":{"$error":"#NUM!"}},{"$f":"EOMONTH(ACHAT!M795,-1)+1","v":{"$error":"#NUM!"}},{"$f":"EOMONTH(ACHAT!L795,-1)+1","v":{"$error":"#NUM!"}}]
[null,{"$f":"EOMONTH(VENTE!A796,-1)+1","v":{"$error":"#NUM!"}},{"$f":"EOMONTH(VENTE!I796,-1)+1","v":{"$error":"#NUM!"}},{"$f":"EOMONTH(ACHAT!M796,-1)+1","v":{"$error":"#NUM!"}},{"$f":"EOMONTH(ACHAT!L796,-1)+1","v":{"$error":"#NUM!"}}]
[null,{"$f":"EOMONTH(VENTE!A797,-1)+1","v":{"$error":"#NUM!"}},{"$f":"EOMONTH(VENTE!I797,-1)+1","v":{"$error":"#NUM!"}},{"$f":"EOMONTH(ACHAT!M797,-1)+1","v":{"$error":"#NUM!"}},{"$f":"EOMONTH(ACHAT!L797,-1)+1","v":{"$error":"#NUM!"}}]
[null,{"$f":"EOMONTH(VENTE!A798,-1)+1","v":{"$error":"#NUM!"}},{"$f":"EOMONTH(VENTE!I798,-1)+1","v":{"$error":"#NUM!"}},{"$f":"EOMONTH(ACHAT!M798,-1)+1","v":{"$error":"#NUM!"}},{"$f":"EOMONTH(ACHAT!L798,-1)+1","v":{"$error":"#NUM!"}}]
[null,{"$f":"EOMONTH(VENTE!A799,-1)+1","v":{"$error":"#NUM!"}},{"$f":"EOMONTH(VENTE!I799,-1)+1","v":{"$error":"#NUM!"}},{"$f":"EOMONTH(ACHAT!M799,-1)+1","v":{"$error":"#NUM!"}},{"$f":"EOMONTH(ACHAT!L799,-1)+1","v":{"$error":"#NUM!"}}]
[null,{"$f":"EOMONTH(VENTE!A800,-1)+1","v":{"$error":"#NUM!"}},{"$f":"EOMONTH(VENTE!I800,-1)+1","v":{"$error":"#NUM!"}},{"$f":"EOMONTH(ACHAT!M800,-1)+1","v":{"$error":"#NUM!"}},{"$f":"EOMONTH(ACHAT!L800,-1)+1","v":{"$error":"#NUM!"}}]
[null,{"$f":"EOMONTH(VENTE!A801,-1)+1","v":{"$error":"#NUM!"}},{"$f":"EOMONTH(VENTE!I801,-1)+1","v":{"$error":"#NUM!"}},{"$f":"EOMONTH(ACHAT!M801,-1)+1","v":{"$error":"#NUM!"}},{"$f":"EOMONTH(ACHAT!L801,-1)+1","v":{"$error":"#NUM!"}}]
[null,{"$f":"EOMONTH(VENTE!A802,-1)+1","v":{"$error":"#NUM!"}},{"$f":"EOMONTH(VENTE!I802,-1)+1","v":{"$error":"#NUM!"}},{"$f":"EOMONTH(ACHAT!M802,-1)+1","v":{"$error":"#NUM!"}},{"$f":"EOMONTH(ACHAT!L802,-1)+1","v":{"$error":"#NUM!"}}]
[null,{"$f":"EOMONTH(VENTE!A803,-1)+1","v":{"$error":"#NUM!"}},{"$f":"EOMONTH(VENTE!I803,-1)+1","v":{"$error":"#NUM!"}},{"$f":"EOMONTH(ACHAT!M803,-1)+1","v":{"$error":"#NUM!"}},{"$f":"EOMONTH(ACHAT!L803,-1)+1","v":{"$error":"#NUM!"}}]
[null,{"$f":"EOMONTH(VENTE!A804,-1)+1","v":{"$error":"#NUM!"}},{"$f":"EOMONTH(VENTE!I804,-1)+1","v":{"$error":"#NUM!"}},{"$f":"EOMONTH(ACHAT!M804,-1)+1","v":{"$error":"#NUM!"}},{"$f":"EOMONTH(ACHAT!L804,-1)+1","v":{"$error":"#NUM!"}}]
[null,{"$f":"EOMONTH(VENTE!A805,-1)+1","v":{"$error":"#NUM!"}},{"$f":"EOMONTH(VENTE!I805,-1)+1","v":{"$error":"#NUM!"}},{"$f":"EOMONTH(ACHAT!M805,-1)+1","v":{"$error":"#NUM!"}},{"$f":"EOMONTH(ACHAT!L805,-1)+1","v":{"$error":"#NUM!"}}]
[null,{"$f":"EOMONTH(VENTE!A806,-1)+1","v":{"$error":"#NUM!"}},{"$f":"EOMONTH(VENTE!I806,-1)+1","v":{"$error":"#NUM!"}},{"$f":"EOMONTH(ACHAT!M806,-1)+1","v":{"$error":"#NUM!"}},{"$f":"EOMONTH(ACHAT!L806,-1)+1","v":{"$error":"#NUM!"}}]
[null,{"$f":"EOMONTH(VENTE!A807,-1)+1","v":{"$error":"#NUM!"}},{"$f":"EOMONTH(VENTE!I807,-1)+1","v":{"$error":"#NUM!"}},{"$f":"EOMONTH(ACHAT!M807,-1)+1","v":{"$error":"#NUM!"}},{"$f":"EOMONTH(ACHAT!L807,-1)+1","v":{"$error":"#NUM!"}}]
[null,{"$f":"EOMONTH(VENTE!A808,-1)+1","v":{"$error":"#NUM!"}},{"$f":"EOMONTH(VENTE!I808,-1)+1","v":{"$error":"#NUM!"}},{"$f":"EOMONTH(ACHAT!M808,-1)+1","v":{"$error":"#NUM!"}},{"$f":"EOMONTH(ACHAT!L808,-1)+1","v":{"$error":"#NUM!"}}]
[null,{"$f":"EOMONTH(VENTE!A809,-1)+1","v":{"$error":"#NUM!"}},{"$f":"EOMONTH(VENTE!I809,-1)+1","v":{"$error":"#NUM!"}},{"$f":"EOMONTH(ACHAT!M809,-1)+1","v":{"$error":"#NUM!"}},{"$f":"EOMONTH(ACHAT!L809,-1)+1","v":{"$error":"#NUM!"}}]
[null,{"$f":"EOMONTH(VENTE!A810,-1)+1","v":{"$error":"#NUM!"}},{"$f":"EOMONTH(VENTE!I810,-1)+1","v":{"$error":"#NUM!"}},{"$f":"EOMONTH(ACHAT!M810,-1)+1","v":{"$error":"#NUM!"}},{"$f":"EOMONTH(ACHAT!L810,-1)+1","v":{"$error":"#NUM!"}}]
[null,{"$f":"EOMONTH(VENTE!A811,-1)+1","v":{"$error":"#NUM!"}},{"$f":"EOMONTH(VENTE!I811,-1)+1","v":{"$error":"#NUM!"}},{"$f":"EOMONTH(ACHAT!M811,-1)+1","v":{"$error":"#NUM!"}},{"$f":"EOMONTH(ACHAT!L811,-1)+1","v":{"$error":"#NUM!"}}]
[null,{"$f":"EOMONTH(VENTE!A812,-1)+1","v":{"$error":"#NUM!"}},{"$f":"EOMONTH(VENTE!I812,-1)+1","v":{"$error":"#NUM!"}},{"$f":"EOMONTH(ACHAT!M812,-1)+1","v":{"$error":"#NUM!"}},{"$f":"EOMONTH(ACHAT!L812,-1)+1","v":{"$error":"#NUM!"}}]
[null,{"$f":"EOMONTH(VENTE!A813,-1)+1","v":{"$error":"#NUM!"}},{"$f":"EOMONTH(VENTE!I813,-1)+1","v":{"$error":"#NUM!"}},{"$f":"EOMONTH(ACHAT!M813,-1)+1","v":{"$error":"#NUM!"}},{"$f":"EOMONTH(ACHAT!L813,-1)+1","v":{"$error":"#NUM!"}}]
[null,{"$f":"EOMONTH(VENTE!A814,-1)+1","v":{"$error":"#NUM!"}},{"$f":"EOMONTH(VENTE!I814,-1)+1","v":{"$error":"#NUM!"}},{"$f":"EOMONTH(ACHAT!M814,-1)+1","v":{"$error":"#NUM!"}},{"$f":"EOMONTH(ACHAT!L814,-1)+1","v":{"$error":"#NUM!"}}]
[null,{"$f":"EOMONTH(VENTE!A815,-1)+1","v":{"$error":"#NUM!"}},{"$f":"EOMONTH(VENTE!I815,-1)+1","v":{"$error":"#NUM!"}},{"$f":"EOMONTH(ACHAT!M815,-1)+1","v":{"$error":"#NUM!"}},{"$f":"EOMONTH(ACHAT!L815,-1)+1","v":{"$error":"#NUM!"}}]
[null,{"$f":"EOMONTH(VENTE!A816,-1)+1","v":{"$error":"#NUM!"}},{"$f":"EOMONTH(VENTE!I816,-1)+1","v":{"$error":"#NUM!"}},{"$f":"EOMONTH(ACHAT!M816,-1)+1","v":{"$error":"#NUM!"}},{"$f":"EOMONTH(ACHAT!L816,-1)+1","v":{"$error":"#NUM!"}}]
[null,{"$f":"EOMONTH(VENTE!A817,-1)+1","v":{"$error":"#NUM!"}},{"$f":"EOMONTH(VENTE!I817,-1)+1","v":{"$error":"#NUM!"}},{"$f":"EOMONTH(ACHAT!M817,-1)+1","v":{"$error":"#NUM!"}},{"$f":"EOMONTH(ACHAT!L817,-1)+1","v":{"$error":"#NUM!"}}]
[null,{"$f":"EOMONTH(VENTE!A818,-1)+1","v":{"$error":"#NUM!"}},{"$f":"EOMONTH(VENTE!I818,-1)+1","v":{"$error":"#NUM!"}},{"$f":"EOMONTH(ACHAT!M818,-1)+1","v":{"$error":"#NUM!"}},{"$f":"EOMONTH(ACHAT!L818,-1)+1","v":{"$error":"#NUM!"}}]
[null,{"$f":"EOMONTH(VENTE!A819,-1)+1","v":{"$error":"#NUM!"}},{"$f":"EOMONTH(VENTE!I819,-1)+1","v":{"$error":"#NUM!"}},{"$f":"EOMONTH(ACHAT!M819,-1)+1","v":{"$error":"#NUM!"}},{"$f":"EOMONTH(ACHAT!L819,-1)+1","v":{"$error":"#NUM!"}}]
[null,{"$f":"EOMONTH(VENTE!A820,-1)+1","v":{"$error":"#NUM!"}},{"$f":"EOMONTH(VENTE!I820,-1)+1","v":{"$error":"#NUM!"}},{"$f":"EOMONTH(ACHAT!M820,-1)+1","v":{"$error":"#NUM!"}},{"$f":"EOMONTH(ACHAT!L820,-1)+1","v":{"$error":"#NUM!"}}]
[null,{"$f":"EOMONTH(VENTE!A821,-1)+1","v":{"$error":"#NUM!"}},{"$f":"EOMONTH(VENTE!I821,-1)+1","v":{"$error":"#NUM!"}},{"$f":"EOMONTH(ACHAT!M821,-1)+1","v":{"$error":"#NUM!"}},{"$f":"EOMONTH(ACHAT!L821,-1)+1","v":{"$error":"#NUM!"}}]
[null,{"$f":"EOMONTH(VENTE!A822,-1)+1","v":{"$error":"#NUM!"}},{"$f":"EOMONTH(VENTE!I822,-1)+1","v":{"$error":"#NUM!"}},{"$f":"EOMONTH(ACHAT!M822,-1)+1","v":{"$error":"#NUM!"}},{"$f":"EOMONTH(ACHAT!L822,-1)+1","v":{"$error":"#NUM!"}}]
[null,{"$f":"EOMONTH(VENTE!A823,-1)+1","v":{"$error":"#NUM!"}},{"$f":"EOMONTH(VENTE!I823,-1)+1","v":{"$error":"#NUM!"}},{"$f":"EOMONTH(ACHAT!M823,-1)+1","v":{"$error":"#NUM!"}},{"$f":"EOMONTH(ACHAT!L823,-1)+1","v":{"$error":"#NUM!"}}]
[null,{"$f":"EOMONTH(VENTE!A824,-1)+1","v":{"$error":"#NUM!"}},{"$f":"EOMONTH(VENTE!I824,-1)+1","v":{"$error":"#NUM!"}},{"$f":"EOMONTH(ACHAT!M824,-1)+1","v":{"$error":"#NUM!"}},{"$f":"EOMONTH(ACHAT!L824,-1)+1","v":{"$error":"#NUM!"}}]
[null,{"$f":"EOMONTH(VENTE!A825,-1)+1","v":{"$error":"#NUM!"}},{"$f":"EOMONTH(VENTE!I825,-1)+1","v":{"$error":"#NUM!"}},{"$f":"EOMONTH(ACHAT!M825,-1)+1","v":{"$error":"#NUM!"}},{"$f":"EOMONTH(ACHAT!L825,-1)+1","v":{"$error":"#NUM!"}}]
[null,{"$f":"EOMONTH(VENTE!A826,-1)+1","v":{"$error":"#NUM!"}},{"$f":"EOMONTH(VENTE!I826,-1)+1","v":{"$error":"#NUM!"}},{"$f":"EOMONTH(ACHAT!M826,-1)+1","v":{"$error":"#NUM!"}},{"$f":"EOMONTH(ACHAT!L826,-1)+1","v":{"$error":"#NUM!"}}]
[null,{"$f":"EOMONTH(VENTE!A827,-1)+1","v":{"$error":"#NUM!"}},{"$f":"EOMONTH(VENTE!I827,-1)+1","v":{"$error":"#NUM!"}},{"$f":"EOMONTH(ACHAT!M827,-1)+1","v":{"$error":"#NUM!"}},{"$f":"EOMONTH(ACHAT!L827,-1)+1","v":{"$error":"#NUM!"}}]
[null,{"$f":"EOMONTH(VENTE!A828,-1)+1","v":{"$error":"#NUM!"}},{"$f":"EOMONTH(VENTE!I828,-1)+1","v":{"$error":"#NUM!"}},{"$f":"EOMONTH(ACHAT!M828,-1)+1","v":{"$error":"#NUM!"}},{"$f":"EOMONTH(ACHAT!L828,-1)+1","v":{"$error":"#NUM!"}}]
[null,{"$f":"EOMONTH(VENTE!A829,-1)+1","v":{"$error":"#NUM!"}},{"$f":"EOMONTH(VENTE!I829,-1)+1","v":{"$error":"#NUM!"}},{"$f":"EOMONTH(ACHAT!M829,-1)+1","v":{"$error":"#NUM!"}},{"$f":"EOMONTH(ACHAT!L829,-1)+1","v":{"$error":"#NUM!"}}]
[null,{"$f":"EOMONTH(VENTE!A830,-1)+1","v":{"$error":"#NUM!"}},{"$f":"EOMONTH(VENTE!I830,-1)+1","v":{"$error":"#NUM!"}},{"$f":"EOMONTH(ACHAT!M830,-1)+1","v":{"$error":"#NUM!"}},{"$f":"EOMONTH(ACHAT!L830,-1)+1","v":{"$error":"#NUM!"}}]
[null,{"$f":"EOMONTH(VENTE!A831,-1)+1","v":{"$error":"#NUM!"}},{"$f":"EOMONTH(VENTE!I831,-1)+1","v":{"$error":"#NUM!"}},{"$f":"EOMONTH(ACHAT!M831,-1)+1","v":{"$error":"#NUM!"}},{"$f":"EOMONTH(ACHAT!L831,-1)+1","v":{"$error":"#NUM!"}}]
[null,{"$f":"EOMONTH(VENTE!A832,-1)+1","v":{"$error":"#NUM!"}},{"$f":"EOMONTH(VENTE!I832,-1)+1","v":{"$error":"#NUM!"}},{"$f":"EOMONTH(ACHAT!M832,-1)+1","v":{"$error":"#NUM!"}},{"$f":"EOMONTH(ACHAT!L832,-1)+1","v":{"$error":"#NUM!"}}]
[null,{"$f":"EOMONTH(VENTE!A833,-1)+1","v":{"$error":"#NUM!"}},{"$f":"EOMONTH(VENTE!I833,-1)+1","v":{"$error":"#NUM!"}},{"$f":"EOMONTH(ACHAT!M833,-1)+1","v":{"$error":"#NUM!"}},{"$f":"EOMONTH(ACHAT!L833,-1)+1","v":{"$error":"#NUM!"}}]
[null,{"$f":"EOMONTH(VENTE!A834,-1)+1","v":{"$error":"#NUM!"}},{"$f":"EOMONTH(VENTE!I834,-1)+1","v":{"$error":"#NUM!"}},{"$f":"EOMONTH(ACHAT!M834,-1)+1","v":{"$error":"#NUM!"}},{"$f":"EOMONTH(ACHAT!L834,-1)+1","v":{"$error":"#NUM!"}}]
[null,{"$f":"EOMONTH(VENTE!A835,-1)+1","v":{"$error":"#NUM!"}},{"$f":"EOMONTH(VENTE!I835,-1)+1","v":{"$error":"#NUM!"}},{"$f":"EOMONTH(ACHAT!M835,-1)+1","v":{"$error":"#NUM!"}},{"$f":"EOMONTH(ACHAT!L835,-1)+1","v":{"$error":"#NUM!"}}]
[null,{"$f":"EOMONTH(VENTE!A836,-1)+1","v":{"$error":"#NUM!"}},{"$f":"EOMONTH(VENTE!I836,-1)+1","v":{"$error":"#NUM!"}},{"$f":"EOMONTH(ACHAT!M836,-1)+1","v":{"$error":"#NUM!"}},{"$f":"EOMONTH(ACHAT!L836,-1)+1","v":{"$error":"#NUM!"}}]
[null,{"$f":"EOMONTH(VENTE!A837,-1)+1","v":{"$error":"#NUM!"}},{"$f":"EOMONTH(VENTE!I837,-1)+1","v":{"$error":"#NUM!"}},{"$f":"EOMONTH(ACHAT!M837,-1)+1","v":{"$error":"#NUM!"}},{"$f":"EOMONTH(ACHAT!L837,-1)+1","v":{"$error":"#NUM!"}}]
[null,{"$f":"EOMONTH(VENTE!A838,-1)+1","v":{"$error":"#NUM!"}},{"$f":"EOMONTH(VENTE!I838,-1)+1","v":{"$error":"#NUM!"}},{"$f":"EOMONTH(ACHAT!M838,-1)+1","v":{"$error":"#NUM!"}},{"$f":"EOMONTH(ACHAT!L838,-1)+1","v":{"$error":"#NUM!"}}]
[null,{"$f":"EOMONTH(VENTE!A839,-1)+1","v":{"$error":"#NUM!"}},{"$f":"EOMONTH(VENTE!I839,-1)+1","v":{"$error":"#NUM!"}},{"$f":"EOMONTH(ACHAT!M839,-1)+1","v":{"$error":"#NUM!"}},{"$f":"EOMONTH(ACHAT!L839,-1)+1","v":{"$error":"#NUM!"}}]
[null,{"$f":"EOMONTH(VENTE!A840,-1)+1","v":{"$error":"#NUM!"}},{"$f":"EOMONTH(VENTE!I840,-1)+1","v":{"$error":"#NUM!"}},{"$f":"EOMONTH(ACHAT!M840,-1)+1","v":{"$error":"#NUM!"}},{"$f":"EOMONTH(ACHAT!L840,-1)+1","v":{"$error":"#NUM!"}}]
[null,{"$f":"EOMONTH(VENTE!A841,-1)+1","v":{"$error":"#NUM!"}},{"$f":"EOMONTH(VENTE!I841,-1)+1","v":{"$error":"#NUM!"}},{"$f":"EOMONTH(ACHAT!M841,-1)+1","v":{"$error":"#NUM!"}},{"$f":"EOMONTH(ACHAT!L841,-1)+1","v":{"$error":"#NUM!"}}]
[null,{"$f":"EOMONTH(VENTE!A842,-1)+1","v":{"$error":"#NUM!"}},{"$f":"EOMONTH(VENTE!I842,-1)+1","v":{"$error":"#NUM!"}},{"$f":"EOMONTH(ACHAT!M842,-1)+1","v":{"$error":"#NUM!"}},{"$f":"EOMONTH(ACHAT!L842,-1)+1","v":{"$error":"#NUM!"}}]
[null,{"$f":"EOMONTH(VENTE!A843,-1)+1","v":{"$error":"#NUM!"}},{"$f":"EOMONTH(VENTE!I843,-1)+1","v":{"$error":"#NUM!"}},{"$f":"EOMONTH(ACHAT!M843,-1)+1","v":{"$error":"#NUM!"}},{"$f":"EOMONTH(ACHAT!L843,-1)+1","v":{"$error":"#NUM!"}}]
[null,{"$f":"EOMONTH(VENTE!A844,-1)+1","v":{"$error":"#NUM!"}},{"$f":"EOMONTH(VENTE!I844,-1)+1","v":{"$error":"#NUM!"}},{"$f":"EOMONTH(ACHAT!M844,-1)+1","v":{"$error":"#NUM!"}},{"$f":"EOMONTH(ACHAT!L844,-1)+1","v":{"$error":"#NUM!"}}]
[null,{"$f":"EOMONTH(VENTE!A845,-1)+1","v":{"$error":"#NUM!"}},{"$f":"EOMONTH(VENTE!I845,-1)+1","v":{"$error":"#NUM!"}},{"$f":"EOMONTH(ACHAT!M845,-1)+1","v":{"$error":"#NUM!"}},{"$f":"EOMONTH(ACHAT!L845,-1)+1","v":{"$error":"#NUM!"}}]
[null,{"$f":"EOMONTH(VENTE!A846,-1)+1","v":{"$error":"#NUM!"}},{"$f":"EOMONTH(VENTE!I846,-1)+1","v":{"$error":"#NUM!"}},{"$f":"EOMONTH(ACHAT!M846,-1)+1","v":{"$error":"#NUM!"}},{"$f":"EOMONTH(ACHAT!L846,-1)+1","v":{"$error":"#NUM!"}}]
[null,{"$f":"EOMONTH(VENTE!A847,-1)+1","v":{"$error":"#NUM!"}},{"$f":"EOMONTH(VENTE!I847,-1)+1","v":{"$error":"#NUM!"}},{"$f":"EOMONTH(ACHAT!M847,-1)+1","v":{"$error":"#NUM!"}},{"$f":"EOMONTH(ACHAT!L847,-1)+1","v":{"$error":"#NUM!"}}]
[null,{"$f":"EOMONTH(VENTE!A848,-1)+1","v":{"$error":"#NUM!"}},{"$f":"EOMONTH(VENTE!I848,-1)+1","v":{"$error":"#NUM!"}},{"$f":"EOMONTH(ACHAT!M848,-1)+1","v":{"$error":"#NUM!"}},{"$f":"EOMONTH(ACHAT!L848,-1)+1","v":{"$error":"#NUM!"}}]
[null,{"$f":"EOMONTH(VENTE!A849,-1)+1","v":{"$error":"#NUM!"}},{"$f":"EOMONTH(VENTE!I849,-1)+1","v":{"$error":"#NUM!"}},{"$f":"EOMONTH(ACHAT!M849,-1)+1","v":{"$error":"#NUM!"}},{"$f":"EOMONTH(ACHAT!L849,-1)+1","v":{"$error":"#NUM!"}}]
[null,{"$f":"EOMONTH(VENTE!A850,-1)+1","v":{"$error":"#NUM!"}},{"$f":"EOMONTH(VENTE!I850,-1)+1","v":{"$error":"#NUM!"}},{"$f":"EOMONTH(ACHAT!M850,-1)+1","v":{"$error":"#NUM!"}},{"$f":"EOMONTH(ACHAT!L850,-1)+1","v":{"$error":"#NUM!"}}]
[null,{"$f":"EOMONTH(VENTE!A851,-1)+1","v":{"$error":"#NUM!"}},{"$f":"EOMONTH(VENTE!I851,-1)+1","v":{"$error":"#NUM!"}},{"$f":"EOMONTH(ACHAT!M851,-1)+1","v":{"$error":"#NUM!"}},{"$f":"EOMONTH(ACHAT!L851,-1)+1","v":{"$error":"#NUM!"}}]
[null,{"$f":"EOMONTH(VENTE!A852,-1)+1","v":{"$error":"#NUM!"}},{"$f":"EOMONTH(VENTE!I852,-1)+1","v":{"$error":"#NUM!"}},{"$f":"EOMONTH(ACHAT!M852,-1)+1","v":{"$error":"#NUM!"}},{"$f":"EOMONTH(ACHAT!L852,-1)+1","v":{"$error":"#NUM!"}}]
[null,{"$f":"EOMONTH(VENTE!A853,-1)+1","v":{"$error":"#NUM!"}},{"$f":"EOMONTH(VENTE!I853,-1)+1","v":{"$error":"#NUM!"}},{"$f":"EOMONTH(ACHAT!M853,-1)+1","v":{"$error":"#NUM!"}},{"$f":"EOMONTH(ACHAT!L853,-1)+1","v":{"$error":"#NUM!"}}]
[null,{"$f":"EOMONTH(VENTE!A854,-1)+1","v":{"$error":"#NUM!"}},{"$f":"EOMONTH(VENTE!I854,-1)+1","v":{"$error":"#NUM!"}},{"$f":"EOMONTH(ACHAT!M854,-1)+1","v":{"$error":"#NUM!"}},{"$f":"EOMONTH(ACHAT!L854,-1)+1","v":{"$error":"#NUM!"}}]
[null,{"$f":"EOMONTH(VENTE!A855,-1)+1","v":{"$error":"#NUM!"}},{"$f":"EOMONTH(VENTE!I855,-1)+1","v":{"$error":"#NUM!"}},{"$f":"EOMONTH(ACHAT!M855,-1)+1","v":{"$error":"#NUM!"}},{"$f":"EOMONTH(ACHAT!L855,-1)+1","v":{"$error":"#NUM!"}}]
[null,{"$f":"EOMONTH(VENTE!A856,-1)+1","v":{"$error":"#NUM!"}},{"$f":"EOMONTH(VENTE!I856,-1)+1","v":{"$error":"#NUM!"}},{"$f":"EOMONTH(ACHAT!M856,-1)+1","v":{"$error":"#NUM!"}},{"$f":"EOMONTH(ACHAT!L856,-1)+1","v":{"$error":"#NUM!"}}]
[null,{"$f":"EOMONTH(VENTE!A857,-1)+1","v":{"$error":"#NUM!"}},{"$f":"EOMONTH(VENTE!I857,-1)+1","v":{"$error":"#NUM!"}},{"$f":"EOMONTH(ACHAT!M857,-1)+1","v":{"$error":"#NUM!"}},{"$f":"EOMONTH(ACHAT!L857,-1)+1","v":{"$error":"#NUM!"}}]
[null,{"$f":"EOMONTH(VENTE!A858,-1)+1","v":{"$error":"#NUM!"}},{"$f":"EOMONTH(VENTE!I858,-1)+1","v":{"$error":"#NUM!"}},{"$f":"EOMONTH(ACHAT!M858,-1)+1","v":{"$error":"#NUM!"}},{"$f":"EOMONTH(ACHAT!L858,-1)+1","v":{"$error":"#NUM!"}}]
[null,{"$f":"EOMONTH(VENTE!A859,-1)+1","v":{"$error":"#NUM!"}},{"$f":"EOMONTH(VENTE!I859,-1)+1","v":{"$error":"#NUM!"}},{"$f":"EOMONTH(ACHAT!M859,-1)+1","v":{"$error":"#NUM!"}},{"$f":"EOMONTH(ACHAT!L859,-1)+1","v":{"$error":"#NUM!"}}]
[null,{"$f":"EOMONTH(VENTE!A860,-1)+1","v":{"$error":"#NUM!"}},{"$f":"EOMONTH(VENTE!I860,-1)+1","v":{"$error":"#NUM!"}},{"$f":"EOMONTH(ACHAT!M860,-1)+1","v":{"$error":"#NUM!"}},{"$f":"EOMONTH(ACHAT!L860,-1)+1","v":{"$error":"#NUM!"}}]
[null,{"$f":"EOMONTH(VENTE!A861,-1)+1","v":{"$error":"#NUM!"}},{"$f":"EOMONTH(VENTE!I861,-1)+1","v":{"$error":"#NUM!"}},{"$f":"EOMONTH(ACHAT!M861,-1)+1","v":{"$error":"#NUM!"}},{"$f":"EOMONTH(ACHAT!L861,-1)+1","v":{"$error":"#NUM!"}}]
[null,{"$f":"EOMONTH(VENTE!A862,-1)+1","v":{"$error":"#NUM!"}},{"$f":"EOMONTH(VENTE!I862,-1)+1","v":{"$error":"#NUM!"}},{"$f":"EOMONTH(ACHAT!M862,-1)+1","v":{"$error":"#NUM!"}},{"$f":"EOMONTH(ACHAT!L862,-1)+1","v":{"$error":"#NUM!"}}]
[null,{"$f":"EOMONTH(VENTE!A863,-1)+1","v":{"$error":"#NUM!"}},{"$f":"EOMONTH(VENTE!I863,-1)+1","v":{"$error":"#NUM!"}},{"$f":"EOMONTH(ACHAT!M863,-1)+1","v":{"$error":"#NUM!"}},{"$f":"EOMONTH(ACHAT!L863,-1)+1","v":{"$error":"#NUM!"}}]
[null,{"$f":"EOMONTH(VENTE!A864,-1)+1","v":{"$error":"#NUM!"}},{"$f":"EOMONTH(VENTE!I864,-1)+1","v":{"$error":"#NUM!"}},{"$f":"EOMONTH(ACHAT!M864,-1)+1","v":{"$error":"#NUM!"}},{"$f":"EOMONTH(ACHAT!L864,-1)+1","v":{"$error":"#NUM!"}}]
[null,{"$f":"EOMONTH(VENTE!A865,-1)+1","v":{"$error":"#NUM!"}},{"$f":"EOMONTH(VENTE!I865,-1)+1","v":{"$error":"#NUM!"}},{"$f":"EOMONTH(ACHAT!M865,-1)+1","v":{"$error":"#NUM!"}},{"$f":"EOMONTH(ACHAT!L865,-1)+1","v":{"$error":"#NUM!"}}]
[null,{"$f":"EOMONTH(VENTE!A866,-1)+1","v":{"$error":"#NUM!"}},{"$f":"EOMONTH(VENTE!I866,-1)+1","v":{"$error":"#NUM!"}},{"$f":"EOMONTH(ACHAT!M866,-1)+1","v":{"$error":"#NUM!"}},{"$f":"EOMONTH(ACHAT!L866,-1)+1","v":{"$error":"#NUM!"}}]
[null,{"$f":"EOMONTH(VENTE!A867,-1)+1","v":{"$error":"#NUM!"}},{"$f":"EOMONTH(VENTE!I867,-1)+1","v":{"$error":"#NUM!"}},{"$f":"EOMONTH(ACHAT!M867,-1)+1","v":{"$error":"#NUM!"}},{"$f":"EOMONTH(ACHAT!L867,-1)+1","v":{"$error":"#NUM!"}}]
[null,{"$f":"EOMONTH(VENTE!A868,-1)+1","v":{"$error":"#NUM!"}},{"$f":"EOMONTH(VENTE!I868,-1)+1","v":{"$error":"#NUM!"}},{"$f":"EOMONTH(ACHAT!M868,-1)+1","v":{"$error":"#NUM!"}},{"$f":"EOMONTH(ACHAT!L868,-1)+1","v":{"$error":"#NUM!"}}]
[null,{"$f":"EOMONTH(VENTE!A869,-1)+1","v":{"$error":"#NUM!"}},{"$f":"EOMONTH(VENTE!I869,-1)+1","v":{"$error":"#NUM!"}},{"$f":"EOMONTH(ACHAT!M869,-1)+1","v":{"$error":"#NUM!"}},{"$f":"EOMONTH(ACHAT!L869,-1)+1","v":{"$error":"#NUM!"}}]
[null,{"$f":"EOMONTH(VENTE!A870,-1)+1","v":{"$error":"#NUM!"}},{"$f":"EOMONTH(VENTE!I870,-1)+1","v":{"$error":"#NUM!"}},{"$f":"EOMONTH(ACHAT!M870,-1)+1","v":{"$error":"#NUM!"}},{"$f":"EOMONTH(ACHAT!L870,-1)+1","v":{"$error":"#NUM!"}}]
[null,{"$f":"EOMONTH(VENTE!A871,-1)+1","v":{"$error":"#NUM!"}},{"$f":"EOMONTH(VENTE!I871,-1)+1","v":{"$error":"#NUM!"}},{"$f":"EOMONTH(ACHAT!M871,-1)+1","v":{"$error":"#NUM!"}},{"$f":"EOMONTH(ACHAT!L871,-1)+1","v":{"$error":"#NUM!"}}]
[null,{"$f":"EOMONTH(VENTE!A872,-1)+1","v":{"$error":"#NUM!"}},{"$f":"EOMONTH(VENTE!I872,-1)+1","v":{"$error":"#NUM!"}},{"$f":"EOMONTH(ACHAT!M872,-1)+1","v":{"$error":"#NUM!"}},{"$f":"EOMONTH(ACHAT!L872,-1)+1","v":{"$error":"#NUM!"}}]
[null,{"$f":"EOMONTH(VENTE!A873,-1)+1","v":{"$error":"#NUM!"}},{"$f":"EOMONTH(VENTE!I873,-1)+1","v":{"$error":"#NUM!"}},{"$f":"EOMONTH(ACHAT!M873,-1)+1","v":{"$error":"#NUM!"}},{"$f":"EOMONTH(ACHAT!L873,-1)+1","v":{"$error":"#NUM!"}}]
[null,{"$f":"EOMONTH(VENTE!A874,-1)+1","v":{"$error":"#NUM!"}},{"$f":"EOMONTH(VENTE!I874,-1)+1","v":{"$error":"#NUM!"}},{"$f":"EOMONTH(ACHAT!M874,-1)+1","v":{"$error":"#NUM!"}},{"$f":"EOMONTH(ACHAT!L874,-1)+1","v":{"$error":"#NUM!"}}]
[null,{"$f":"EOMONTH(VENTE!A875,-1)+1","v":{"$error":"#NUM!"}},{"$f":"EOMONTH(VENTE!I875,-1)+1","v":{"$error":"#NUM!"}},{"$f":"EOMONTH(ACHAT!M875,-1)+1","v":{"$error":"#NUM!"}},{"$f":"EOMONTH(ACHAT!L875,-1)+1","v":{"$error":"#NUM!"}}]
[null,{"$f":"EOMONTH(VENTE!A876,-1)+1","v":{"$error":"#NUM!"}},{"$f":"EOMONTH(VENTE!I876,-1)+1","v":{"$error":"#NUM!"}},{"$f":"EOMONTH(ACHAT!M876,-1)+1","v":{"$error":"#NUM!"}},{"$f":"EOMONTH(ACHAT!L876,-1)+1","v":{"$error":"#NUM!"}}]
[null,{"$f":"EOMONTH(VENTE!A877,-1)+1","v":{"$error":"#NUM!"}},{"$f":"EOMONTH(VENTE!I877,-1)+1","v":{"$error":"#NUM!"}},{"$f":"EOMONTH(ACHAT!M877,-1)+1","v":{"$error":"#NUM!"}},{"$f":"EOMONTH(ACHAT!L877,-1)+1","v":{"$error":"#NUM!"}}]
[null,{"$f":"EOMONTH(VENTE!A878,-1)+1","v":{"$error":"#NUM!"}},{"$f":"EOMONTH(VENTE!I878,-1)+1","v":{"$error":"#NUM!"}},{"$f":"EOMONTH(ACHAT!M878,-1)+1","v":{"$error":"#NUM!"}},{"$f":"EOMONTH(ACHAT!L878,-1)+1","v":{"$error":"#NUM!"}}]
[null,{"$f":"EOMONTH(VENTE!A879,-1)+1","v":{"$error":"#NUM!"}},{"$f":"EOMONTH(VENTE!I879,-1)+1","v":{"$error":"#NUM!"}},{"$f":"EOMONTH(ACHAT!M879,-1)+1","v":{"$error":"#NUM!"}},{"$f":"EOMONTH(ACHAT!L879,-1)+1","v":{"$error":"#NUM!"}}]
[null,{"$f":"EOMONTH(VENTE!A880,-1)+1","v":{"$error":"#NUM!"}},{"$f":"EOMONTH(VENTE!I880,-1)+1","v":{"$error":"#NUM!"}},{"$f":"EOMONTH(ACHAT!M880,-1)+1","v":{"$error":"#NUM!"}},{"$f":"EOMONTH(ACHAT!L880,-1)+1","v":{"$error":"#NUM!"}}]
[null,{"$f":"EOMONTH(VENTE!A881,-1)+1","v":{"$error":"#NUM!"}},{"$f":"EOMONTH(VENTE!I881,-1)+1","v":{"$error":"#NUM!"}},{"$f":"EOMONTH(ACHAT!M881,-1)+1","v":{"$error":"#NUM!"}},{"$f":"EOMONTH(ACHAT!L881,-1)+1","v":{"$error":"#NUM!"}}]
[null,{"$f":"EOMONTH(VENTE!A882,-1)+1","v":{"$error":"#NUM!"}},{"$f":"EOMONTH(VENTE!I882,-1)+1","v":{"$error":"#NUM!"}},{"$f":"EOMONTH(ACHAT!M882,-1)+1","v":{"$error":"#NUM!"}},{"$f":"EOMONTH(ACHAT!L882,-1)+1","v":{"$error":"#NUM!"}}]
[null,{"$f":"EOMONTH(VENTE!A883,-1)+1","v":{"$error":"#NUM!"}},{"$f":"EOMONTH(VENTE!I883,-1)+1","v":{"$error":"#NUM!"}},{"$f":"EOMONTH(ACHAT!M883,-1)+1","v":{"$error":"#NUM!"}},{"$f":"EOMONTH(ACHAT!L883,-1)+1","v":{"$error":"#NUM!"}}]
[null,{"$f":"EOMONTH(VENTE!A884,-1)+1","v":{"$error":"#NUM!"}},{"$f":"EOMONTH(VENTE!I884,-1)+1","v":{"$error":"#NUM!"}},{"$f":"EOMONTH(ACHAT!M884,-1)+1","v":{"$error":"#NUM!"}},{"$f":"EOMONTH(ACHAT!L884,-1)+1","v":{"$error":"#NUM!"}}]
[null,{"$f":"EOMONTH(VENTE!A885,-1)+1","v":{"$error":"#NUM!"}},{"$f":"EOMONTH(VENTE!I885,-1)+1","v":{"$error":"#NUM!"}},{"$f":"EOMONTH(ACHAT!M885,-1)+1","v":{"$error":"#NUM!"}},{"$f":"EOMONTH(ACHAT!L885,-1)+1","v":{"$error":"#NUM!"}}]
[null,{"$f":"EOMONTH(VENTE!A886,-1)+1","v":{"$error":"#NUM!"}},{"$f":"EOMONTH(VENTE!I886,-1)+1","v":{"$error":"#NUM!"}},{"$f":"EOMONTH(ACHAT!M886,-1)+1","v":{"$error":"#NUM!"}},{"$f":"EOMONTH(ACHAT!L886,-1)+1","v":{"$error":"#NUM!"}}]
[null,{"$f":"EOMONTH(VENTE!A887,-1)+1","v":{"$error":"#NUM!"}},{"$f":"EOMONTH(VENTE!I887,-1)+1","v":{"$error":"#NUM!"}},{"$f":"EOMONTH(ACHAT!M887,-1)+1","v":{"$error":"#NUM!"}},{"$f":"EOMONTH(ACHAT!L887,-1)+1","v":{"$error":"#NUM!"}}]
[null,{"$f":"EOMONTH(VENTE!A888,-1)+1","v":{"$error":"#NUM!"}},{"$f":"EOMONTH(VENTE!I888,-1)+1","v":{"$error":"#NUM!"}},{"$f":"EOMONTH(ACHAT!M888,-1)+1","v":{"$error":"#NUM!"}},{"$f":"EOMONTH(ACHAT!L888,-1)+1","v":{"$error":"#NUM!"}}]
[null,{"$f":"EOMONTH(VENTE!A889,-1)+1","v":{"$error":"#NUM!"}},{"$f":"EOMONTH(VENTE!I889,-1)+1","v":{"$error":"#NUM!"}},{"$f":"EOMONTH(ACHAT!M889,-1)+1","v":{"$error":"#NUM!"}},{"$f":"EOMONTH(ACHAT!L889,-1)+1","v":{"$error":"#NUM!"}}]
[null,{"$f":"EOMONTH(VENTE!A890,-1)+1","v":{"$error":"#NUM!"}},{"$f":"EOMONTH(VENTE!I890,-1)+1","v":{"$error":"#NUM!"}},{"$f":"EOMONTH(ACHAT!M890,-1)+1","v":{"$error":"#NUM!"}},{"$f":"EOMONTH(ACHAT!L890,-1)+1","v":{"$error":"#NUM!"}}]
[null,{"$f":"EOMONTH(VENTE!A891,-1)+1","v":{"$error":"#NUM!"}},{"$f":"EOMONTH(VENTE!I891,-1)+1","v":{"$error":"#NUM!"}},{"$f":"EOMONTH(ACHAT!M891,-1)+1","v":{"$error":"#NUM!"}},{"$f":"EOMONTH(ACHAT!L891,-1)+1","v":{"$error":"#NUM!"}}]
[null,{"$f":"EOMONTH(VENTE!A892,-1)+1","v":{"$error":"#NUM!"}},{"$f":"EOMONTH(VENTE!I892,-1)+1","v":{"$error":"#NUM!"}},{"$f":"EOMONTH(ACHAT!M892,-1)+1","v":{"$error":"#NUM!"}},{"$f":"EOMONTH(ACHAT!L892,-1)+1","v":{"$error":"#NUM!"}}]
[null,{"$f":"EOMONTH(VENTE!A893,-1)+1","v":{"$error":"#NUM!"}},{"$f":"EOMONTH(VENTE!I893,-1)+1","v":{"$error":"#NUM!"}},{"$f":"EOMONTH(ACHAT!M893,-1)+1","v":{"$error":"#NUM!"}},{"$f":"EOMONTH(ACHAT!L893,-1)+1","v":{"$error":"#NUM!"}}]
[null,{"$f":"EOMONTH(VENTE!A894,-1)+1","v":{"$error":"#NUM!"}},{"$f":"EOMONTH(VENTE!I894,-1)+1","v":{"$error":"#NUM!"}},{"$f":"EOMONTH(ACHAT!M894,-1)+1","v":{"$error":"#NUM!"}},{"$f":"EOMONTH(ACHAT!L894,-1)+1","v":{"$error":"#NUM!"}}]
[null,{"$f":"EOMONTH(VENTE!A895,-1)+1","v":{"$error":"#NUM!"}},{"$f":"EOMONTH(VENTE!I895,-1)+1","v":{"$error":"#NUM!"}},{"$f":"EOMONTH(ACHAT!M895,-1)+1","v":{"$error":"#NUM!"}},{"$f":"EOMONTH(ACHAT!L895,-1)+1","v":{"$error":"#NUM!"}}]
[null,{"$f":"EOMONTH(VENTE!A896,-1)+1","v":{"$error":"#NUM!"}},{"$f":"EOMONTH(VENTE!I896,-1)+1","v":{"$error":"#NUM!"}},{"$f":"EOMONTH(ACHAT!M896,-1)+1","v":{"$error":"#NUM!"}},{"$f":"EOMONTH(ACHAT!L896,-1)+1","v":{"$error":"#NUM!"}}]
[null,{"$f":"EOMONTH(VENTE!A897,-1)+1","v":{"$error":"#NUM!"}},{"$f":"EOMONTH(VENTE!I897,-1)+1","v":{"$error":"#NUM!"}},{"$f":"EOMONTH(ACHAT!M897,-1)+1","v":{"$error":"#NUM!"}},{"$f":"EOMONTH(ACHAT!L897,-1)+1","v":{"$error":"#NUM!"}}]
[null,{"$f":"EOMONTH(VENTE!A898,-1)+1","v":{"$error":"#NUM!"}},{"$f":"EOMONTH(VENTE!I898,-1)+1","v":{"$error":"#NUM!"}},{"$f":"EOMONTH(ACHAT!M898,-1)+1","v":{"$error":"#NUM!"}},{"$f":"EOMONTH(ACHAT!L898,-1)+1","v":{"$error":"#NUM!"}}]
[null,{"$f":"EOMONTH(VENTE!A899,-1)+1","v":{"$error":"#NUM!"}},{"$f":"EOMONTH(VENTE!I899,-1)+1","v":{"$error":"#NUM!"}},{"$f":"EOMONTH(ACHAT!M899,-1)+1","v":{"$error":"#NUM!"}},{"$f":"EOMONTH(ACHAT!L899,-1)+1","v":{"$error":"#NUM!"}}]
[null,{"$f":"EOMONTH(VENTE!A900,-1)+1","v":{"$error":"#NUM!"}},{"$f":"EOMONTH(VENTE!I900,-1)+1","v":{"$error":"#NUM!"}},{"$f":"EOMONTH(ACHAT!M900,-1)+1","v":{"$error":"#NUM!"}},{"$f":"EOMONTH(ACHAT!L900,-1)+1","v":{"$error":"#NUM!"}}]
[null,{"$f":"EOMONTH(VENTE!A901,-1)+1","v":{"$error":"#NUM!"}},{"$f":"EOMONTH(VENTE!I901,-1)+1","v":{"$error":"#NUM!"}},{"$f":"EOMONTH(ACHAT!M901,-1)+1","v":{"$error":"#NUM!"}},{"$f":"EOMONTH(ACHAT!L901,-1)+1","v":{"$error":"#NUM!"}}]
[null,{"$f":"EOMONTH(VENTE!A902,-1)+1","v":{"$error":"#NUM!"}},{"$f":"EOMONTH(VENTE!I902,-1)+1","v":{"$error":"#NUM!"}},{"$f":"EOMONTH(ACHAT!M902,-1)+1","v":{"$error":"#NUM!"}},{"$f":"EOMONTH(ACHAT!L902,-1)+1","v":{"$error":"#NUM!"}}]
[null,{"$f":"EOMONTH(VENTE!A903,-1)+1","v":{"$error":"#NUM!"}},{"$f":"EOMONTH(VENTE!I903,-1)+1","v":{"$error":"#NUM!"}},{"$f":"EOMONTH(ACHAT!M903,-1)+1","v":{"$error":"#NUM!"}},{"$f":"EOMONTH(ACHAT!L903,-1)+1","v":{"$error":"#NUM!"}}]
[null,{"$f":"EOMONTH(VENTE!A904,-1)+1","v":{"$error":"#NUM!"}},{"$f":"EOMONTH(VENTE!I904,-1)+1","v":{"$error":"#NUM!"}},{"$f":"EOMONTH(ACHAT!M904,-1)+1","v":{"$error":"#NUM!"}},{"$f":"EOMONTH(ACHAT!L904,-1)+1","v":{"$error":"#NUM!"}}]
[null,{"$f":"EOMONTH(VENTE!A905,-1)+1","v":{"$error":"#NUM!"}},{"$f":"EOMONTH(VENTE!I905,-1)+1","v":{"$error":"#NUM!"}},{"$f":"EOMONTH(ACHAT!M905,-1)+1","v":{"$error":"#NUM!"}},{"$f":"EOMONTH(ACHAT!L905,-1)+1","v":{"$error":"#NUM!"}}]
[null,{"$f":"EOMONTH(VENTE!A906,-1)+1","v":{"$error":"#NUM!"}},{"$f":"EOMONTH(VENTE!I906,-1)+1","v":{"$error":"#NUM!"}},{"$f":"EOMONTH(ACHAT!M906,-1)+1","v":{"$error":"#NUM!"}},{"$f":"EOMONTH(ACHAT!L906,-1)+1","v":{"$error":"#NUM!"}}]
[null,{"$f":"EOMONTH(VENTE!A907,-1)+1","v":{"$error":"#NUM!"}},{"$f":"EOMONTH(VENTE!I907,-1)+1","v":{"$error":"#NUM!"}},{"$f":"EOMONTH(ACHAT!M907,-1)+1","v":{"$error":"#NUM!"}},{"$f":"EOMONTH(ACHAT!L907,-1)+1","v":{"$error":"#NUM!"}}]
[null,{"$f":"EOMONTH(VENTE!A908,-1)+1","v":{"$error":"#NUM!"}},{"$f":"EOMONTH(VENTE!I908,-1)+1","v":{"$error":"#NUM!"}},{"$f":"EOMONTH(ACHAT!M908,-1)+1","v":{"$error":"#NUM!"}},{"$f":"EOMONTH(ACHAT!L908,-1)+1","v":{"$error":"#NUM!"}}]
[null,{"$f":"EOMONTH(VENTE!A909,-1)+1","v":{"$error":"#NUM!"}},{"$f":"EOMONTH(VENTE!I909,-1)+1","v":{"$error":"#NUM!"}},{"$f":"EOMONTH(ACHAT!M909,-1)+1","v":{"$error":"#NUM!"}},{"$f":"EOMONTH(ACHAT!L909,-1)+1","v":{"$error":"#NUM!"}}]
[null,{"$f":"EOMONTH(VENTE!A910,-1)+1","v":{"$error":"#NUM!"}},{"$f":"EOMONTH(VENTE!I910,-1)+1","v":{"$error":"#NUM!"}},{"$f":"EOMONTH(ACHAT!M910,-1)+1","v":{"$error":"#NUM!"}},{"$f":"EOMONTH(ACHAT!L910,-1)+1","v":{"$error":"#NUM!"}}]
[null,{"$f":"EOMONTH(VENTE!A911,-1)+1","v":{"$error":"#NUM!"}},{"$f":"EOMONTH(VENTE!I911,-1)+1","v":{"$error":"#NUM!"}},{"$f":"EOMONTH(ACHAT!M911,-1)+1","v":{"$error":"#NUM!"}},{"$f":"EOMONTH(ACHAT!L911,-1)+1","v":{"$error":"#NUM!"}}]
[null,{"$f":"EOMONTH(VENTE!A912,-1)+1","v":{"$error":"#NUM!"}},{"$f":"EOMONTH(VENTE!I912,-1)+1","v":{"$error":"#NUM!"}},{"$f":"EOMONTH(ACHAT!M912,-1)+1","v":{"$error":"#NUM!"}},{"$f":"EOMONTH(ACHAT!L912,-1)+1","v":{"$error":"#NUM!"}}]
[null,{"$f":"EOMONTH(VENTE!A913,-1)+1","v":{"$error":"#NUM!"}},{"$f":"EOMONTH(VENTE!I913,-1)+1","v":{"$error":"#NUM!"}},{"$f":"EOMONTH(ACHAT!M913,-1)+1","v":{"$error":"#NUM!"}},{"$f":"EOMONTH(ACHAT!L913,-1)+1","v":{"$error":"#NUM!"}}]
[null,{"$f":"EOMONTH(VENTE!A914,-1)+1","v":{"$error":"#NUM!"}},{"$f":"EOMONTH(VENTE!I914,-1)+1","v":{"$error":"#NUM!"}},{"$f":"EOMONTH(ACHAT!M914,-1)+1","v":{"$error":"#NUM!"}},{"$f":"EOMONTH(ACHAT!L914,-1)+1","v":{"$error":"#NUM!"}}]
[null,{"$f":"EOMONTH(VENTE!A915,-1)+1","v":{"$error":"#NUM!"}},{"$f":"EOMONTH(VENTE!I915,-1)+1","v":{"$error":"#NUM!"}},{"$f":"EOMONTH(ACHAT!M915,-1)+1","v":{"$error":"#NUM!"}},{"$f":"EOMONTH(ACHAT!L915,-1)+1","v":{"$error":"#NUM!"}}]
[null,{"$f":"EOMONTH(VENTE!A916,-1)+1","v":{"$error":"#NUM!"}},{"$f":"EOMONTH(VENTE!I916,-1)+1","v":{"$error":"#NUM!"}},{"$f":"EOMONTH(ACHAT!M916,-1)+1","v":{"$error":"#NUM!"}},{"$f":"EOMONTH(ACHAT!L916,-1)+1","v":{"$error":"#NUM!"}}]
[null,{"$f":"EOMONTH(VENTE!A917,-1)+1","v":{"$error":"#NUM!"}},{"$f":"EOMONTH(VENTE!I917,-1)+1","v":{"$error":"#NUM!"}},{"$f":"EOMONTH(ACHAT!M917,-1)+1","v":{"$error":"#NUM!"}},{"$f":"EOMONTH(ACHAT!L917,-1)+1","v":{"$error":"#NUM!"}}]
[null,{"$f":"EOMONTH(VENTE!A918,-1)+1","v":{"$error":"#NUM!"}},{"$f":"EOMONTH(VENTE!I918,-1)+1","v":{"$error":"#NUM!"}},{"$f":"EOMONTH(ACHAT!M918,-1)+1","v":{"$error":"#NUM!"}},{"$f":"EOMONTH(ACHAT!L918,-1)+1","v":{"$error":"#NUM!"}}]
[null,{"$f":"EOMONTH(VENTE!A919,-1)+1","v":{"$error":"#NUM!"}},{"$f":"EOMONTH(VENTE!I919,-1)+1","v":{"$error":"#NUM!"}},{"$f":"EOMONTH(ACHAT!M919,-1)+1","v":{"$error":"#NUM!"}},{"$f":"EOMONTH(ACHAT!L919,-1)+1","v":{"$error":"#NUM!"}}]
[null,{"$f":"EOMONTH(VENTE!A920,-1)+1","v":{"$error":"#NUM!"}},{"$f":"EOMONTH(VENTE!I920,-1)+1","v":{"$error":"#NUM!"}},{"$f":"EOMONTH(ACHAT!M920,-1)+1","v":{"$error":"#NUM!"}},{"$f":"EOMONTH(ACHAT!L920,-1)+1","v":{"$error":"#NUM!"}}]
[null,{"$f":"EOMONTH(VENTE!A921,-1)+1","v":{"$error":"#NUM!"}},{"$f":"EOMONTH(VENTE!I921,-1)+1","v":{"$error":"#NUM!"}},{"$f":"EOMONTH(ACHAT!M921,-1)+1","v":{"$error":"#NUM!"}},{"$f":"EOMONTH(ACHAT!L921,-1)+1","v":{"$error":"#NUM!"}}]
[null,{"$f":"EOMONTH(VENTE!A922,-1)+1","v":{"$error":"#NUM!"}},{"$f":"EOMONTH(VENTE!I922,-1)+1","v":{"$error":"#NUM!"}},{"$f":"EOMONTH(ACHAT!M922,-1)+1","v":{"$error":"#NUM!"}},{"$f":"EOMONTH(ACHAT!L922,-1)+1","v":{"$error":"#NUM!"}}]
[null,{"$f":"EOMONTH(VENTE!A923,-1)+1","v":{"$error":"#NUM!"}},{"$f":"EOMONTH(VENTE!I923,-1)+1","v":{"$error":"#NUM!"}},{"$f":"EOMONTH(ACHAT!M923,-1)+1","v":{"$error":"#NUM!"}},{"$f":"EOMONTH(ACHAT!L923,-1)+1","v":{"$error":"#NUM!"}}]
[null,{"$f":"EOMONTH(VENTE!A924,-1)+1","v":{"$error":"#NUM!"}},{"$f":"EOMONTH(VENTE!I924,-1)+1","v":{"$error":"#NUM!"}},{"$f":"EOMONTH(ACHAT!M924,-1)+1","v":{"$error":"#NUM!"}},{"$f":"EOMONTH(ACHAT!L924,-1)+1","v":{"$error":"#NUM!"}}]
[null,{"$f":"EOMONTH(VENTE!A925,-1)+1","v":{"$error":"#NUM!"}},{"$f":"EOMONTH(VENTE!I925,-1)+1","v":{"$error":"#NUM!"}},{"$f":"EOMONTH(ACHAT!M925,-1)+1","v":{"$error":"#NUM!"}},{"$f":"EOMONTH(ACHAT!L925,-1)+1","v":{"$error":"#NUM!"}}]
[null,{"$f":"EOMONTH(VENTE!A926,-1)+1","v":{"$error":"#NUM!"}},{"$f":"EOMONTH(VENTE!I926,-1)+1","v":{"$error":"#NUM!"}},{"$f":"EOMONTH(ACHAT!M926,-1)+1","v":{"$error":"#NUM!"}},{"$f":"EOMONTH(ACHAT!L926,-1)+1","v":{"$error":"#NUM!"}}]
[null,{"$f":"EOMONTH(VENTE!A927,-1)+1","v":{"$error":"#NUM!"}},{"$f":"EOMONTH(VENTE!I927,-1)+1","v":{"$error":"#NUM!"}},{"$f":"EOMONTH(ACHAT!M927,-1)+1","v":{"$error":"#NUM!"}},{"$f":"EOMONTH(ACHAT!L927,-1)+1","v":{"$error":"#NUM!"}}]
[null,{"$f":"EOMONTH(VENTE!A928,-1)+1","v":{"$error":"#NUM!"}},{"$f":"EOMONTH(VENTE!I928,-1)+1","v":{"$error":"#NUM!"}},{"$f":"EOMONTH(ACHAT!M928,-1)+1","v":{"$error":"#NUM!"}},{"$f":"EOMONTH(ACHAT!L928,-1)+1","v":{"$error":"#NUM!"}}]
[null,{"$f":"EOMONTH(VENTE!A929,-1)+1","v":{"$error":"#NUM!"}},{"$f":"EOMONTH(VENTE!I929,-1)+1","v":{"$error":"#NUM!"}},{"$f":"EOMONTH(ACHAT!M929,-1)+1","v":{"$error":"#NUM!"}},{"$f":"EOMONTH(ACHAT!L929,-1)+1","v":{"$error":"#NUM!"}}]
[null,{"$f":"EOMONTH(VENTE!A930,-1)+1","v":{"$error":"#NUM!"}},{"$f":"EOMONTH(VENTE!I930,-1)+1","v":{"$error":"#NUM!"}},{"$f":"EOMONTH(ACHAT!M930,-1)+1","v":{"$error":"#NUM!"}},{"$f":"EOMONTH(ACHAT!L930,-1)+1","v":{"$error":"#NUM!"}}]
[null,{"$f":"EOMONTH(VENTE!A931,-1)+1","v":{"$error":"#NUM!"}},{"$f":"EOMONTH(VENTE!I931,-1)+1","v":{"$error":"#NUM!"}},{"$f":"EOMONTH(ACHAT!M931,-1)+1","v":{"$error":"#NUM!"}},{"$f":"EOMONTH(ACHAT!L931,-1)+1","v":{"$error":"#NUM!"}}]
[null,{"$f":"EOMONTH(VENTE!A932,-1)+1","v":{"$error":"#NUM!"}},{"$f":"EOMONTH(VENTE!I932,-1)+1","v":{"$error":"#NUM!"}},{"$f":"EOMONTH(ACHAT!M932,-1)+1","v":{"$error":"#NUM!"}},{"$f":"EOMONTH(ACHAT!L932,-1)+1","v":{"$error":"#NUM!"}}]
[null,{"$f":"EOMONTH(VENTE!A933,-1)+1","v":{"$error":"#NUM!"}},{"$f":"EOMONTH(VENTE!I933,-1)+1","v":{"$error":"#NUM!"}},{"$f":"EOMONTH(ACHAT!M933,-1)+1","v":{"$error":"#NUM!"}},{"$f":"EOMONTH(ACHAT!L933,-1)+1","v":{"$error":"#NUM!"}}]
[null,{"$f":"EOMONTH(VENTE!A934,-1)+1","v":{"$error":"#NUM!"}},{"$f":"EOMONTH(VENTE!I934,-1)+1","v":{"$error":"#NUM!"}},{"$f":"EOMONTH(ACHAT!M934,-1)+1","v":{"$error":"#NUM!"}},{"$f":"EOMONTH(ACHAT!L934,-1)+1","v":{"$error":"#NUM!"}}]
[null,{"$f":"EOMONTH(VENTE!A935,-1)+1","v":{"$error":"#NUM!"}},{"$f":"EOMONTH(VENTE!I935,-1)+1","v":{"$error":"#NUM!"}},{"$f":"EOMONTH(ACHAT!M935,-1)+1","v":{"$error":"#NUM!"}},{"$f":"EOMONTH(ACHAT!L935,-1)+1","v":{"$error":"#NUM!"}}]
[null,{"$f":"EOMONTH(VENTE!A936,-1)+1","v":{"$error":"#NUM!"}},{"$f":"EOMONTH(VENTE!I936,-1)+1","v":{"$error":"#NUM!"}},{"$f":"EOMONTH(ACHAT!M936,-1)+1","v":{"$error":"#NUM!"}},{"$f":"EOMONTH(ACHAT!L936,-1)+1","v":{"$error":"#NUM!"}}]
[null,{"$f":"EOMONTH(VENTE!A937,-1)+1","v":{"$error":"#NUM!"}},{"$f":"EOMONTH(VENTE!I937,-1)+1","v":{"$error":"#NUM!"}},{"$f":"EOMONTH(ACHAT!M937,-1)+1","v":{"$error":"#NUM!"}},{"$f":"EOMONTH(ACHAT!L937,-1)+1","v":{"$error":"#NUM!"}}]
[null,{"$f":"EOMONTH(VENTE!A938,-1)+1","v":{"$error":"#NUM!"}},{"$f":"EOMONTH(VENTE!I938,-1)+1","v":{"$error":"#NUM!"}},{"$f":"EOMONTH(ACHAT!M938,-1)+1","v":{"$error":"#NUM!"}},{"$f":"EOMONTH(ACHAT!L938,-1)+1","v":{"$error":"#NUM!"}}]
[null,{"$f":"EOMONTH(VENTE!A939,-1)+1","v":{"$error":"#NUM!"}},{"$f":"EOMONTH(VENTE!I939,-1)+1","v":{"$error":"#NUM!"}},{"$f":"EOMONTH(ACHAT!M939,-1)+1","v":{"$error":"#NUM!"}},{"$f":"EOMONTH(ACHAT!L939,-1)+1","v":{"$error":"#NUM!"}}]
[null,{"$f":"EOMONTH(VENTE!A940,-1)+1","v":{"$error":"#NUM!"}},{"$f":"EOMONTH(VENTE!I940,-1)+1","v":{"$error":"#NUM!"}},{"$f":"EOMONTH(ACHAT!M940,-1)+1","v":{"$error":"#NUM!"}},{"$f":"EOMONTH(ACHAT!L940,-1)+1","v":{"$error":"#NUM!"}}]
[null,{"$f":"EOMONTH(VENTE!A941,-1)+1","v":{"$error":"#NUM!"}},{"$f":"EOMONTH(VENTE!I941,-1)+1","v":{"$error":"#NUM!"}},{"$f":"EOMONTH(ACHAT!M941,-1)+1","v":{"$error":"#NUM!"}},{"$f":"EOMONTH(ACHAT!L941,-1)+1","v":{"$error":"#NUM!"}}]
[null,{"$f":"EOMONTH(VENTE!A942,-1)+1","v":{"$error":"#NUM!"}},{"$f":"EOMONTH(VENTE!I942,-1)+1","v":{"$error":"#NUM!"}},{"$f":"EOMONTH(ACHAT!M942,-1)+1","v":{"$error":"#NUM!"}},{"$f":"EOMONTH(ACHAT!L942,-1)+1","v":{"$error":"#NUM!"}}]
[null,{"$f":"EOMONTH(VENTE!A943,-1)+1","v":{"$error":"#NUM!"}},{"$f":"EOMONTH(VENTE!I943,-1)+1","v":{"$error":"#NUM!"}},{"$f":"EOMONTH(ACHAT!M943,-1)+1","v":{"$error":"#NUM!"}},{"$f":"EOMONTH(ACHAT!L943,-1)+1","v":{"$error":"#NUM!"}}]
[null,{"$f":"EOMONTH(VENTE!A944,-1)+1","v":{"$error":"#NUM!"}},{"$f":"EOMONTH(VENTE!I944,-1)+1","v":{"$error":"#NUM!"}},{"$f":"EOMONTH(ACHAT!M944,-1)+1","v":{"$error":"#NUM!"}},{"$f":"EOMONTH(ACHAT!L944,-1)+1","v":{"$error":"#NUM!"}}]
[null,{"$f":"EOMONTH(VENTE!A945,-1)+1","v":{"$error":"#NUM!"}},{"$f":"EOMONTH(VENTE!I945,-1)+1","v":{"$error":"#NUM!"}},{"$f":"EOMONTH(ACHAT!M945,-1)+1","v":{"$error":"#NUM!"}},{"$f":"EOMONTH(ACHAT!L945,-1)+1","v":{"$error":"#NUM!"}}]
[null,{"$f":"EOMONTH(VENTE!A946,-1)+1","v":{"$error":"#NUM!"}},{"$f":"EOMONTH(VENTE!I946,-1)+1","v":{"$error":"#NUM!"}},{"$f":"EOMONTH(ACHAT!M946,-1)+1","v":{"$error":"#NUM!"}},{"$f":"EOMONTH(ACHAT!L946,-1)+1","v":{"$error":"#NUM!"}}]
[null,{"$f":"EOMONTH(VENTE!A947,-1)+1","v":{"$error":"#NUM!"}},{"$f":"EOMONTH(VENTE!I947,-1)+1","v":{"$error":"#NUM!"}},{"$f":"EOMONTH(ACHAT!M947,-1)+1","v":{"$error":"#NUM!"}},{"$f":"EOMONTH(ACHAT!L947,-1)+1","v":{"$error":"#NUM!"}}]
[null,{"$f":"EOMONTH(VENTE!A948,-1)+1","v":{"$error":"#NUM!"}},{"$f":"EOMONTH(VENTE!I948,-1)+1","v":{"$error":"#NUM!"}},{"$f":"EOMONTH(ACHAT!M948,-1)+1","v":{"$error":"#NUM!"}},{"$f":"EOMONTH(ACHAT!L948,-1)+1","v":{"$error":"#NUM!"}}]
[null,{"$f":"EOMONTH(VENTE!A949,-1)+1","v":{"$error":"#NUM!"}},{"$f":"EOMONTH(VENTE!I949,-1)+1","v":{"$error":"#NUM!"}},{"$f":"EOMONTH(ACHAT!M949,-1)+1","v":{"$error":"#NUM!"}},{"$f":"EOMONTH(ACHAT!L949,-1)+1","v":{"$error":"#NUM!"}}]
[null,{"$f":"EOMONTH(VENTE!A950,-1)+1","v":{"$error":"#NUM!"}},{"$f":"EOMONTH(VENTE!I950,-1)+1","v":{"$error":"#NUM!"}},{"$f":"EOMONTH(ACHAT!M950,-1)+1","v":{"$error":"#NUM!"}},{"$f":"EOMONTH(ACHAT!L950,-1)+1","v":{"$error":"#NUM!"}}]
[null,{"$f":"EOMONTH(VENTE!A951,-1)+1","v":{"$error":"#NUM!"}},{"$f":"EOMONTH(VENTE!I951,-1)+1","v":{"$error":"#NUM!"}},{"$f":"EOMONTH(ACHAT!M951,-1)+1","v":{"$error":"#NUM!"}},{"$f":"EOMONTH(ACHAT!L951,-1)+1","v":{"$error":"#NUM!"}}]
[null,{"$f":"EOMONTH(VENTE!A952,-1)+1","v":{"$error":"#NUM!"}},{"$f":"EOMONTH(VENTE!I952,-1)+1","v":{"$error":"#NUM!"}},{"$f":"EOMONTH(ACHAT!M952,-1)+1","v":{"$error":"#NUM!"}},{"$f":"EOMONTH(ACHAT!L952,-1)+1","v":{"$error":"#NUM!"}}]
[null,{"$f":"EOMONTH(VENTE!A953,-1)+1","v":{"$error":"#NUM!"}},{"$f":"EOMONTH(VENTE!I953,-1)+1","v":{"$error":"#NUM!"}},{"$f":"EOMONTH(ACHAT!M953,-1)+1","v":{"$error":"#NUM!"}},{"$f":"EOMONTH(ACHAT!L953,-1)+1","v":{"$error":"#NUM!"}}]
[null,{"$f":"EOMONTH(VENTE!A954,-1)+1","v":{"$error":"#NUM!"}},{"$f":"EOMONTH(VENTE!I954,-1)+1","v":{"$error":"#NUM!"}},{"$f":"EOMONTH(ACHAT!M954,-1)+1","v":{"$error":"#NUM!"}},{"$f":"EOMONTH(ACHAT!L954,-1)+1","v":{"$error":"#NUM!"}}]
[null,{"$f":"EOMONTH(VENTE!A955,-1)+1","v":{"$error":"#NUM!"}},{"$f":"EOMONTH(VENTE!I955,-1)+1","v":{"$error":"#NUM!"}},{"$f":"EOMONTH(ACHAT!M955,-1)+1","v":{"$error":"#NUM!"}},{"$f":"EOMONTH(ACHAT!L955,-1)+1","v":{"$error":"#NUM!"}}]
[null,{"$f":"EOMONTH(VENTE!A956,-1)+1","v":{"$error":"#NUM!"}},{"$f":"EOMONTH(VENTE!I956,-1)+1","v":{"$error":"#NUM!"}},{"$f":"EOMONTH(ACHAT!M956,-1)+1","v":{"$error":"#NUM!"}},{"$f":"EOMONTH(ACHAT!L956,-1)+1","v":{"$error":"#NUM!"}}]
[null,{"$f":"EOMONTH(VENTE!A957,-1)+1","v":{"$error":"#NUM!"}},{"$f":"EOMONTH(VENTE!I957,-1)+1","v":{"$error":"#NUM!"}},{"$f":"EOMONTH(ACHAT!M957,-1)+1","v":{"$error":"#NUM!"}},{"$f":"EOMONTH(ACHAT!L957,-1)+1","v":{"$error":"#NUM!"}}]
[null,{"$f":"EOMONTH(VENTE!A958,-1)+1","v":{"$error":"#NUM!"}},{"$f":"EOMONTH(VENTE!I958,-1)+1","v":{"$error":"#NUM!"}},{"$f":"EOMONTH(ACHAT!M958,-1)+1","v":{"$error":"#NUM!"}},{"$f":"EOMONTH(ACHAT!L958,-1)+1","v":{"$error":"#NUM!"}}]
[null,{"$f":"EOMONTH(VENTE!A959,-1)+1","v":{"$error":"#NUM!"}},{"$f":"EOMONTH(VENTE!I959,-1)+1","v":{"$error":"#NUM!"}},{"$f":"EOMONTH(ACHAT!M959,-1)+1","v":{"$error":"#NUM!"}},{"$f":"EOMONTH(ACHAT!L959,-1)+1","v":{"$error":"#NUM!"}}]
[null,{"$f":"EOMONTH(VENTE!A960,-1)+1","v":{"$error":"#NUM!"}},{"$f":"EOMONTH(VENTE!I960,-1)+1","v":{"$error":"#NUM!"}},{"$f":"EOMONTH(ACHAT!M960,-1)+1","v":{"$error":"#NUM!"}},{"$f":"EOMONTH(ACHAT!L960,-1)+1","v":{"$error":"#NUM!"}}]
[null,{"$f":"EOMONTH(VENTE!A961,-1)+1","v":{"$error":"#NUM!"}},{"$f":"EOMONTH(VENTE!I961,-1)+1","v":{"$error":"#NUM!"}},{"$f":"EOMONTH(ACHAT!M961,-1)+1","v":{"$error":"#NUM!"}},{"$f":"EOMONTH(ACHAT!L961,-1)+1","v":{"$error":"#NUM!"}}]
[null,{"$f":"EOMONTH(VENTE!A962,-1)+1","v":{"$error":"#NUM!"}},{"$f":"EOMONTH(VENTE!I962,-1)+1","v":{"$error":"#NUM!"}},{"$f":"EOMONTH(ACHAT!M962,-1)+1","v":{"$error":"#NUM!"}},{"$f":"EOMONTH(ACHAT!L962,-1)+1","v":{"$error":"#NUM!"}}]
[null,{"$f":"EOMONTH(VENTE!A963,-1)+1","v":{"$error":"#NUM!"}},{"$f":"EOMONTH(VENTE!I963,-1)+1","v":{"$error":"#NUM!"}},{"$f":"EOMONTH(ACHAT!M963,-1)+1","v":{"$error":"#NUM!"}},{"$f":"EOMONTH(ACHAT!L963,-1)+1","v":{"$error":"#NUM!"}}]
[null,{"$f":"EOMONTH(VENTE!A964,-1)+1","v":{"$error":"#NUM!"}},{"$f":"EOMONTH(VENTE!I964,-1)+1","v":{"$error":"#NUM!"}},{"$f":"EOMONTH(ACHAT!M964,-1)+1","v":{"$error":"#NUM!"}},{"$f":"EOMONTH(ACHAT!L964,-1)+1","v":{"$error":"#NUM!"}}]
[null,{"$f":"EOMONTH(VENTE!A965,-1)+1","v":{"$error":"#NUM!"}},{"$f":"EOMONTH(VENTE!I965,-1)+1","v":{"$error":"#NUM!"}},{"$f":"EOMONTH(ACHAT!M965,-1)+1","v":{"$error":"#NUM!"}},{"$f":"EOMONTH(ACHAT!L965,-1)+1","v":{"$error":"#NUM!"}}]
[null,{"$f":"EOMONTH(VENTE!A966,-1)+1","v":{"$error":"#NUM!"}},{"$f":"EOMONTH(VENTE!I966,-1)+1","v":{"$error":"#NUM!"}},{"$f":"EOMONTH(ACHAT!M966,-1)+1","v":{"$error":"#NUM!"}},{"$f":"EOMONTH(ACHAT!L966,-1)+1","v":{"$error":"#NUM!"}}]
[null,{"$f":"EOMONTH(VENTE!A967,-1)+1","v":{"$error":"#NUM!"}},{"$f":"EOMONTH(VENTE!I967,-1)+1","v":{"$error":"#NUM!"}},{"$f":"EOMONTH(ACHAT!M967,-1)+1","v":{"$error":"#NUM!"}},{"$f":"EOMONTH(ACHAT!L967,-1)+1","v":{"$error":"#NUM!"}}]
[null,{"$f":"EOMONTH(VENTE!A968,-1)+1","v":{"$error":"#NUM!"}},{"$f":"EOMONTH(VENTE!I968,-1)+1","v":{"$error":"#NUM!"}},{"$f":"EOMONTH(ACHAT!M968,-1)+1","v":{"$error":"#NUM!"}},{"$f":"EOMONTH(ACHAT!L968,-1)+1","v":{"$error":"#NUM!"}}]
[null,{"$f":"EOMONTH(VENTE!A969,-1)+1","v":{"$error":"#NUM!"}},{"$f":"EOMONTH(VENTE!I969,-1)+1","v":{"$error":"#NUM!"}},{"$f":"EOMONTH(ACHAT!M969,-1)+1","v":{"$error":"#NUM!"}},{"$f":"EOMONTH(ACHAT!L969,-1)+1","v":{"$error":"#NUM!"}}]
[null,{"$f":"EOMONTH(VENTE!A970,-1)+1","v":{"$error":"#NUM!"}},{"$f":"EOMONTH(VENTE!I970,-1)+1","v":{"$error":"#NUM!"}},{"$f":"EOMONTH(ACHAT!M970,-1)+1","v":{"$error":"#NUM!"}},{"$f":"EOMONTH(ACHAT!L970,-1)+1","v":{"$error":"#NUM!"}}]
[null,{"$f":"EOMONTH(VENTE!A971,-1)+1","v":{"$error":"#NUM!"}},{"$f":"EOMONTH(VENTE!I971,-1)+1","v":{"$error":"#NUM!"}},{"$f":"EOMONTH(ACHAT!M971,-1)+1","v":{"$error":"#NUM!"}},{"$f":"EOMONTH(ACHAT!L971,-1)+1","v":{"$error":"#NUM!"}}]
[null,{"$f":"EOMONTH(VENTE!A972,-1)+1","v":{"$error":"#NUM!"}},{"$f":"EOMONTH(VENTE!I972,-1)+1","v":{"$error":"#NUM!"}},{"$f":"EOMONTH(ACHAT!M972,-1)+1","v":{"$error":"#NUM!"}},{"$f":"EOMONTH(ACHAT!L972,-1)+1","v":{"$error":"#NUM!"}}]
[null,{"$f":"EOMONTH(VENTE!A973,-1)+1","v":{"$error":"#NUM!"}},{"$f":"EOMONTH(VENTE!I973,-1)+1","v":{"$error":"#NUM!"}},{"$f":"EOMONTH(ACHAT!M973,-1)+1","v":{"$error":"#NUM!"}},{"$f":"EOMONTH(ACHAT!L973,-1)+1","v":{"$error":"#NUM!"}}]
[null,{"$f":"EOMONTH(VENTE!A974,-1)+1","v":{"$error":"#NUM!"}},{"$f":"EOMONTH(VENTE!I974,-1)+1","v":{"$error":"#NUM!"}},{"$f":"EOMONTH(ACHAT!M974,-1)+1","v":{"$error":"#NUM!"}},{"$f":"EOMONTH(ACHAT!L974,-1)+1","v":{"$error":"#NUM!"}}]
[null,{"$f":"EOMONTH(VENTE!A975,-1)+1","v":{"$error":"#NUM!"}},{"$f":"EOMONTH(VENTE!I975,-1)+1","v":{"$error":"#NUM!"}},{"$f":"EOMONTH(ACHAT!M975,-1)+1","v":{"$error":"#NUM!"}},{"$f":"EOMONTH(ACHAT!L975,-1)+1","v":{"$error":"#NUM!"}}]
[null,{"$f":"EOMONTH(VENTE!A976,-1)+1","v":{"$error":"#NUM!"}},{"$f":"EOMONTH(VENTE!I976,-1)+1","v":{"$error":"#NUM!"}},{"$f":"EOMONTH(ACHAT!M976,-1)+1","v":{"$error":"#NUM!"}},{"$f":"EOMONTH(ACHAT!L976,-1)+1","v":{"$error":"#NUM!"}}]
[null,{"$f":"EOMONTH(VENTE!A977,-1)+1","v":{"$error":"#NUM!"}},{"$f":"EOMONTH(VENTE!I977,-1)+1","v":{"$error":"#NUM!"}},{"$f":"EOMONTH(ACHAT!M977,-1)+1","v":{"$error":"#NUM!"}},{"$f":"EOMONTH(ACHAT!L977,-1)+1","v":{"$error":"#NUM!"}}]
[null,{"$f":"EOMONTH(VENTE!A978,-1)+1","v":{"$error":"#NUM!"}},{"$f":"EOMONTH(VENTE!I978,-1)+1","v":{"$error":"#NUM!"}},{"$f":"EOMONTH(ACHAT!M978,-1)+1","v":{"$error":"#NUM!"}},{"$f":"EOMONTH(ACHAT!L978,-1)+1","v":{"$error":"#NUM!"}}]
[null,{"$f":"EOMONTH(VENTE!A979,-1)+1","v":{"$error":"#NUM!"}},{"$f":"EOMONTH(VENTE!I979,-1)+1","v":{"$error":"#NUM!"}},{"$f":"EOMONTH(ACHAT!M979,-1)+1","v":{"$error":"#NUM!"}},{"$f":"EOMONTH(ACHAT!L979,-1)+1","v":{"$error":"#NUM!"}}]
[null,{"$f":"EOMONTH(VENTE!A980,-1)+1","v":{"$error":"#NUM!"}},{"$f":"EOMONTH(VENTE!I980,-1)+1","v":{"$error":"#NUM!"}},{"$f":"EOMONTH(ACHAT!M980,-1)+1","v":{"$error":"#NUM!"}},{"$f":"EOMONTH(ACHAT!L980,-1)+1","v":{"$error":"#NUM!"}}]
[null,{"$f":"EOMONTH(VENTE!A981,-1)+1","v":{"$error":"#NUM!"}},{"$f":"EOMONTH(VENTE!I981,-1)+1","v":{"$error":"#NUM!"}},{"$f":"EOMONTH(ACHAT!M981,-1)+1","v":{"$error":"#NUM!"}},{"$f":"EOMONTH(ACHAT!L981,-1)+1","v":{"$error":"#NUM!"}}]
[null,{"$f":"EOMONTH(VENTE!A982,-1)+1","v":{"$error":"#NUM!"}},{"$f":"EOMONTH(VENTE!I982,-1)+1","v":{"$error":"#NUM!"}},{"$f":"EOMONTH(ACHAT!M982,-1)+1","v":{"$error":"#NUM!"}},{"$f":"EOMONTH(ACHAT!L982,-1)+1","v":{"$error":"#NUM!"}}]
[null,{"$f":"EOMONTH(VENTE!A983,-1)+1","v":{"$error":"#NUM!"}},{"$f":"EOMONTH(VENTE!I983,-1)+1","v":{"$error":"#NUM!"}},{"$f":"EOMONTH(ACHAT!M983,-1)+1","v":{"$error":"#NUM!"}},{"$f":"EOMONTH(ACHAT!L983,-1)+1","v":{"$error":"#NUM!"}}]
[null,{"$f":"EOMONTH(VENTE!A984,-1)+1","v":{"$error":"#NUM!"}},{"$f":"EOMONTH(VENTE!I984,-1)+1","v":{"$error":"#NUM!"}},{"$f":"EOMONTH(ACHAT!M984,-1)+1","v":{"$error":"#NUM!"}},{"$f":"EOMONTH(ACHAT!L984,-1)+1","v":{"$error":"#NUM!"}}]
[null,{"$f":"EOMONTH(VENTE!A985,-1)+1","v":{"$error":"#NUM!"}},{"$f":"EOMONTH(VENTE!I985,-1)+1","v":{"$error":"#NUM!"}},{"$f":"EOMONTH(ACHAT!M985,-1)+1","v":{"$error":"#NUM!"}},{"$f":"EOMONTH(ACHAT!L985,-1)+1","v":{"$error":"#NUM!"}}]
[null,{"$f":"EOMONTH(VENTE!A986,-1)+1","v":{"$error":"#NUM!"}},{"$f":"EOMONTH(VENTE!I986,-1)+1","v":{"$error":"#NUM!"}},{"$f":"EOMONTH(ACHAT!M986,-1)+1","v":{"$error":"#NUM!"}},{"$f":"EOMONTH(ACHAT!L986,-1)+1","v":{"$error":"#NUM!"}}]
[null,{"$f":"EOMONTH(VENTE!A987,-1)+1","v":{"$error":"#NUM!"}},{"$f":"EOMONTH(VENTE!I987,-1)+1","v":{"$error":"#NUM!"}},{"$f":"EOMONTH(ACHAT!M987,-1)+1","v":{"$error":"#NUM!"}},{"$f":"EOMONTH(ACHAT!L987,-1)+1","v":{"$error":"#NUM!"}}]
[null,{"$f":"EOMONTH(VENTE!A988,-1)+1","v":{"$error":"#NUM!"}},{"$f":"EOMONTH(VENTE!I988,-1)+1","v":{"$error":"#NUM!"}},{"$f":"EOMONTH(ACHAT!M988,-1)+1","v":{"$error":"#NUM!"}},{"$f":"EOMONTH(ACHAT!L988,-1)+1","v":{"$error":"#NUM!"}}]
[null,{"$f":"EOMONTH(VENTE!A989,-1)+1","v":{"$error":"#NUM!"}},{"$f":"EOMONTH(VENTE!I989,-1)+1","v":{"$error":"#NUM!"}},{"$f":"EOMONTH(ACHAT!M989,-1)+1","v":{"$error":"#NUM!"}},{"$f":"EOMONTH(ACHAT!L989,-1)+1","v":{"$error":"#NUM!"}}]
[null,{"$f":"EOMONTH(VENTE!A990,-1)+1","v":{"$error":"#NUM!"}},{"$f":"EOMONTH(VENTE!I990,-1)+1","v":{"$error":"#NUM!"}},{"$f":"EOMONTH(ACHAT!M990,-1)+1","v":{"$error":"#NUM!"}},{"$f":"EOMONTH(ACHAT!L990,-1)+1","v":{"$error":"#NUM!"}}]
[null,{"$f":"EOMONTH(VENTE!A991,-1)+1","v":{"$error":"#NUM!"}},{"$f":"EOMONTH(VENTE!I991,-1)+1","v":{"$error":"#NUM!"}},{"$f":"EOMONTH(ACHAT!M991,-1)+1","v":{"$error":"#NUM!"}},{"$f":"EOMONTH(ACHAT!L991,-1)+1","v":{"$error":"#NUM!"}}]
[null,{"$f":"EOMONTH(VENTE!A992,-1)+1","v":{"$error":"#NUM!"}},{"$f":"EOMONTH(VENTE!I992,-1)+1","v":{"$error":"#NUM!"}},{"$f":"EOMONTH(ACHAT!M992,-1)+1","v":{"$error":"#NUM!"}},{"$f":"EOMONTH(ACHAT!L992,-1)+1","v":{"$error":"#NUM!"}}]
[null,{"$f":"EOMONTH(VENTE!A993,-1)+1","v":{"$error":"#NUM!"}},{"$f":"EOMONTH(VENTE!I993,-1)+1","v":{"$error":"#NUM!"}},{"$f":"EOMONTH(ACHAT!M993,-1)+1","v":{"$error":"#NUM!"}},{"$f":"EOMONTH(ACHAT!L993,-1)+1","v":{"$error":"#NUM!"}}]
[null,{"$f":"EOMONTH(VENTE!A994,-1)+1","v":{"$error":"#NUM!"}},{"$f":"EOMONTH(VENTE!I994,-1)+1","v":{"$error":"#NUM!"}},{"$f":"EOMONTH(ACHAT!M994,-1)+1","v":{"$error":"#NUM!"}},{"$f":"EOMONTH(ACHAT!L994,-1)+1","v":{"$error":"#NUM!"}}]
[null,{"$f":"EOMONTH(VENTE!A995,-1)+1","v":{"$error":"#NUM!"}},{"$f":"EOMONTH(VENTE!I995,-1)+1","v":{"$error":"#NUM!"}},{"$f":"EOMONTH(ACHAT!M995,-1)+1","v":{"$error":"#NUM!"}},{"$f":"EOMONTH(ACHAT!L995,-1)+1","v":{"$error":"#NUM!"}}]
[null,{"$f":"EOMONTH(VENTE!A996,-1)+1","v":{"$error":"#NUM!"}},{"$f":"EOMONTH(VENTE!I996,-1)+1","v":{"$error":"#NUM!"}},{"$f":"EOMONTH(ACHAT!M996,-1)+1","v":{"$error":"#NUM!"}},{"$f":"EOMONTH(ACHAT!L996,-1)+1","v":{"$error":"#NUM!"}}]
[null,{"$f":"EOMONTH(VENTE!A997,-1)+1","v":{"$error":"#NUM!"}},{"$f":"EOMONTH(VENTE!I997,-1)+1","v":{"$error":"#NUM!"}},{"$f":"EOMONTH(ACHAT!M997,-1)+1","v":{"$error":"#NUM!"}},{"$f":"EOMONTH(ACHAT!L997,-1)+1","v":{"$error":"#NUM!"}}]
[null,{"$f":"EOMONTH(VENTE!A998,-1)+1","v":{"$error":"#NUM!"}},{"$f":"EOMONTH(VENTE!I998,-1)+1","v":{"$error":"#NUM!"}},{"$f":"EOMONTH(ACHAT!M998,-1)+1","v":{"$error":"#NUM!"}},{"$f":"EOMONTH(ACHAT!L998,-1)+1","v":{"$error":"#NUM!"}}]
[null,{"$f":"EOMONTH(VENTE!A999,-1)+1","v":{"$error":"#NUM!"}},{"$f":"EOMONTH(VENTE!I999,-1)+1","v":{"$error":"#NUM!"}},{"$f":"EOMONTH(ACHAT!M999,-1)+1","v":{"$error":"#NUM!"}},{"$f":"EOMONTH(ACHAT!L999,-1)+1","v":{"$error":"#NUM!"}}]
[null,{"$f":"EOMONTH(VENTE!A1000,-1)+1","v":{"$error":"#NUM!"}},{"$f":"EOMONTH(VENTE!I1000,-1)+1","v":{"$error":"#NUM!"}},{"$f":"EOMONTH(ACHAT!M1000,-1)+1","v":{"$error":"#NUM!"}},{"$f":"EOMONTH(ACHAT!L1000,-1)+1","v":{"$error":"#NUM!"}}]