{"text_format":"1","workbook":"xlsx","n_sheets":6,"sheets":["VENTE","ACHAT","RECAP","CA","XML","X"],"not_rendered":{"charts":0,"images":0,"macros":1,"external_links":1,"defined_names":52,"comments":3,"pivot_tables":1},"unopened":[],"bounds":{"document_bytes":16777216,"sheet_cells":100000,"rows_first":2000,"rows_last":500,"rows_between":2000,"halvings":0,"cell_chars":16384,"cell_head_chars":4096},"cells_cut":0,"cells_raw":0,"read":"whole","date_system":"1900"}

{"sheet":"VENTE","index":0,"n_rows":900,"n_cols":11,"rows_kept":900,"cut":false,"hidden":false,"merged":[[0,0,0,10],[1,2,1,4],[1,5,1,6]]}
["TABLEAU DES VENTES"]
[null,null,"ANNEE DE DECLARATION",null,null,"2016-01-01"]
["Date","N°Fact","Raison Social","Montant Ht","Tx %","Tva","Montant TTC","Mode Reg","Date Reg","Mois Decl","Mode paiement"]
["2015-05-27",150219,"CLIENT 031",1515.83,0.2,303.17,1819,"CHQ 2748357","2016-01-20","2016-01-01",{"$f":"IF(COUNTIF(H4,\"*EF*\"),5,IF(COUNTIF(H4,\"*ES*\"),1,IF(COUNTIF(H4,\"*CH*\"),2,IF(COUNTIF(H4,\"*PR*\"),3,IF(COUNTIF(H4,\"*CO*\"),6,IF(COUNTIF(H4,\"*VI*\"),4,7))))))","v":2}]
["2015-05-30",150188,"CLIENT 031",8658.5,0.2,1731.7,10390.200000000001,"CHQ 2748357","2016-01-20","2016-01-01",2]
["2015-07-06",150227,"CLIENT 031",3587.5,0.2,717.5,4305,"CHQ 2748357","2016-01-20","2016-01-01",2]
["2015-08-30",150269,"CLIENT 031",625,0.2,125,750,"CHQ 2748357","2016-01-20","2016-01-01",2]
["2015-09-30",150295,"CLIENT 031",2322.5,0.2,464.5,2787,"CHQ 2748357","2016-01-20","2016-01-01",2]
{"$rows_left_out":893}
{"sheet":"ACHAT","index":1,"n_rows":354,"n_cols":15,"rows_kept":354,"cut":false,"hidden":false,"merged":[[1,0,1,14]]}
[{"$f":"XML!XY1","v":"2016-04-01"}]
["TABLEAU DES DEDUCTIONS"]
[]
[null,"FACTURE N°","DESIGNATION","MONTANT HT","TVA","MONTANT TTC","IF","RAISON SOCIAL","ICE","TX %","MODE REG","DATE PAIEMENT","DATE FACTURE","Mois Décl","Mode paiement"]
[null,201403278,"MARCHANDISES",2250,450,2700,1008985,{"$f":"INDEX(X!$H$2:$J$1000,MATCH($G5,X!$H$2:$H$1000,0),2)","v":"FOURNISSEUR 0020"},{"$f":"INDEX(X!$H$2:$J$1000,MATCH($G5,X!$H$2:$H$1000,0),3)","v":"00191111004000074"},0.2,"EFFET T 04670220","2014-11-10","2014-11-30","2015-01-01",{"$f":"IF(COUNTIF(K5,\"*EF*\"),5,IF(COUNTIF(K5,\"*ES*\"),1,IF(COUNTIF(K5,\"*CH*\"),2,IF(COUNTIF(K5,\"*PR*\"),3,IF(COUNTIF(K5,\"*CO*\"),6,IF(COUNTIF(K5,\"*VI*\"),4,7))))))","v":5}]
[null,"15/1/0005","MARCHANDISES",2089.6799999999998,417.94,2507.62,1009741,{"$f":"INDEX(X!$H$2:$J$1000,MATCH($G6,X!$H$2:$H$1000,0),2)","v":"FOURNISSEUR 0032"},{"$f":"INDEX(X!$H$2:$J$1000,MATCH($G6,X!$H$2:$H$1000,0),3)","v":"00311111004000086"},0.2,"EFFET 04670240","2015-01-07","2015-01-31","2015-01-01",5]
[null,14102845,"MARCHANDISES",8250.83,1650.17,9901,1008922,{"$f":"INDEX(X!$H$2:$J$1000,MATCH($G7,X!$H$2:$H$1000,0),2)","v":"FOURNISSEUR 0019"},{"$f":"INDEX(X!$H$2:$J$1000,MATCH($G7,X!$H$2:$H$1000,0),3)","v":"00181111004000073"},0.2,"EFFET T 04670242","2015-01-30","2014-10-31","2015-01-01",5]
[null,14102846,"MARCHANDISES",11114.17,2222.83,13337,1008922,{"$f":"INDEX(X!$H$2:$J$1000,MATCH($G8,X!$H$2:$H$1000,0),2)","v":"FOURNISSEUR 0019"},{"$f":"INDEX(X!$H$2:$J$1000,MATCH($G8,X!$H$2:$H$1000,0),3)","v":"00181111004000073"},0.2,"EFFET T 04670242","2015-01-30","2014-10-31","2015-01-01",5]
{"$rows_left_out":347}
{"sheet":"RECAP","index":2,"n_rows":62,"n_cols":30,"rows_kept":62,"cut":false,"hidden":false,"merged":[[24,20,24,22],[25,20,25,21],[1,0,1,17],[22,0,22,17],[24,0,24,3],[25,2,26,3],[24,6,24,8],[25,6,25,7],[24,11,24,14],[25,9,25,10],[41,9,41,10],[42,9,42,10],[43,9,43,10],[44,9,44,10],[46,5,46,6],[41,5,41,6],[42,5,42,6],[43,5,43,6],[44,5,44,6],[45,5,45,6],[37,9,37,10],[38,9,38,10],[39,9,39,10],[40,9,40,10],[30,2,30,3],[31,2,31,3],[49,5,49,6],[50,5,50,6],[25,0,25,1],[47,5,47,6],[48,5,48,6],[39,5,39,6],[40,5,40,6],[32,2,32,3],[33,2,33,3],[27,2,27,3],[28,2,28,3],[29,2,29,3],[34,2,34,3],[37,5,37,6],[38,5,38,6],[37,0,37,4],[58,9,58,10],[59,9,59,10],[60,9,60,10],[61,9,61,10],[45,9,45,10],[46,9,46,10],[47,9,47,10],[48,9,48,10],[49,9,49,10],[50,9,50,10],[51,9,51,10],[52,9,52,10],[53,9,53,10],[55,9,55,10],[56,9,56,10],[57,9,57,10],[58,5,58,6],[59,5,59,6],[60,5,60,6],[61,5,61,6],[51,5,51,6],[52,5,52,6],[53,5,53,6],[55,5,55,6],[56,5,56,6],[57,5,57,6]]}
[]
[{"$f":"\"TABLEAU DEDUCTION TVA ANNEE\"&\" \"&YEAR(A6)","v":"TABLEAU DEDUCTION TVA ANNEE 2016"}]
[1,2,3,4,5,6,7,8,9,10,11,12,13,14,15,16,17,18]
["Mois Décl","Vente HT","Tva Vente 7%","Tva Vente 10%","Tva Vente 14%","Tva Vente 30%","Tva Vente 20%","Pres serv 20%","Transp 14% ","Op Bq 10%","March 20%","Services 7%","Elect 14%","Immob 20%","Total TVA Mois Achat","Crédit Préc","Total Ded Mois","Mt Tva a declare",null,"Années","Montant Crédit TVA"]
[{"$f":"\"Report Crédit Tva\" &\" \"&YEAR(A6-1)","v":"Report Crédit Tva 2015"},null,null,null,null,null,null,null,null,null,null,null,null,null,null,null,null,{"$f":"VLOOKUP(Tableau4[[#This Row],[Mois Décl]],T5:U10,2)","v":-5535.27},null,{"$f":"\"Report Crédit Tva\"&\" \"&YEAR(X!$F$2)-1","v":"Report Crédit Tva 2015"},-5535.27]
[{"$f":"VENTE!F2","v":"2016-01-01"},{"$f":"SUMIFS(VENTE!$D$4:$D$74974,VENTE!$J$4:$J$74974,A6)","v":64359.6},{"$f":"SUMIFS(VENTE!$F$4:$F$14982,VENTE!$E$4:$E$14982,\"0,07\",VENTE!$J$4:$J$14982,Tableau4[[#This Row],[Mois Décl]])","v":0},{"$f":"SUMIFS(VENTE!$F$4:$F$14982,VENTE!$E$4:$E$14982,\"0,10\",VENTE!$J$4:$J$14982,A6)","v":0},{"$f":"SUMIFS(VENTE!$F$4:$F$14982,VENTE!$E$4:$E$14982,\"0,14\",VENTE!$J$4:$J$14982,A6)","v":0},{"$f":"SUMIFS(VENTE!$F$4:$F$14982,VENTE!$E$4:$E$14982,\"0,30\",VENTE!$J$4:$J$14982,A6)","v":0},{"$f":"ROUNDUP(Tableau4[[#This Row],[Vente HT]],-1)*0.2","v":12872},{"$f":"SUMIFS(ACHAT!$E$5:$E$34826,ACHAT!$C$5:$C$34826,XML!$I$2,ACHAT!$N$5:$N$34826,A6,ACHAT!$J$5:$J$34826,XML!$J$2)","v":0},{"$f":"SUMIFS(ACHAT!$E$5:$E$34826,ACHAT!$C$5:$C$34826,XML!$I$4,ACHAT!$N$5:$N$34826,A6,ACHAT!$J$5:$J$34826,XML!$J$4)","v":0},{"$f":"SUMIFS(ACHAT!$E$5:$E$34826,ACHAT!$C$5:$C$34826,XML!$I$3,ACHAT!$N$5:$N$34826,A6,ACHAT!$J$5:$J$34826,XML!$J$3)","v":0},{"$f":"SUMIFS(ACHAT!$E$5:$E$34826,ACHAT!$C$5:$C$34826,XML!$I$8,ACHAT!$N$5:$N$34826,A6,ACHAT!$J$5:$J$34826,XML!$J$8)","v":7927.07},{"$f":"SUMIFS(ACHAT!$E$5:$E$34826,ACHAT!$C$5:$C$34826,XML!$I$5,ACHAT!$N$5:$N$34826,A6,ACHAT!$J$5:$J$34826,XML!$J$5)","v":0},{"$f":"SUMIFS(ACHAT!$E$5:$E$34826,ACHAT!$C$5:$C$34826,XML!$I$6,ACHAT!$N$5:$N$34826,A6,ACHAT!$J$5:$J$34826,XML!$J$6)","v":0},{"$f":"SUMIFS(ACHAT!$E$5:$E$34826,ACHAT!$C$5:$C$34826,XML!$I$7,ACHAT!$N$5:$N$34826,A6,ACHAT!$J$5:$J$34826,XML!$J$7)","v":0},{"$f":"H6+I6+J6+K6+L6+N6","v":7927.07},{"$f":"IF(R5>=0,0,OFFSET(A1,4,17))","v":-5535.27},{"$f":"O6-P6","v":13462.34},{"$f":"G6-Q6","v":-590.34},null,{"$f":"\"Report Crédit Tva\"&\" \"&YEAR(X!$F$2)","v":"Report Crédit Tva 2016"},0,null,null,null,null,null,null,null,7.0000000000000007E-2,"EAU "]
[{"$f":"EDATE(A6,1)","v":"2016-02-01"},{"$f":"SUMIFS(VENTE!$D$4:$D$74974,VENTE!$J$4:$J$74974,A7)","v":54222.84},{"$f":"SUMIFS(VENTE!$F$4:$F$14982,VENTE!$E$4:$E$14982,\"0,07\",VENTE!$J$4:$J$14982,Tableau4[[#This Row],[Mois Décl]])","v":0},{"$f":"SUMIFS(VENTE!$F$4:$F$14982,VENTE!$E$4:$E$14982,\"0,10\",VENTE!$J$4:$J$14982,A7)","v":0},{"$f":"SUMIFS(VENTE!$F$4:$F$14982,VENTE!$E$4:$E$14982,\"0,14\",VENTE!$J$4:$J$14982,A7)","v":0},{"$f":"SUMIFS(VENTE!$F$4:$F$14982,VENTE!$E$4:$E$14982,\"0,30\",VENTE!$J$4:$J$14982,A7)","v":0},{"$f":"ROUNDUP(Tableau4[[#This Row],[Vente HT]],-1)*0.2","v":10846},{"$f":"SUMIFS(ACHAT!$E$5:$E$34826,ACHAT!$C$5:$C$34826,XML!$I$2,ACHAT!$N$5:$N$34826,A7,ACHAT!$J$5:$J$34826,XML!$J$2)","v":0},{"$f":"SUMIFS(ACHAT!$E$5:$E$34826,ACHAT!$C$5:$C$34826,XML!$I$4,ACHAT!$N$5:$N$34826,A7,ACHAT!$J$5:$J$34826,XML!$J$4)","v":0},{"$f":"SUMIFS(ACHAT!$E$5:$E$34826,ACHAT!$C$5:$C$34826,XML!$I$3,ACHAT!$N$5:$N$34826,A7,ACHAT!$J$5:$J$34826,XML!$J$3)","v":0},{"$f":"SUMIFS(ACHAT!$E$5:$E$34826,ACHAT!$C$5:$C$34826,XML!$I$8,ACHAT!$N$5:$N$34826,A7,ACHAT!$J$5:$J$34826,XML!$J$8)","v":17296.759999999998},{"$f":"SUMIFS(ACHAT!$E$5:$E$34826,ACHAT!$C$5:$C$34826,XML!$I$5,ACHAT!$N$5:$N$34826,A7,ACHAT!$J$5:$J$34826,XML!$J$5)","v":0},{"$f":"SUMIFS(ACHAT!$E$5:$E$34826,ACHAT!$C$5:$C$34826,XML!$I$6,ACHAT!$N$5:$N$34826,A7,ACHAT!$J$5:$J$34826,XML!$J$6)","v":0},{"$f":"SUMIFS(ACHAT!$E$5:$E$34826,ACHAT!$C$5:$C$34826,XML!$I$7,ACHAT!$N$5:$N$34826,A7,ACHAT!$J$5:$J$34826,XML!$J$7)","v":0},{"$f":"H7+I7+J7+K7+L7+N7","v":17296.759999999998},-590.34,{"$f":"O7-P7","v":17887.099999999999},{"$f":"G7-Q7","v":-7041.1},null,{"$f":"\"Report Crédit Tva\"&\" \"&YEAR(X!$F$2)+1","v":"Report Crédit Tva 2017"},null,null,null,null,null,null,null,null,0.1,"OP DE BANQUE"]
[{"$f":"EDATE(A7,1)","v":"2016-03-01"},{"$f":"SUMIFS(VENTE!$D$4:$D$74974,VENTE!$J$4:$J$74974,A8)","v":75193.179999999993},{"$f":"SUMIFS(VENTE!$F$4:$F$14982,VENTE!$E$4:$E$14982,\"0,07\",VENTE!$J$4:$J$14982,Tableau4[[#This Row],[Mois Décl]])","v":0},{"$f":"SUMIFS(VENTE!$F$4:$F$14982,VENTE!$E$4:$E$14982,\"0,10\",VENTE!$J$4:$J$14982,A8)","v":0},{"$f":"SUMIFS(VENTE!$F$4:$F$14982,VENTE!$E$4:$E$14982,\"0,14\",VENTE!$J$4:$J$14982,A8)","v":0},{"$f":"SUMIFS(VENTE!$F$4:$F$14982,VENTE!$E$4:$E$14982,\"0,30\",VENTE!$J$4:$J$14982,A8)","v":0},{"$f":"ROUNDUP(Tableau4[[#This Row],[Vente HT]],-1)*0.2","v":15040},{"$f":"SUMIFS(ACHAT!$E$5:$E$34826,ACHAT!$C$5:$C$34826,XML!$I$2,ACHAT!$N$5:$N$34826,A8,ACHAT!$J$5:$J$34826,XML!$J$2)","v":0},{"$f":"SUMIFS(ACHAT!$E$5:$E$34826,ACHAT!$C$5:$C$34826,XML!$I$4,ACHAT!$N$5:$N$34826,A8,ACHAT!$J$5:$J$34826,XML!$J$4)","v":0},{"$f":"SUMIFS(ACHAT!$E$5:$E$34826,ACHAT!$C$5:$C$34826,XML!$I$3,ACHAT!$N$5:$N$34826,A8,ACHAT!$J$5:$J$34826,XML!$J$3)","v":0},{"$f":"SUMIFS(ACHAT!$E$5:$E$34826,ACHAT!$C$5:$C$34826,XML!$I$8,ACHAT!$N$5:$N$34826,A8,ACHAT!$J$5:$J$34826,XML!$J$8)","v":8564.5300000000007},{"$f":"SUMIFS(ACHAT!$E$5:$E$34826,ACHAT!$C$5:$C$34826,XML!$I$5,ACHAT!$N$5:$N$34826,A8,ACHAT!$J$5:$J$34826,XML!$J$5)","v":0},{"$f":"SUMIFS(ACHAT!$E$5:$E$34826,ACHAT!$C$5:$C$34826,XML!$I$6,ACHAT!$N$5:$N$34826,A8,ACHAT!$J$5:$J$34826,XML!$J$6)","v":0},{"$f":"SUMIFS(ACHAT!$E$5:$E$34826,ACHAT!$C$5:$C$34826,XML!$I$7,ACHAT!$N$5:$N$34826,A8,ACHAT!$J$5:$J$34826,XML!$J$7)","v":0},8564.5300000000007,-7041.1,15605.63,-565.63,null,{"$f":"\"Report Crédit Tva\"&\" \"&YEAR(X!$F$2)+2","v":"Report Crédit Tva 2018"},null,null,null,null,null,null,null,null,0.14000000000000001,"TRANSPORT"]
{"$rows_left_out":55}
{"sheet":"CA","index":3,"n_rows":17,"n_cols":15,"rows_kept":17,"cut":false,"hidden":false,"merged":[[1,0,1,14]]}
[]
[{"$f":"\"TABLEAU CHIFFRE D'AFFAIRE ET ACHATS ANNEE\"&\" \"&YEAR(A6)","v":"TABLEAU CHIFFRE D'AFFAIRE ET ACHATS ANNEE 2016"}]
[]
["Mois Décl","Vente HT","Tva Vente","Vente TTC","Pres serv 20%","Transp 14% ","Op Bq 10%","March 20%","Services 7%","Elect 14%","Immob 20%","Total Achat HT","Total Espéces","Total Chq Effet et Autres","Ventes Déclaré TTC"]
[{"$f":"RECAP!A6","v":"2016-01-01"},{"$f":"SUMIFS(VENTE!$D$4:$D$75000,X!$B$4:$B$75000,A5)","v":47505.17},{"$f":"SUMIFS(VENTE!$F$4:$F$75000,X!$B$4:$B$75000,A5)","v":9501.0300000000007},{"$f":"SUMIFS(VENTE!$G$4:$G$75000,X!$B$4:$B$75000,A5)","v":57006.2},{"$f":"SUMIFS(ACHAT!$D$5:$D$75000,ACHAT!$C$5:$C$75000,XML!$I$2,X!$D$5:$D$75000,A5,ACHAT!$J$5:$J$75000,XML!$J$2)","v":251.5},{"$f":"SUMIFS(ACHAT!$D$5:$D$75000,ACHAT!$C$5:$C$75000,XML!$I$4,X!$D$5:$D$75000,A5,ACHAT!$J$5:$J$75000,XML!$J$4)","v":0},{"$f":"SUMIFS(ACHAT!$D$5:$D$75000,ACHAT!$C$5:$C$75000,XML!$I$3,X!$D$5:$D$75000,A5,ACHAT!$J$5:$J$75000,XML!$J$3)","v":6},{"$f":"SUMIFS(ACHAT!$D$5:$D$75000,ACHAT!$C$5:$C$75000,XML!$I$8,X!$D$5:$D$75000,A5,ACHAT!$J$5:$J$75000,XML!$J$8)","v":41434.589999999997},{"$f":"SUMIFS(ACHAT!$D$5:$D$75000,ACHAT!$C$5:$C$75000,XML!$I$5,X!$D$5:$D$75000,A5,ACHAT!$J$5:$J$75000,XML!$J$5)","v":0},{"$f":"SUMIFS(ACHAT!$D$5:$D$75000,ACHAT!$C$5:$C$75000,XML!$I$6,X!$D$5:$D$75000,A5,ACHAT!$J$5:$J$75000,XML!$J$5)","v":0},{"$f":"SUMIFS(ACHAT!$D$5:$D$75000,ACHAT!$C$5:$C$75000,XML!$I$7,X!$D$5:$D$75000,A5,ACHAT!$J$5:$J$75000,XML!$J$7)","v":0},{"$f":"E5+F5++G5+H5+I5+J5+K5","v":41692.089999999997},{"$f":"SUMIFS(VENTE!$G$4:$G$75000,X!$C$4:$C$75000,A5,VENTE!$K$4:$K$75000,\"1\")","v":20498.8},{"$f":"SUMIFS(VENTE!$G$4:$G$75000,X!$C$4:$C$75000,A5,VENTE!$K$4:$K$75000,\"2\")+SUMIFS(VENTE!$G$4:$G$75000,X!$C$4:$C$75000,A5,VENTE!$K$4:$K$75000,\"3\")+SUMIFS(VENTE!$G$4:$G$75000,X!$C$4:$C$75000,A5,VENTE!$K$4:$K$75000,\"4\")+SUMIFS(VENTE!$G$4:$G$75000,X!$C$4:$C$75000,A5,VENTE!$K$4:$K$75000,\"5\")+SUMIFS(VENTE!$G$4:$G$75000,X!$C$4:$C$75000,A5,VENTE!$K$4:$K$75000,\"6\")+SUMIFS(VENTE!$G$4:$G$75000,X!$C$4:$C$75000,A5,VENTE!$K$4:$K$75000,\"7\")","v":66732.7},{"$f":"Tableau39[[#This Row],[Total Espéces]]+N5","v":87231.5}]
[{"$f":"RECAP!A7","v":"2016-02-01"},{"$f":"SUMIFS(VENTE!$D$4:$D$75000,X!$B$4:$B$75000,A6)","v":72116.58},{"$f":"SUMIFS(VENTE!$F$4:$F$75000,X!$B$4:$B$75000,A6)","v":14423.32},{"$f":"SUMIFS(VENTE!$G$4:$G$75000,X!$B$4:$B$75000,A6)","v":86539.9},{"$f":"SUMIFS(ACHAT!$D$5:$D$75000,ACHAT!$C$5:$C$75000,XML!$I$2,X!$D$5:$D$75000,A6,ACHAT!$J$5:$J$75000,XML!$J$2)","v":420.5},{"$f":"SUMIFS(ACHAT!$D$5:$D$75000,ACHAT!$C$5:$C$75000,XML!$I$4,X!$D$5:$D$75000,A6,ACHAT!$J$5:$J$75000,XML!$J$4)","v":0},{"$f":"SUMIFS(ACHAT!$D$5:$D$75000,ACHAT!$C$5:$C$75000,XML!$I$3,X!$D$5:$D$75000,A6,ACHAT!$J$5:$J$75000,XML!$J$3)","v":0},{"$f":"SUMIFS(ACHAT!$D$5:$D$75000,ACHAT!$C$5:$C$75000,XML!$I$8,X!$D$5:$D$75000,A6,ACHAT!$J$5:$J$75000,XML!$J$8)","v":68136.66},{"$f":"SUMIFS(ACHAT!$D$5:$D$75000,ACHAT!$C$5:$C$75000,XML!$I$5,X!$D$5:$D$75000,A6,ACHAT!$J$5:$J$75000,XML!$J$5)","v":0},{"$f":"SUMIFS(ACHAT!$D$5:$D$75000,ACHAT!$C$5:$C$75000,XML!$I$6,X!$D$5:$D$75000,A6,ACHAT!$J$5:$J$75000,XML!$J$5)","v":0},{"$f":"SUMIFS(ACHAT!$D$5:$D$75000,ACHAT!$C$5:$C$75000,XML!$I$7,X!$D$5:$D$75000,A6,ACHAT!$J$5:$J$75000,XML!$J$7)","v":0},68557.16,{"$f":"SUMIFS(VENTE!$G$4:$G$75000,X!$C$4:$C$75000,A6,VENTE!$K$4:$K$75000,\"1\")","v":46351.4},{"$f":"SUMIFS(VENTE!$G$4:$G$75000,X!$C$4:$C$75000,A6,VENTE!$K$4:$K$75000,\"2\")+SUMIFS(VENTE!$G$4:$G$75000,X!$C$4:$C$75000,A6,VENTE!$K$4:$K$75000,\"3\")+SUMIFS(VENTE!$G$4:$G$75000,X!$C$4:$C$75000,A6,VENTE!$K$4:$K$75000,\"4\")+SUMIFS(VENTE!$G$4:$G$75000,X!$C$4:$C$75000,A6,VENTE!$K$4:$K$75000,\"5\")+SUMIFS(VENTE!$G$4:$G$75000,X!$C$4:$C$75000,A6,VENTE!$K$4:$K$75000,\"6\")+SUMIFS(VENTE!$G$4:$G$75000,X!$C$4:$C$75000,A6,VENTE!$K$4:$K$75000,\"7\")","v":18716},{"$f":"Tableau39[[#This Row],[Total Espéces]]+N6","v":65067.4}]
[{"$f":"RECAP!A8","v":"2016-03-01"},{"$f":"SUMIFS(VENTE!$D$4:$D$75000,X!$B$4:$B$75000,A7)","v":93098.1},{"$f":"SUMIFS(VENTE!$F$4:$F$75000,X!$B$4:$B$75000,A7)","v":18619.599999999999},{"$f":"SUMIFS(VENTE!$G$4:$G$75000,X!$B$4:$B$75000,A7)","v":111717.7},{"$f":"SUMIFS(ACHAT!$D$5:$D$75000,ACHAT!$C$5:$C$75000,XML!$I$2,X!$D$5:$D$75000,A7,ACHAT!$J$5:$J$75000,XML!$J$2)","v":441.35},{"$f":"SUMIFS(ACHAT!$D$5:$D$75000,ACHAT!$C$5:$C$75000,XML!$I$4,X!$D$5:$D$75000,A7,ACHAT!$J$5:$J$75000,XML!$J$4)","v":0},{"$f":"SUMIFS(ACHAT!$D$5:$D$75000,ACHAT!$C$5:$C$75000,XML!$I$3,X!$D$5:$D$75000,A7,ACHAT!$J$5:$J$75000,XML!$J$3)","v":20},{"$f":"SUMIFS(ACHAT!$D$5:$D$75000,ACHAT!$C$5:$C$75000,XML!$I$8,X!$D$5:$D$75000,A7,ACHAT!$J$5:$J$75000,XML!$J$8)","v":91546.82},{"$f":"SUMIFS(ACHAT!$D$5:$D$75000,ACHAT!$C$5:$C$75000,XML!$I$5,X!$D$5:$D$75000,A7,ACHAT!$J$5:$J$75000,XML!$J$5)","v":0},{"$f":"SUMIFS(ACHAT!$D$5:$D$75000,ACHAT!$C$5:$C$75000,XML!$I$6,X!$D$5:$D$75000,A7,ACHAT!$J$5:$J$75000,XML!$J$5)","v":0},{"$f":"SUMIFS(ACHAT!$D$5:$D$75000,ACHAT!$C$5:$C$75000,XML!$I$7,X!$D$5:$D$75000,A7,ACHAT!$J$5:$J$75000,XML!$J$7)","v":0},92008.17,{"$f":"SUMIFS(VENTE!$G$4:$G$75000,X!$C$4:$C$75000,A7,VENTE!$K$4:$K$75000,\"1\")","v":26933.5},{"$f":"SUMIFS(VENTE!$G$4:$G$75000,X!$C$4:$C$75000,A7,VENTE!$K$4:$K$75000,\"2\")+SUMIFS(VENTE!$G$4:$G$75000,X!$C$4:$C$75000,A7,VENTE!$K$4:$K$75000,\"3\")+SUMIFS(VENTE!$G$4:$G$75000,X!$C$4:$C$75000,A7,VENTE!$K$4:$K$75000,\"4\")+SUMIFS(VENTE!$G$4:$G$75000,X!$C$4:$C$75000,A7,VENTE!$K$4:$K$75000,\"5\")+SUMIFS(VENTE!$G$4:$G$75000,X!$C$4:$C$75000,A7,VENTE!$K$4:$K$75000,\"6\")+SUMIFS(VENTE!$G$4:$G$75000,X!$C$4:$C$75000,A7,VENTE!$K$4:$K$75000,\"7\")","v":69815.3},{"$f":"Tableau39[[#This Row],[Total Espéces]]+N7","v":96748.800000000003}]
[{"$f":"RECAP!A9","v":"2016-04-01"},{"$f":"SUMIFS(VENTE!$D$4:$D$75000,X!$B$4:$B$75000,A8)","v":67223.75},{"$f":"SUMIFS(VENTE!$F$4:$F$75000,X!$B$4:$B$75000,A8)","v":13444.75},{"$f":"SUMIFS(VENTE!$G$4:$G$75000,X!$B$4:$B$75000,A8)","v":80668.5},{"$f":"SUMIFS(ACHAT!$D$5:$D$75000,ACHAT!$C$5:$C$75000,XML!$I$2,X!$D$5:$D$75000,A8,ACHAT!$J$5:$J$75000,XML!$J$2)","v":420.5},{"$f":"SUMIFS(ACHAT!$D$5:$D$75000,ACHAT!$C$5:$C$75000,XML!$I$4,X!$D$5:$D$75000,A8,ACHAT!$J$5:$J$75000,XML!$J$4)","v":0},{"$f":"SUMIFS(ACHAT!$D$5:$D$75000,ACHAT!$C$5:$C$75000,XML!$I$3,X!$D$5:$D$75000,A8,ACHAT!$J$5:$J$75000,XML!$J$3)","v":0},{"$f":"SUMIFS(ACHAT!$D$5:$D$75000,ACHAT!$C$5:$C$75000,XML!$I$8,X!$D$5:$D$75000,A8,ACHAT!$J$5:$J$75000,XML!$J$8)","v":34042.51},{"$f":"SUMIFS(ACHAT!$D$5:$D$75000,ACHAT!$C$5:$C$75000,XML!$I$5,X!$D$5:$D$75000,A8,ACHAT!$J$5:$J$75000,XML!$J$5)","v":0},{"$f":"SUMIFS(ACHAT!$D$5:$D$75000,ACHAT!$C$5:$C$75000,XML!$I$6,X!$D$5:$D$75000,A8,ACHAT!$J$5:$J$75000,XML!$J$5)","v":0},{"$f":"SUMIFS(ACHAT!$D$5:$D$75000,ACHAT!$C$5:$C$75000,XML!$I$7,X!$D$5:$D$75000,A8,ACHAT!$J$5:$J$75000,XML!$J$7)","v":0},34463.01,{"$f":"SUMIFS(VENTE!$G$4:$G$75000,X!$C$4:$C$75000,A8,VENTE!$K$4:$K$75000,\"1\")","v":11080.5},{"$f":"SUMIFS(VENTE!$G$4:$G$75000,X!$C$4:$C$75000,A8,VENTE!$K$4:$K$75000,\"2\")+SUMIFS(VENTE!$G$4:$G$75000,X!$C$4:$C$75000,A8,VENTE!$K$4:$K$75000,\"3\")+SUMIFS(VENTE!$G$4:$G$75000,X!$C$4:$C$75000,A8,VENTE!$K$4:$K$75000,\"4\")+SUMIFS(VENTE!$G$4:$G$75000,X!$C$4:$C$75000,A8,VENTE!$K$4:$K$75000,\"5\")+SUMIFS(VENTE!$G$4:$G$75000,X!$C$4:$C$75000,A8,VENTE!$K$4:$K$75000,\"6\")+SUMIFS(VENTE!$G$4:$G$75000,X!$C$4:$C$75000,A8,VENTE!$K$4:$K$75000,\"7\")","v":75915.100000000006},{"$f":"Tableau39[[#This Row],[Total Espéces]]+N8","v":86995.6}]
{"$rows_left_out":10}
{"sheet":"XML","index":4,"n_rows":1028,"n_cols":649,"rows_kept":1028,"cut":false,"hidden":false,"merged":[[5,3,5,7],[8,0,8,2],[5,0,5,1],[2,0,2,1],[3,0,3,1],[4,0,4,1],[6,0,6,1],[7,0,7,1]]}
[null,null,null,null,null,null,null,null,"Designation","Taux","T.HT","T.TVA","T.TTC",null,null,null,null,null,null,null,null,null,null,null,null,null,null,null,null,null,null,null,null,null,null,null,null,null,null,null,null,null,null,null,null,null,null,null,null,null,null,null,null,null,null,null,null,null,null,null,null,null,null,null,null,null,null,null,null,null,null,null,null,null,null,null,null,null,null,null,null,null,null,null,null,null,null,null,null,null,null,null,null,null,null,null,null,null,null,null,null,null,null,null,null,null,null,null,null,null,null,null,null,null,null,null,null,null,null,null,null,null,null,null,null,null,null,null,null,null,null,null,null,null,null,null,null,null,null,null,null,null,null,null,null,null,null,null,null,null,null,null,null,null,null,null,null,null,null,null,null,null,null,null,null,null,null,null,null,null,null,null,null,null,null,null,null,null,null,null,null,null,null,null,null,null,null,null,null,null,null,null,null,null,null,null,null,null,null,null,null,null,null,null,null,null,null,null,null,null,null,null,null,null,null,null,null,null,null,null,null,null,null,null,null,null,null,null,null,null,null,null,null,null,null,null,null,null,null,null,null,null,null,null,null,null,null,null,null,null,null,null,null,null,null,null,null,null,null,null,null,null,null,null,null,null,null,null,null,null,null,null,null,null,null,null,null,null,null,null,null,null,null,null,null,null,null,null,null,null,null,null,null,null,null,null,null,null,null,null,null,null,null,null,null,null,null,null,null,null,null,null,null,null,null,null,null,null,null,null,null,null,null,null,null,null,null,null,null,null,null,null,null,null,null,null,null,null,null,null,null,null,null,null,null,null,null,null,null,null,null,null,null,null,null,null,null,null,null,null,null,null,null,null,null,null,null,null,null,null,null,null,null,null,null,null,null,null,null,null,null,null,null,null,null,null,null,null,null,null,null,null,null,null,null,null,null,null,null,null,null,null,null,null,null,null,null,null,null,null,null,null,null,null,null,null,null,null,null,null,null,null,null,null,null,null,null,null,null,null,null,null,null,null,null,null,null,null,null,null,null,null,null,null,null,null,null,null,null,null,null,null,null,null,null,null,null,null,null,null,null,null,null,null,null,null,null,null,null,null,null,null,null,null,null,null,null,null,null,null,null,null,null,null,null,null,null,null,null,null,null,null,null,null,null,null,null,null,null,null,null,null,null,null,null,null,null,null,null,null,null,null,null,null,null,null,null,null,null,null,null,null,null,null,null,null,null,null,null,null,null,null,null,null,null,null,null,null,null,null,null,null,null,null,null,null,null,null,null,null,null,null,null,null,null,null,null,null,null,null,null,null,null,null,null,null,null,null,null,null,null,null,null,null,null,null,null,null,null,null,null,null,null,null,null,null,null,null,null,null,null,null,null,null,null,null,null,null,null,null,null,null,null,null,null,null,null,null,null,null,null,null,null,null,null,null,null,null,null,null,null,null,null,null,null,null,null,null,null,null,null,null,null,null,null,null,null,null,null,null,null,null,null,null,null,null,null,4,{"$f":"INDEX(RECAP!$A$6:$A$17,XX1)","v":"2016-04-01"}]
[null,null,null,null,null,null,null,null,"PRES DE SERVICES",0.2,{"$f":"SUMIFS($D$11:$D$42577,$J$11:$J$42577,$J2,$C$11:$C$42577,$I2)","v":5952.99},{"$f":"SUMIFS($E$11:$E$42577,$J$11:$J$42577,$J2,$C$11:$C$42577,$I2)","v":1190.5999999999999},{"$f":"SUMIFS($F$11:$F$42577,$J$11:$J$42577,$J2,$C$11:$C$42577,$I2)","v":7143.59}]
["MOIS DE DECLARATION",null,null,null,null,null,null,null,"OP DE BANQUE",0.1,0,0,0]
["RAISON SOCIAL",null,null,null,null,null,null,null,"TRANSPORT",0.14000000000000001,0,0,0]
["ID_FISCAL",null,65760124,null,null,null,null,null,"EAU ",7.0000000000000007E-2,0,0,0]
["ANNEE",null,{"$f":"YEAR(XY1)","v":2016},"TABLEAU DE DEDUCTION TVA",null,null,null,null,"ELECTRICITE",0.14000000000000001,843.06,133.03,1011.66]
["PERIODE(Mens)",null,{"$f":"MONTH(XY1)","v":4},null,null,null,null,null,"IMMOBILISATION",0.2,0,0,0]
["REGIME(Encais-1)",null,1,null,null,null,null,null,"MARCHANDISES",0.2,63613.51,12722.69,76336.2]
{"$rows_left_out":1021}
{"sheet":"X","index":5,"n_rows":1000,"n_cols":10,"rows_kept":1000,"cut":false,"hidden":true,"merged":[]}
[null,"date Fac vente","Date Reg vente","date Fac achat","Date Reg achat","Années"]
[null,null,null,null,null,"2016-01-01",null,"IF","RAISON SOCIAL","ICE"]
[null,null,null,null,null,"2017-01-01",null,1007788,"FOURNISSEUR 0001","00001111004000055"]
[null,{"$f":"EOMONTH(VENTE!A4,-1)+1","v":"2015-05-01"},{"$f":"EOMONTH(VENTE!I4,-1)+1","v":"2016-01-01"},null,null,"2018-01-01",null,1007851,"FOURNISSEUR 0002","00011111004000056"]
[null,{"$f":"EOMONTH(VENTE!A5,-1)+1","v":"2015-05-01"},{"$f":"EOMONTH(VENTE!I5,-1)+1","v":"2016-01-01"},{"$f":"EOMONTH(ACHAT!M5,-1)+1","v":"2014-11-01"},{"$f":"EOMONTH(ACHAT!L5,-1)+1","v":"2014-11-01"},"2019-01-01",null,1007914,"FOURNISSEUR 0003","00021111004000057"]
[null,{"$f":"EOMONTH(VENTE!A6,-1)+1","v":"2015-07-01"},{"$f":"EOMONTH(VENTE!I6,-1)+1","v":"2016-01-01"},{"$f":"EOMONTH(ACHAT!M6,-1)+1","v":"2015-01-01"},{"$f":"EOMONTH(ACHAT!L6,-1)+1","v":"2015-01-01"},"2020-01-01",null,1007977,"FOURNISSEUR 0004","00031111004000058"]
[null,{"$f":"EOMONTH(VENTE!A7,-1)+1","v":"2015-08-01"},{"$f":"EOMONTH(VENTE!I7,-1)+1","v":"2016-01-01"},{"$f":"EOMONTH(ACHAT!M7,-1)+1","v":"2014-10-01"},{"$f":"EOMONTH(ACHAT!L7,-1)+1","v":"2015-01-01"},null,null,1008040,"FOURNISSEUR 0005","00041111004000059"]
[null,{"$f":"EOMONTH(VENTE!A8,-1)+1","v":"2015-09-01"},{"$f":"EOMONTH(VENTE!I8,-1)+1","v":"2016-01-01"},{"$f":"EOMONTH(ACHAT!M8,-1)+1","v":"2014-10-01"},{"$f":"EOMONTH(ACHAT!L8,-1)+1","v":"2015-01-01"},null,null,1008103,"FOURNISSEUR 0006","00051111004000060"]
{"$rows_left_out":992}