{"text_format":"1","workbook":"xlsx","n_sheets":6,"sheets":["EDI","DED","CA","FACE 01","FACE 02","FRS-ICE"],"not_rendered":{"charts":0,"images":8,"macros":1,"external_links":2,"defined_names":11,"comments":2,"pivot_tables":0},"unopened":[],"bounds":{"document_bytes":16777216,"sheet_cells":100000,"rows_first":2000,"rows_last":500,"rows_between":2000,"halvings":0,"cell_chars":16384,"cell_head_chars":4096},"cells_cut":0,"cells_raw":0,"read":"whole","date_system":"1900"}

{"sheet":"EDI","index":0,"n_rows":40,"n_cols":17,"rows_kept":40,"cut":false,"hidden":false,"merged":[[1,0,1,1],[0,11,0,12],[4,5,4,10],[5,5,5,10],[2,0,2,1],[3,0,3,1],[4,0,4,1],[5,0,5,1]]}
[null,null,null,null,null,null,null,null,null,null,null,"Modèle n° ADC082F-15I"]
["RAISON SOCIAL"]
["ID_FISCAL"]
["ANNEE",null,2016]
["PERIODE(Triméstre)",null,"02",null,null,"Relevé de déduction"]
["REGIME(Encais-1)",null,1,null,null,"(Article 112 du Code Général des Impôts)"]
[]
["OR","FACT_NUM","DESIGNATION","M_HT","TVA","M_TTC","IF","LIB_FRSS","ICE_FRS","TAUX","ID_PAIE","DATE_PAIE","DATE_FAC"]
[]
[]
[]
[]
[]
[]
[]
[]
[]
[]
[]
[]
[]
[]
[]
[]
[]
[]
[]
[]
[]
[]
{"$rows_left_out":11}
{"sheet":"DED","index":1,"n_rows":140,"n_cols":13,"rows_kept":140,"cut":false,"hidden":false,"merged":[[0,10,0,11],[5,4,6,7],[7,4,8,7],[122,4,122,5],[123,4,123,5],[12,11,12,12],[12,3,12,7],[139,1,139,3],[124,4,124,5],[125,4,125,5],[126,4,126,5],[127,4,127,5],[128,4,128,5],[129,4,129,5],[136,4,136,5],[139,4,139,5],[130,4,130,5],[131,4,131,5],[132,4,132,5],[134,4,134,5],[135,4,135,5],[137,4,137,5],[138,4,138,5]]}
[null,null,null,null,null,null,null,null,null,null,"Modèle n° ADC082F-15I"]
[]
[]
[]
[]
[null,null,null,null,"Relevé de déduction"]
[]
[null,null,null,null,"(Article 112 du Code Général des Impôts)"]
[]
[]
[null,null,null,null,"Triméstre",{"$f":"EDI!C5","v":"02"},"Année",{"$f":"EDI!C4","v":2016}]
[]
["Nom et prénom ou raison sociale :  ",null,null,{"$f":"+EDI!C2","v":0},null,null,null,null,"N° d'identification fiscale : ",null,null,{"$f":"+EDI!C3","v":0}]
["OR","FACT_NUM","DESIGNATION","M_HT","TVA","M_TTC","IF","LIB_FRSS","ICE","TAUX","ID","DATE_PAIE","DATE_FAC"]
[null,null,null,{"$f":"+F15-E15","v":0},{"$f":"+F15/6","v":0},null,null,{"$f":"IF(ISNA(VLOOKUP(G15, [2]Feuil1!$A$2:$C$338, 2, FALSE)), \"\", (VLOOKUP(G15, [2]Feuil1!$A$2:$C$338, 2, FALSE)))","v":""},{"$f":"IF(ISNA(VLOOKUP(G15, [2]Feuil1!$A$2:$C$338, 3, FALSE)), \"\", (VLOOKUP(G15, [2]Feuil1!$A$2:$C$338, 3, FALSE)))","v":""},20]
[null,null,null,{"$f":"+F16-E16","v":0},{"$f":"+F16/6","v":0},null,null,{"$f":"IF(ISNA(VLOOKUP(G16, [2]Feuil1!$A$2:$C$338, 2, FALSE)), \"\", (VLOOKUP(G16, [2]Feuil1!$A$2:$C$338, 2, FALSE)))","v":""},{"$f":"IF(ISNA(VLOOKUP(G16, [2]Feuil1!$A$2:$C$338, 3, FALSE)), \"\", (VLOOKUP(G16, [2]Feuil1!$A$2:$C$338, 3, FALSE)))","v":""},20]
[null,null,null,0,0,null,null,{"$f":"IF(ISNA(VLOOKUP(G17, [2]Feuil1!$A$2:$C$338, 2, FALSE)), \"\", (VLOOKUP(G17, [2]Feuil1!$A$2:$C$338, 2, FALSE)))","v":""},{"$f":"IF(ISNA(VLOOKUP(G17, [2]Feuil1!$A$2:$C$338, 3, FALSE)), \"\", (VLOOKUP(G17, [2]Feuil1!$A$2:$C$338, 3, FALSE)))","v":""},20]
[null,null,null,0,0,null,null,{"$f":"IF(ISNA(VLOOKUP(G18, [2]Feuil1!$A$2:$C$338, 2, FALSE)), \"\", (VLOOKUP(G18, [2]Feuil1!$A$2:$C$338, 2, FALSE)))","v":""},{"$f":"IF(ISNA(VLOOKUP(G18, [2]Feuil1!$A$2:$C$338, 3, FALSE)), \"\", (VLOOKUP(G18, [2]Feuil1!$A$2:$C$338, 3, FALSE)))","v":""},20]
["Total TVA sur Prestation de Sces étrangers à 20%",null,null,{"$f":"SUM(D15:D18)","v":0},{"$f":"SUM(E15:E18)","v":0},0]
[null,null,null,{"$f":"+F20-E20","v":0},{"$f":"+F20/6","v":0},null,null,{"$f":"IF(ISNA(VLOOKUP(G20, [2]Feuil1!$A$2:$C$338, 2, FALSE)), \"\", (VLOOKUP(G20, [2]Feuil1!$A$2:$C$338, 2, FALSE)))","v":""},{"$f":"IF(ISNA(VLOOKUP(G20, [2]Feuil1!$A$2:$C$338, 3, FALSE)), \"\", (VLOOKUP(G20, [2]Feuil1!$A$2:$C$338, 3, FALSE)))","v":""},20]
[null,null,null,0,0,null,null,{"$f":"IF(ISNA(VLOOKUP(G21, [2]Feuil1!$A$2:$C$338, 2, FALSE)), \"\", (VLOOKUP(G21, [2]Feuil1!$A$2:$C$338, 2, FALSE)))","v":""},{"$f":"IF(ISNA(VLOOKUP(G21, [2]Feuil1!$A$2:$C$338, 3, FALSE)), \"\", (VLOOKUP(G21, [2]Feuil1!$A$2:$C$338, 3, FALSE)))","v":""},20]
[null,null,null,0,0,null,null,{"$f":"IF(ISNA(VLOOKUP(G22, [2]Feuil1!$A$2:$C$338, 2, FALSE)), \"\", (VLOOKUP(G22, [2]Feuil1!$A$2:$C$338, 2, FALSE)))","v":""},{"$f":"IF(ISNA(VLOOKUP(G22, [2]Feuil1!$A$2:$C$338, 3, FALSE)), \"\", (VLOOKUP(G22, [2]Feuil1!$A$2:$C$338, 3, FALSE)))","v":""},20]
[null,null,null,0,0,null,null,{"$f":"IF(ISNA(VLOOKUP(G23, [2]Feuil1!$A$2:$C$338, 2, FALSE)), \"\", (VLOOKUP(G23, [2]Feuil1!$A$2:$C$338, 2, FALSE)))","v":""},{"$f":"IF(ISNA(VLOOKUP(G23, [2]Feuil1!$A$2:$C$338, 3, FALSE)), \"\", (VLOOKUP(G23, [2]Feuil1!$A$2:$C$338, 3, FALSE)))","v":""},20]
[null,null,null,null,0,null,null,{"$f":"IF(ISNA(VLOOKUP(G24, [2]Feuil1!$A$2:$C$338, 2, FALSE)), \"\", (VLOOKUP(G24, [2]Feuil1!$A$2:$C$338, 2, FALSE)))","v":""},{"$f":"IF(ISNA(VLOOKUP(G24, [2]Feuil1!$A$2:$C$338, 3, FALSE)), \"\", (VLOOKUP(G24, [2]Feuil1!$A$2:$C$338, 3, FALSE)))","v":""},20]
["Total TVA sur Prestation de services à 20%",null,null,{"$f":"SUM(D20:D24)","v":0},{"$f":"SUM(E20:E24)","v":0},0]
[null,null,null,{"$f":"+F26-E26","v":0},{"$f":"+F26/6","v":0},null,null,{"$f":"IF(ISNA(VLOOKUP(G26, [2]Feuil1!$A$2:$C$338, 2, FALSE)), \"\", (VLOOKUP(G26, [2]Feuil1!$A$2:$C$338, 2, FALSE)))","v":""},{"$f":"IF(ISNA(VLOOKUP(G26, [2]Feuil1!$A$2:$C$338, 3, FALSE)), \"\", (VLOOKUP(G26, [2]Feuil1!$A$2:$C$338, 3, FALSE)))","v":""},20]
[null,null,null,0,0,null,null,{"$f":"IF(ISNA(VLOOKUP(G27, [2]Feuil1!$A$2:$C$338, 2, FALSE)), \"\", (VLOOKUP(G27, [2]Feuil1!$A$2:$C$338, 2, FALSE)))","v":""},{"$f":"IF(ISNA(VLOOKUP(G27, [2]Feuil1!$A$2:$C$338, 3, FALSE)), \"\", (VLOOKUP(G27, [2]Feuil1!$A$2:$C$338, 3, FALSE)))","v":""},20]
[null,null,null,0,0,null,null,{"$f":"IF(ISNA(VLOOKUP(G28, [2]Feuil1!$A$2:$C$338, 2, FALSE)), \"\", (VLOOKUP(G28, [2]Feuil1!$A$2:$C$338, 2, FALSE)))","v":""},{"$f":"IF(ISNA(VLOOKUP(G28, [2]Feuil1!$A$2:$C$338, 3, FALSE)), \"\", (VLOOKUP(G28, [2]Feuil1!$A$2:$C$338, 3, FALSE)))","v":""},20]
[null,null,null,0,0,null,null,{"$f":"IF(ISNA(VLOOKUP(G29, [2]Feuil1!$A$2:$C$338, 2, FALSE)), \"\", (VLOOKUP(G29, [2]Feuil1!$A$2:$C$338, 2, FALSE)))","v":""},{"$f":"IF(ISNA(VLOOKUP(G29, [2]Feuil1!$A$2:$C$338, 3, FALSE)), \"\", (VLOOKUP(G29, [2]Feuil1!$A$2:$C$338, 3, FALSE)))","v":""},20]
[null,null,null,0,0,null,null,{"$f":"IF(ISNA(VLOOKUP(G30, [2]Feuil1!$A$2:$C$338, 2, FALSE)), \"\", (VLOOKUP(G30, [2]Feuil1!$A$2:$C$338, 2, FALSE)))","v":""},{"$f":"IF(ISNA(VLOOKUP(G30, [2]Feuil1!$A$2:$C$338, 3, FALSE)), \"\", (VLOOKUP(G30, [2]Feuil1!$A$2:$C$338, 3, FALSE)))","v":""},20]
{"$rows_left_out":111}
{"sheet":"CA","index":2,"n_rows":99,"n_cols":9,"rows_kept":99,"cut":false,"hidden":false,"merged":[[98,0,98,2],[3,3,3,4],[77,0,77,2],[77,7,77,8],[96,0,96,2],[96,7,96,8],[8,0,8,2],[8,7,8,8],[11,0,11,2],[57,0,57,2],[57,7,57,8]]}
[{"$f":"+EDI!C2","v":0}]
["I.F",{"$f":"+EDI!C3","v":0}]
[]
[null,null,null,"ETAT DES ENCAISSEMENTS TRIMESTRE ",null,{"$f":"EDI!C5","v":"02"},{"$f":"EDI!C4","v":2016}]
[null,null," "]
["Date fre","Numéro fre","CLIENTS","MT HT","TAUX","TVA","TTC","Mode de règlement","Date de règl"]
[null,null,null,{"$f":"+G7/1.2","v":0},0.2,{"$f":"+E7*D7","v":0},0]
[null,null,null,{"$f":"+G8/1.2","v":0},0.2,{"$f":"+E8*D8","v":0},0]
["Prestation Sérvices étrangers",null,null,{"$f":"SUM(D7:D8)","v":0},0.2,{"$f":"SUM(F7:F8)","v":0},{"$f":"SUM(G7:G8)","v":0}]
[null,null,null,{"$f":"+G10/1.2","v":0},0.2,{"$f":"+E10*D10","v":0},0]
[null,null,null,0,0.2,0,0]
["Prestation Sces Local",null,null,{"$f":"SUM(D10:D11)","v":0},0.2,{"$f":"SUM(F10:F11)","v":0},{"$f":"SUM(G10:G11)","v":0}]
[null,null,null,{"$f":"+G13/1.2","v":0},0.2,{"$f":"+D13*E13","v":0}]
[null,null,null,{"$f":"+G14/1.2","v":0},0.2,{"$f":"+D14*E14","v":0}]
[null,null,null,{"$f":"+G15/1.2","v":0},0.2,{"$f":"+D15*E15","v":0}]
[null,null,null,0,0.2,0]
[null,null,null,0,0.2,0]
[null,null,null,0,0.2,0]
[null,null,null,0,0.2,0]
[null,null,null,0,0.2,0]
[null,null,null,0,0.2,0]
[null,null,null,0,0.2,0]
[null,null,null,0,0.2,0]
[null,null,null,0,0.2,0]
[null,null,null,0,0.2,0]
[null,null,null,0,0.2,0]
[null,null,null,0,0.2,0]
[null,null,null,0,0.2,0]
[null,null,null,0,0.2,0]
[null,null,null,0,0.2,0]
{"$rows_left_out":70}
{"sheet":"FACE 01","index":3,"n_rows":146,"n_cols":63,"rows_kept":146,"cut":false,"hidden":false,"merged":[[0,50,0,62],[2,14,2,42],[3,16,3,46],[4,16,4,46],[5,16,5,46],[6,21,6,39],[6,49,6,59],[7,20,7,24],[7,27,7,31],[7,32,7,35],[7,49,7,59],[8,0,8,2],[8,3,8,10],[8,18,8,24],[8,38,8,41],[8,49,8,59],[15,0,15,17],[15,18,15,44],[16,16,16,62],[17,9,17,62],[18,30,18,62],[19,0,19,45],[19,49,19,62],[9,27,9,32],[9,33,9,34],[9,35,9,39],[10,0,11,62],[14,12,14,25],[14,43,14,60],[26,42,26,61],[28,42,28,61],[30,42,30,61],[32,42,32,61],[34,42,34,61],[36,1,36,40],[36,41,36,51],[36,52,36,62],[20,4,20,19],[20,23,20,34],[20,39,20,56],[21,1,21,40],[21,41,21,62],[24,42,24,61],[43,1,43,40],[43,42,43,50],[43,53,43,61],[45,1,45,40],[45,42,45,50],[45,53,45,61],[37,1,37,40],[38,42,39,50],[38,53,39,61],[39,1,39,40],[41,1,41,40],[41,42,41,50],[41,53,41,61],[51,1,51,40],[52,1,52,40],[54,1,54,40],[54,42,54,50],[54,53,54,61],[56,1,56,40],[56,42,56,50],[56,53,56,61],[47,1,47,40],[47,42,47,50],[47,53,47,61],[49,1,49,40],[49,42,49,50],[49,53,49,61],[61,1,61,40],[62,1,62,40],[62,42,62,50],[62,53,62,61],[63,1,63,40],[65,1,65,40],[58,1,58,40],[58,42,58,50],[58,53,58,61],[60,1,60,40],[60,42,60,50],[60,53,60,61],[69,1,69,40],[71,1,71,40],[71,42,71,50],[71,53,71,61],[73,1,73,40],[73,42,73,50],[73,53,73,61],[66,1,66,38],[66,42,66,50],[66,53,66,61],[68,1,68,40],[68,42,68,50],[68,53,68,61],[80,1,80,40],[80,42,80,50],[80,53,80,61],[82,1,82,40],[82,42,82,50],[82,53,82,61],[74,1,74,40],[76,1,76,38],[76,42,76,50],[76,53,76,61],[78,1,78,40],[78,42,78,50],[78,53,78,61],[88,1,88,40],[88,42,88,50],[88,53,88,61],[90,1,90,40],[90,42,90,50],[90,53,90,61],[84,1,84,40],[84,42,84,50],[84,53,84,61],[86,1,86,40],[86,42,86,50],[86,53,86,61],[96,1,96,40],[96,42,96,50],[96,53,96,61],[98,1,98,40],[98,42,98,50],[98,53,98,61],[92,1,92,40],[92,42,92,50],[92,53,92,61],[94,1,94,40],[94,42,94,50],[94,53,94,61],[104,1,104,40],[104,42,104,50],[104,53,104,61],[106,1,106,40],[106,42,106,50],[106,53,106,61],[100,1,100,40],[100,42,100,50],[100,53,100,61],[102,1,102,40],[102,42,102,50],[102,53,102,61],[114,1,114,40],[114,42,114,50],[114,53,114,61],[116,1,116,40],[116,42,116,50],[116,53,116,61],[108,1,108,40],[108,42,108,50],[108,53,108,61],[110,1,110,40],[112,1,112,40],[112,42,112,50],[112,53,112,61],[121,1,121,40],[121,42,121,50],[121,53,121,61],[123,1,123,40],[123,42,123,50],[123,53,123,61],[117,1,117,40],[117,42,117,50],[117,53,117,61],[119,1,119,40],[119,42,119,50],[119,53,119,61],[129,1,129,40],[129,42,129,50],[129,53,129,61],[131,1,131,40],[131,42,131,50],[131,53,131,61],[125,1,125,40],[125,42,125,50],[125,53,125,61],[127,1,127,40],[127,42,127,50],[127,53,127,61],[141,1,141,51],[141,53,141,61],[145,60,145,62],[134,53,134,61],[137,1,137,51],[138,0,139,0],[138,1,139,38],[138,42,138,50],[138,53,138,61],[139,42,139,50]]}
[null,null,null,null,null,null,null,null,null,null,null,null,null,null,null,null,null,null,null,null,null,null,null,null,null,null,null,null,null,null,null,null,null,null,null,null,null,null,null,null,null,null,null,null,null,null,null,null,null,null,"Modèle n° : ADC080F-15E"]
[]
[]
[null,null,null,null,null,null,null,null,null,null,null,null,null,null,null,null,"TAXE SUR LA VALEUR AJOUTEE"]
[null,null,null,null,null,null,null,null,null,null,null,null,null,null,null,null,"Déclaration Triméstriel"]
["DRI, DP ou DIP de :",null,null,null,null,null,null,null,null,null,null,null,null,null,null,null,"Article 110 du Code Général des Impôts (CGI)"]
["………………………………….."]
["Subdivision : …………………..",null,null,null,null,null,null,null,null,null,null,null,null,null,null,null,null,null,null,null,"Triméstre ",null,null,null,null,{"$f":"+EDI!C5","v":"02"},null,"Année :",null,null,null,null,{"$f":"+EDI!C4","v":2016}]
[null,null,null,null,null,null,null,null,null,null,null,null,null,null,null,null,null,null,"Fait générateur :",null,null,null,null,null,null,"Débit ",null,null,null,null,null,"Encaissement",null,null,null,null,null,null,"X"]
[]
["IDENTIFICATION DU CONTRIBUABLE"]
[]
[]
[]
["N° d'identification fiscale :",null,null,null,null,null,null,null,null,null,null,null,{"$f":"+EDI!C3","v":0},null,null,null,null,null,null,null,null,null,null,null,null,null,null,"C.N.I ou Carte de séjour N° :"]
["Identifiant commun de l'entreprise «ICE» :"]
["Nom,Prénom (s) ou Raison Sociale:",null,null,null,null,null,null,null,null,null,null,null,null,null,null,null,{"$f":"+EDI!C2","v":0}]
["Activité principale :"]
["Adresse du siège social,du principale établissement ou du domicile fiscal:"]
["………………………………………………………………………………………………………………………………………………",null,null,null,null,null,null,null,null,null,null,null,null,null,null,null,null,null,null,null,null,null,null,null,null,null,null,null,null,null,null,null,null,null,null,null,null,null,null,null,null,null,null,null,null,null,"Ville :",null,null,"ESSAOUIRA"]
["Téléphone :",null,null,null,"……………………………………………….",null,null,null,null,null,null,null,null,null,null,null,null,null,null,null,"Fax :",null,null,"…………………………….",null,null,null,null,null,null,null,null,null,null,null,"e-mail:",null,null,null,"………………………………………………………"]
["A"," Ventilation du chiffre d’affaires total Montant",null,null,null,null,null,null,null,null,null,null,null,null,null,null,null,null,null,null,null,null,null,null,null,null,null,null,null,null,null,null,null,null,null,null,null,null,null,null,null,"Montants"]
[]
[]
[10,"Montant du chiffre d’affaires réalisé y compris les affaires non imposables (HT)",null,null,null,null,null,null,null,null,null,null,null,null,null,null,null,null,null,null,null,null,null,null,null,null,null,null,null,null,null,null,null,null,null,null,null,null,null,null,null,null,{"$f":"SUM(AQ27:BJ35)","v":0}]
[]
[20,"- Opérations situées hors champ d’application de la TVA"]
[]
[30,"- Opérations exonérées sans droit à déduction (art 91du CGI)"]
[]
{"$rows_left_out":117}
{"sheet":"FACE 02","index":4,"n_rows":114,"n_cols":68,"rows_kept":114,"cut":false,"hidden":false,"merged":[[1,31,3,41],[1,42,3,45],[1,46,3,56],[4,0,4,2],[4,3,4,27],[5,0,5,2],[5,3,5,27],[6,0,6,2],[6,3,6,27],[1,0,3,2],[1,3,3,27],[1,28,3,30],[13,32,13,40],[13,47,13,55],[9,28,9,30],[10,0,10,2],[10,3,10,27],[10,28,10,30],[10,32,10,40],[10,47,10,55],[6,28,6,30],[6,32,6,40],[6,47,6,55],[8,0,8,2],[8,3,8,27],[8,28,8,30],[8,32,8,40],[8,47,8,55],[14,28,14,30],[15,0,15,2],[15,3,15,27],[15,28,15,30],[16,3,16,27],[16,28,16,30],[12,0,12,2],[12,3,12,27],[13,3,13,27],[13,28,13,30],[19,3,19,27],[19,28,19,30],[20,0,20,2],[20,3,20,27],[20,28,20,30],[20,32,20,40],[16,32,16,40],[16,47,16,55],[17,28,17,30],[18,0,18,2],[18,3,18,27],[18,28,18,30],[18,32,18,40],[18,47,18,55],[23,28,23,30],[24,0,24,2],[24,3,24,27],[24,28,24,30],[24,32,24,40],[24,47,24,55],[20,47,20,55],[21,28,21,30],[22,0,22,2],[22,3,22,27],[22,28,22,30],[22,32,22,40],[22,47,22,55],[27,28,27,30],[28,0,28,2],[28,3,28,27],[28,28,28,30],[28,32,28,40],[28,47,28,55],[25,28,25,30],[26,0,26,2],[26,3,26,27],[26,28,26,30],[26,32,26,40],[26,47,26,55],[31,28,31,30],[32,0,32,2],[32,3,32,27],[32,28,32,30],[32,32,32,40],[32,47,32,55],[29,28,29,30],[30,0,30,2],[30,3,30,27],[30,28,30,30],[30,32,30,40],[30,47,30,55],[35,28,35,30],[36,0,36,2],[36,3,36,27],[36,28,36,30],[36,32,36,40],[36,47,36,55],[33,28,33,30],[34,0,34,2],[34,3,34,27],[34,28,34,30],[34,32,34,40],[34,47,34,55],[40,42,40,45],[40,47,40,55],[41,0,41,2],[41,3,41,27],[37,28,37,30],[38,0,38,2],[38,3,38,27],[38,28,38,30],[38,32,38,40],[38,47,38,55],[42,3,42,27],[42,28,42,30],[43,0,43,2],[43,3,43,27],[43,28,43,30],[43,32,43,40],[40,0,40,2],[40,3,40,27],[40,32,40,40],[46,28,46,30],[47,0,47,2],[47,3,47,27],[47,28,47,30],[47,32,47,40],[47,47,47,55],[43,47,43,55],[44,28,44,30],[45,0,45,2],[45,3,45,27],[45,28,45,30],[45,32,45,40],[45,47,45,55],[50,28,50,30],[51,0,51,2],[51,3,51,27],[51,28,51,30],[51,32,51,40],[51,47,51,55],[48,28,48,30],[49,0,49,2],[49,3,49,27],[49,28,49,30],[49,32,49,40],[49,47,49,55],[54,28,54,30],[55,0,55,2],[55,3,55,27],[55,28,55,30],[55,32,55,40],[55,47,55,55],[52,28,52,30],[53,0,53,2],[53,3,53,27],[53,28,53,30],[53,32,53,40],[53,47,53,55],[58,28,58,30],[58,63,59,73],[59,0,59,2],[59,3,59,27],[59,28,59,30],[59,32,59,40],[59,47,59,55],[56,28,56,30],[57,0,57,2],[57,3,57,27],[57,28,57,30],[57,32,57,40],[57,47,57,55],[57,67,57,77],[65,63,66,73],[67,0,67,2],[67,3,67,45],[67,47,67,55],[67,63,67,73],[69,0,69,2],[69,3,69,45],[69,47,69,55],[61,0,61,2],[61,3,61,27],[61,32,61,40],[61,47,61,55],[61,63,62,73],[63,63,64,73],[64,0,64,2],[64,3,64,45],[64,47,64,55],[69,60,69,63],[83,0,83,56],[84,0,84,27],[84,28,84,56],[85,0,85,27],[85,28,85,56],[86,0,86,13],[86,14,86,27],[86,28,86,41],[86,42,86,56],[78,0,78,56],[79,0,79,56],[80,38,80,44],[80,45,80,46],[80,47,80,55],[81,37,81,56],[71,0,71,2],[71,47,71,55],[73,0,73,2],[73,47,73,55],[75,0,75,2],[75,47,75,55]]}
[]
["C",null,null," Ventilation des déductions ",null,null,null,null,null,null,null,null,null,null,null,null,null,null,null,null,null,null,null,null,null,null,null,null,"Taux ",null,null,"TVA figurant sur factures\nd'achat ou mémoires",null,null,null,null,null,null,null,null,null,null,"%\nprorata\n(*)",null,null,null,"TVA\nDéductible"]
[]
[]
[null,null,null,"1-ACHATS NON IMMOBILISES"]
[null,null,null,"Prestations de services"]
[140,null,null,"- Prestations de services",null,null,null,null,null,null,null,null,null,null,null,null,null,null,null,null,null,null,null,null,null,null,null,null,0.2,null,null,null,{"$f":"DED!E25","v":0},null,null,null,null,null,null,null,null,null,null,null,null,null,null,{"$f":"AG7","v":0}]
[]
[141,null,null,"- Transport",null,null,null,null,null,null,null,null,null,null,null,null,null,null,null,null,null,null,null,null,null,null,null,null,0.14000000000000001,null,null,null,null,null,null,null,null,null,null,null,null,null,null,null,null,null,null,{"$f":"AG9","v":0}]
[]
[142,null,null,"- Opération de banque",null,null,null,null,null,null,null,null,null,null,null,null,null,null,null,null,null,null,null,null,null,null,null,null,0.1,null,null,null,{"$f":"DED!E112","v":0},null,null,null,null,null,null,null,null,null,null,null,null,null,null,{"$f":"AG11","v":0}]
[]
[143,null,null,"- Hôtels de voyageurs, et ensemble immobilier à destination"]
[null,null,null,"touristique",null,null,null,null,null,null,null,null,null,null,null,null,null,null,null,null,null,null,null,null,null,null,null,null,0.1,null,null,null,null,null,null,null,null,null,null,null,null,null,null,null,null,null,null,{"$f":"AG14","v":0}]
[]
[144,null,null,"- Les opérations des avocats, interprètes, notaires, adoul,",null,null,null,null,null,null,null,null,null,null,null,null,null,null,null,null,null,null,null,null,null,null,null,null," "]
[null,null,null,"huissiers de justice et vétérinaires",null,null,null,null,null,null,null,null,null,null,null,null,null,null,null,null,null,null,null,null,null,null,null,null,0.1,null,null,null,null,null,null,null,null,null,null,null,null,null,null,null,null,null,null,{"$f":"AG17","v":0}]
[]
[153,null,null,"- Autres prestations de services",null,null,null,null,null,null,null,null,null,null,null,null,null,null,null,null,null,null,null,null,null,null,null,null,0.1,null,null,null,null,null,null,null,null,null,null,null,null,null,null,null,null,null,null,{"$f":"AG19","v":0}]
[null,null,null,"Autres achats non immobilisés"]
[145,null,null,"- Achat à l’importation",null,null,null,null,null,null,null,null,null,null,null,null,null,null,null,null,null,null,null,null,null,null,null,null,0.2,null,null,null,{"$f":"DED!E83","v":0},null,null,null,null,null,null,null,null,null,null,null,null,null,null,{"$f":"AG21","v":0}]
[]
[146,null,null,"- Achat à l’intérieur",null,null,null,null,null,null,null,null,null,null,null,null,null,null,null,null,null,null,null,null,null,null,null,null,0.2,null,null,null,{"$f":"DED!E49","v":0},null,null,null,null,null,null,null,null,null,null,null,null,null,null,{"$f":"AG23","v":0}]
[]
[147,null,null,"- Achat à l’importation",null,null,null,null,null,null,null,null,null,null,null,null,null,null,null,null,null,null,null,null,null,null,null,null,0.14000000000000001,null,null,null,null,null,null,null,null,null,null,null,null,null,null,null,null,null,null,{"$f":"AG25","v":0}]
[]
[148,null,null,"- Achat à l’intérieur",null,null,null,null,null,null,null,null,null,null,null,null,null,null,null,null,null,null,null,null,null,null,null,null,0.14000000000000001,null,null,null,{"$f":"DED!E70","v":0},null,null,null,null,null,null,null,null,null,null,null,null,null,null,{"$f":"AG27","v":0}]
[]
[149,null,null,"- Achat à l’importation",null,null,null,null,null,null,null,null,null,null,null,null,null,null,null,null,null,null,null,null,null,null,null,null,0.1,null,null,null,null,null,null,null,null,null,null,null,null,null,null,null,null,null,null,{"$f":"AG29","v":0}]
[]
{"$rows_left_out":85}
{"sheet":"FRS-ICE","index":5,"n_rows":24,"n_cols":3,"rows_kept":24,"cut":false,"hidden":false,"merged":[]}
["I.F","R.S","I.C.E"]
[6501149,"SALIPRO MARRAKECH","001537657000037"]
[2200524,"STE COPRALIM CASA","001533006000096"]
[2500543,"STE MARACI CASA","000083905000097"]
[1066142,"STE ARCADE EQUIPEMENT CASA","000102825000059"]
[6501531,"STE CBGS ESSAOUIRA","001538435000080"]
[2501992,"STE SOFRALIM CASA","000094702000063"]
[3332162,"MAROC TELECOM","001522585000066"]
[74711250,"BOUNAKHLA HADJ LAHCEN ESSAOUIRA","001646253000061"]
[6503751,"MENARA MENAGE MARRAKECH","001530309000068"]
[15195575,"MIZA CONFORT SAFI"]
[1103664,"STE MORO TISSU CASA"]
[1020780,"JESSY DIFFUSION CASA","001530970800047"]
[74719960,"RH AGRI ESSAOUIRA","001167670000044"]
[40126522,"IMARAQ TRADING CASA","000229913000058"]
[1620906,"STE BADRA CASA","001535125000016"]
[2201692,"SANIBATI CASA","001539056000094"]
[2801503,"MATRELEC CASA","001431030000006"]
[2201189,"AQUA IONIQUE CASA","001527804000094"]
[40228206,"OCEDIS MAROC INEZGANE","000054704000011"]
[1001419,"ANCIENS ETAB. R.GEISSMAN&FILS","000102268000063"]
[1900208,"DIVERSEY MAROC","001525252000031"]
[40491121,"GARDA TECH -AGADIR","001449819000013"]
[40486450,"O.N.E.E.P","001591281000011"]