{"text_format":"1","workbook":"xlsx","n_sheets":6,"sheets":["Saisie des équipes","Saisie des résultats","Résultats non classés","Résultats classés","Phases Finales (1&2)","Planning"],"not_rendered":{"charts":0,"images":9,"macros":1,"external_links":0,"defined_names":1,"comments":3,"pivot_tables":0},"unopened":[],"bounds":{"document_bytes":16777216,"sheet_cells":100000,"rows_first":2000,"rows_last":500,"rows_between":2000,"halvings":0,"cell_chars":16384,"cell_head_chars":4096},"cells_cut":0,"cells_raw":0,"read":"whole","date_system":"1900"}

{"sheet":"Saisie des équipes","index":0,"n_rows":8,"n_cols":9,"rows_kept":8,"cut":false,"hidden":false,"merged":[[0,1,0,2],[0,4,0,5],[0,7,0,8]]}
[null,"Poule A",null,null,"Poule B",null,null,"Poule C"]
[null,"Equipe","Nom des équipes",null,"Equipe","Nom des équipes",null,"Equipe","Nom des équipes"]
[null,1,null,null,1,null,null,1]
[null,2,null,null,2,null,null,2]
[null,3,null,null,3,null,null,3]
[null,4,null,null,4,null,null,4]
[null,5,null,null,5,null,null,5]
[null,6,null,null,6,null,null,6]

{"sheet":"Saisie des résultats","index":1,"n_rows":22,"n_cols":42,"rows_kept":22,"cut":false,"hidden":false,"merged":[[5,39,5,41],[0,2,0,17],[4,1,4,7],[4,15,4,21],[4,29,4,35],[5,5,5,7],[5,11,5,13],[5,19,5,21],[5,25,5,27],[5,33,5,35]]}
[null,null,"Points attribués"]
[null,null,null,"Gagné",null,null,null,null,null,null,null,null,null,null,null,"Nul",null,"Perdu"]
[null,null,null,3,null,null,null,null,null,null,null,null,null,null,null,1,null,0]
[]
[null,"Poule A",null,null,null,null,null,null,null,null,null,null,null,null,null,"Poule B",null,null,null,null,null,null,null,null,null,null,null,null,null,"Poule C"]
[null,"Equipe","X","Equipe",null,"Saisie des résultats",null,null,null,null,null,"point(s) attribué(s)",null,null,null,"Equipe","X","Equipe",null,"Saisie des résultats",null,null,null,null,null,"point(s) attribué(s)",null,null,null,"Equipe","X","Equipe",null,"Saisie des résultats",null,null,null,null,null,"point(s) attribué(s)"]
["19h30",{"$f":"IF('Saisie des équipes'!$C$3=\"\",\"\",'Saisie des équipes'!$C$3)","v":""},"X",{"$f":"IF('Saisie des équipes'!$C$8=\"\",\"\",'Saisie des équipes'!$C$8)","v":""},{"$f":"IF(OR(H7=\"\",F7=\"\"),\"x\",\"\")","v":"x"},null,{"$f":"IF(OR(D7=\"\",B7=\"\"),\"\",\"à\")","v":""},null,{"$f":"IF(F7>H7,$D$3,(IF(F7=H7,$P$3,$R$3)))","v":1},{"$f":"IF(F7=H7,$P$3,0)","v":1},{"$f":"IF(F7<H7,$D$3,IF(F7=H7,$P$3,$R$3))","v":1},{"$f":"IF(OR(F7=\"\",H7=\"\"),0,I7)","v":0},null,{"$f":"IF(OR(F7=\"\",H7=\"\"),0,K7)","v":0},null,{"$f":"IF('Saisie des équipes'!$F$3=\"\",\"\",'Saisie des équipes'!$F$3)","v":""},"X",{"$f":"IF('Saisie des équipes'!$F$8=\"\",\"\",'Saisie des équipes'!$F$8)","v":""},{"$f":"IF(OR(V7=\"\",T7=\"\"),\"x\",\"\")","v":"x"},null,{"$f":"IF(OR(R7=\"\",P7=\"\"),\"\",\"à\")","v":""},null,{"$f":"IF(T7>V7,$D$3,IF(T7=V7,$P$3,$R$3))","v":1},{"$f":"IF(T7=V7,$P$3,0)","v":1},{"$f":"IF(T7<V7,$D$3,IF(T7=V7,$P$3,$R$3))","v":1},{"$f":"IF(OR(T7=\"\",V7=\"\"),0,W7)","v":0},null,{"$f":"IF(OR(T7=\"\",V7=\"\"),0,Y7)","v":0},null,{"$f":"IF('Saisie des équipes'!$I$3=\"\",\"\",'Saisie des équipes'!$I$3)","v":""},"X",{"$f":"IF('Saisie des équipes'!$I$8=\"\",\"\",'Saisie des équipes'!$I$8)","v":""},{"$f":"IF(OR(AJ7=\"\",AH7=\"\"),\"x\",\"\")","v":"x"},null,{"$f":"IF(OR(AF7=\"\",AD7=\"\"),\"\",\"à\")","v":""},null,{"$f":"IF(AH7>AJ7,$D$3,IF(AH7=AJ7,$P$3,$R$3))","v":1},{"$f":"IF(AH7=AJ7,$P$3,0)","v":1},{"$f":"IF(AH7<AJ7,$D$3,IF(AH7=AJ7,$P$3,$R$3))","v":1},{"$f":"IF(OR(AH7=\"\",AJ7=\"\"),0,AK7)","v":0},null,{"$f":"IF(OR(AH7=\"\",AJ7=\"\"),0,AM7)","v":0}]
["19h45",{"$f":"IF('Saisie des équipes'!$C$4=\"\",\"\",'Saisie des équipes'!$C$4)","v":""},"X",{"$f":"IF('Saisie des équipes'!$C$7=\"\",\"\",'Saisie des équipes'!$C$7)","v":""},{"$f":"IF(OR(H8=\"\",F8=\"\"),\"x\",\"\")","v":"x"},null,{"$f":"IF(OR(D8=\"\",B8=\"\"),\"\",\"à\")","v":""},null,{"$f":"IF(F8>H8,$D$3,IF(F8=H8,$P$3,$R$3))","v":1},1,{"$f":"IF(F8<H8,$D$3,IF(F8=H8,$P$3,$R$3))","v":1},0,null,0,null,{"$f":"IF('Saisie des équipes'!$F$4=\"\",\"\",'Saisie des équipes'!$F$4)","v":""},"X",{"$f":"IF('Saisie des équipes'!$F$7=\"\",\"\",'Saisie des équipes'!$F$7)","v":""},{"$f":"IF(OR(V8=\"\",T8=\"\"),\"x\",\"\")","v":"x"},null,"",null,{"$f":"IF(T8>V8,$D$3,IF(T8=V8,$P$3,$R$3))","v":1},{"$f":"IF(T8=V8,$P$3,0)","v":1},{"$f":"IF(T8<V8,$D$3,IF(T8=V8,$P$3,$R$3))","v":1},{"$f":"IF(OR(T8=\"\",V8=\"\"),0,W8)","v":0},null,{"$f":"IF(OR(T8=\"\",V8=\"\"),0,Y8)","v":0},null,{"$f":"IF('Saisie des équipes'!$I$4=\"\",\"\",'Saisie des équipes'!$I$4)","v":""},"X",{"$f":"IF('Saisie des équipes'!$I$7=\"\",\"\",'Saisie des équipes'!$I$7)","v":""},{"$f":"IF(OR(AJ8=\"\",AH8=\"\"),\"x\",\"\")","v":"x"},null,"",null,{"$f":"IF(AH8>AJ8,$D$3,IF(AH8=AJ8,$P$3,$R$3))","v":1},1,{"$f":"IF(AH8<AJ8,$D$3,IF(AH8=AJ8,$P$3,$R$3))","v":1},{"$f":"IF(OR(AH8=\"\",AJ8=\"\"),0,AK8)","v":0},null,{"$f":"IF(OR(AH8=\"\",AJ8=\"\"),0,AM8)","v":0}]
["20h00",{"$f":"IF('Saisie des équipes'!$C$5=\"\",\"\",'Saisie des équipes'!$C$5)","v":""},"X",{"$f":"IF('Saisie des équipes'!$C$6=\"\",\"\",'Saisie des équipes'!$C$6)","v":""},{"$f":"IF(OR(H9=\"\",F9=\"\"),\"x\",\"\")","v":"x"},null,{"$f":"IF(OR(D9=\"\",B9=\"\"),\"\",\"à\")","v":""},null,{"$f":"IF(F9>H9,$D$3,IF(F9=H9,$P$3,$R$3))","v":1},1,1,0,null,0,null,{"$f":"IF('Saisie des équipes'!$F$5=\"\",\"\",'Saisie des équipes'!$F$5)","v":""},"X",{"$f":"IF('Saisie des équipes'!$F$6=\"\",\"\",'Saisie des équipes'!$F$6)","v":""},{"$f":"IF(OR(V9=\"\",T9=\"\"),\"x\",\"\")","v":"x"},null,"",null,1,1,1,0,null,0,null,{"$f":"IF('Saisie des équipes'!$I$5=\"\",\"\",'Saisie des équipes'!$I$5)","v":""},"X",{"$f":"IF('Saisie des équipes'!$I$6=\"\",\"\",'Saisie des équipes'!$I$6)","v":""},{"$f":"IF(OR(AJ9=\"\",AH9=\"\"),\"x\",\"\")","v":"x"},null,"",null,1,1,1,0,null,0]
["20h15",{"$f":"IF('Saisie des équipes'!$C$4=\"\",\"\",'Saisie des équipes'!$C$4)","v":""},"X",{"$f":"IF('Saisie des équipes'!$C$8=\"\",\"\",'Saisie des équipes'!$C$8)","v":""},"x",null,"",null,1,1,1,0,null,0,null,{"$f":"IF('Saisie des équipes'!$F$4=\"\",\"\",'Saisie des équipes'!$F$4)","v":""},"X",{"$f":"IF('Saisie des équipes'!$F$8=\"\",\"\",'Saisie des équipes'!$F$8)","v":""},"x",null,"",null,1,1,1,0,null,0,null,{"$f":"IF('Saisie des équipes'!$I$4=\"\",\"\",'Saisie des équipes'!$I$4)","v":""},"X",{"$f":"IF('Saisie des équipes'!$I$8=\"\",\"\",'Saisie des équipes'!$I$8)","v":""},"x",null,"",null,1,1,1,0,null,0]
["20h30",{"$f":"IF('Saisie des équipes'!$C$3=\"\",\"\",'Saisie des équipes'!$C$3)","v":""},"X",{"$f":"IF('Saisie des équipes'!C5=\"\",\"\",'Saisie des équipes'!C5)","v":""},"x",null,"",null,1,1,1,0,null,0,null,{"$f":"IF('Saisie des équipes'!$F$3=\"\",\"\",'Saisie des équipes'!$F$3)","v":""},"X",{"$f":"IF('Saisie des équipes'!F5=\"\",\"\",'Saisie des équipes'!F5)","v":""},"x",null,"",null,1,1,1,0,null,0,null,{"$f":"IF('Saisie des équipes'!$I$3=\"\",\"\",'Saisie des équipes'!$I$3)","v":""},"X",{"$f":"IF('Saisie des équipes'!I5=\"\",\"\",'Saisie des équipes'!I5)","v":""},"x",null,"",null,1,1,1,0,null,0]
["20h45",{"$f":"IF('Saisie des équipes'!$C$6=\"\",\"\",'Saisie des équipes'!$C$6)","v":""},"X",{"$f":"IF('Saisie des équipes'!$C$7=\"\",\"\",'Saisie des équipes'!$C$7)","v":""},"x",null,"",null,1,1,1,0,null,0,null,{"$f":"IF('Saisie des équipes'!$F$6=\"\",\"\",'Saisie des équipes'!$F$6)","v":""},"X",{"$f":"IF('Saisie des équipes'!$F$7=\"\",\"\",'Saisie des équipes'!$F$7)","v":""},"x",null,"",null,1,1,1,0,null,0,null,{"$f":"IF('Saisie des équipes'!$I$6=\"\",\"\",'Saisie des équipes'!$I$6)","v":""},"X",{"$f":"IF('Saisie des équipes'!$I$7=\"\",\"\",'Saisie des équipes'!$I$7)","v":""},"x",null,"",null,1,1,1,0,null,0]
["21h00",{"$f":"IF('Saisie des équipes'!$C$5=\"\",\"\",'Saisie des équipes'!$C$5)","v":""},"X",{"$f":"IF('Saisie des équipes'!$C$8=\"\",\"\",'Saisie des équipes'!$C$8)","v":""},"x",null,"",null,1,1,1,0,null,0,null,{"$f":"IF('Saisie des équipes'!$F$5=\"\",\"\",'Saisie des équipes'!$F$5)","v":""},"X",{"$f":"IF('Saisie des équipes'!$F$8=\"\",\"\",'Saisie des équipes'!$F$8)","v":""},"x",null,"",null,1,1,1,0,null,0,null,{"$f":"IF('Saisie des équipes'!$I$5=\"\",\"\",'Saisie des équipes'!$I$5)","v":""},"X",{"$f":"IF('Saisie des équipes'!$I$8=\"\",\"\",'Saisie des équipes'!$I$8)","v":""},"x",null,"",null,1,1,1,0,null,0]
["21h15",{"$f":"IF('Saisie des équipes'!$C$4=\"\",\"\",'Saisie des équipes'!$C$4)","v":""},"X",{"$f":"IF('Saisie des équipes'!$C$6=\"\",\"\",'Saisie des équipes'!$C$6)","v":""},"x",null,"",null,1,1,1,0,null,0,null,{"$f":"IF('Saisie des équipes'!$F$4=\"\",\"\",'Saisie des équipes'!$F$4)","v":""},"X",{"$f":"IF('Saisie des équipes'!$F$6=\"\",\"\",'Saisie des équipes'!$F$6)","v":""},"x",null,"",null,1,1,1,0,null,0,null,{"$f":"IF('Saisie des équipes'!$I$4=\"\",\"\",'Saisie des équipes'!$I$4)","v":""},"X",{"$f":"IF('Saisie des équipes'!$I$6=\"\",\"\",'Saisie des équipes'!$I$6)","v":""},"x",null,"",null,1,1,1,0,null,0]
["21h30",{"$f":"IF('Saisie des équipes'!$C$3=\"\",\"\",'Saisie des équipes'!$C$3)","v":""},"X",{"$f":"IF('Saisie des équipes'!$C$7=\"\",\"\",'Saisie des équipes'!$C$7)","v":""},"x",null,"",null,1,1,1,0,null,0,null,{"$f":"IF('Saisie des équipes'!$F$3=\"\",\"\",'Saisie des équipes'!$F$3)","v":""},"X",{"$f":"IF('Saisie des équipes'!$F$7=\"\",\"\",'Saisie des équipes'!$F$7)","v":""},"x",null,"",null,1,1,1,0,null,0,null,{"$f":"IF('Saisie des équipes'!$I$3=\"\",\"\",'Saisie des équipes'!$I$3)","v":""},"X",{"$f":"IF('Saisie des équipes'!$I$7=\"\",\"\",'Saisie des équipes'!$I$7)","v":""},"x",null,"",null,1,1,1,0,null,0]
["21h45",{"$f":"IF('Saisie des équipes'!$C$6=\"\",\"\",'Saisie des équipes'!$C$6)","v":""},"X",{"$f":"IF('Saisie des équipes'!$C$8=\"\",\"\",'Saisie des équipes'!$C$8)","v":""},"x",null,"",null,1,1,1,0,null,0,null,{"$f":"IF('Saisie des équipes'!$F$6=\"\",\"\",'Saisie des équipes'!$F$6)","v":""},"X",{"$f":"IF('Saisie des équipes'!$F$8=\"\",\"\",'Saisie des équipes'!$F$8)","v":""},"x",null,"",null,1,1,1,0,null,0,null,{"$f":"IF('Saisie des équipes'!$I$6=\"\",\"\",'Saisie des équipes'!$I$6)","v":""},"X",{"$f":"IF('Saisie des équipes'!$I$8=\"\",\"\",'Saisie des équipes'!$I$8)","v":""},"x",null,"",null,1,1,1,0,null,0]
["22h00",{"$f":"IF('Saisie des équipes'!$C$5=\"\",\"\",'Saisie des équipes'!$C$5)","v":""},"X",{"$f":"IF('Saisie des équipes'!$C$7=\"\",\"\",'Saisie des équipes'!$C$7)","v":""},"x",null,"",null,1,1,1,0,null,0,null,{"$f":"IF('Saisie des équipes'!$F$5=\"\",\"\",'Saisie des équipes'!$F$5)","v":""},"X",{"$f":"IF('Saisie des équipes'!$F$7=\"\",\"\",'Saisie des équipes'!$F$7)","v":""},"x",null,"",null,1,1,1,0,null,0,null,{"$f":"IF('Saisie des équipes'!$I$5=\"\",\"\",'Saisie des équipes'!$I$5)","v":""},"X",{"$f":"IF('Saisie des équipes'!$I$7=\"\",\"\",'Saisie des équipes'!$I$7)","v":""},"x",null,"",null,1,1,1,0,null,0]
["22h15",{"$f":"IF('Saisie des équipes'!$C$3=\"\",\"\",'Saisie des équipes'!$C$3)","v":""},"X",{"$f":"IF('Saisie des équipes'!C4=\"\",\"\",'Saisie des équipes'!C4)","v":""},"x",null,"",null,1,1,1,0,null,0,null,{"$f":"IF('Saisie des équipes'!$F$3=\"\",\"\",'Saisie des équipes'!$F$3)","v":""},"X",{"$f":"IF('Saisie des équipes'!F4=\"\",\"\",'Saisie des équipes'!F4)","v":""},"x",null,"",null,1,1,1,0,null,0,null,{"$f":"IF('Saisie des équipes'!$I$3=\"\",\"\",'Saisie des équipes'!$I$3)","v":""},"X",{"$f":"IF('Saisie des équipes'!I4=\"\",\"\",'Saisie des équipes'!I4)","v":""},"x",null,"",null,1,1,1,0,null,0]
["22h30",{"$f":"IF('Saisie des équipes'!$C$7=\"\",\"\",'Saisie des équipes'!$C$7)","v":""},"X",{"$f":"IF('Saisie des équipes'!$C$8=\"\",\"\",'Saisie des équipes'!$C$8)","v":""},"x",null,"",null,1,1,1,0,null,0,null,{"$f":"IF('Saisie des équipes'!$F$7=\"\",\"\",'Saisie des équipes'!$F$7)","v":""},"X",{"$f":"IF('Saisie des équipes'!$F$8=\"\",\"\",'Saisie des équipes'!$F$8)","v":""},"x",null,"",null,1,1,1,0,null,0,null,{"$f":"IF('Saisie des équipes'!$I$7=\"\",\"\",'Saisie des équipes'!$I$7)","v":""},"X",{"$f":"IF('Saisie des équipes'!$I$8=\"\",\"\",'Saisie des équipes'!$I$8)","v":""},"x",null,"",null,1,1,1,0,null,0]
["22h45",{"$f":"IF('Saisie des équipes'!$C$3=\"\",\"\",'Saisie des équipes'!$C$3)","v":""},"X",{"$f":"IF('Saisie des équipes'!$C$6=\"\",\"\",'Saisie des équipes'!$C$6)","v":""},"x",null,"",null,1,1,1,0,null,0,null,{"$f":"IF('Saisie des équipes'!$F$3=\"\",\"\",'Saisie des équipes'!$F$3)","v":""},"X",{"$f":"IF('Saisie des équipes'!$F$6=\"\",\"\",'Saisie des équipes'!$F$6)","v":""},"x",null,"",null,1,1,1,0,null,0,null,{"$f":"IF('Saisie des équipes'!$I$3=\"\",\"\",'Saisie des équipes'!$I$3)","v":""},"X",{"$f":"IF('Saisie des équipes'!$I$6=\"\",\"\",'Saisie des équipes'!$I$6)","v":""},"x",null,"",null,1,1,1,0,null,0]
["23h00",{"$f":"IF('Saisie des équipes'!$C$4=\"\",\"\",'Saisie des équipes'!$C$4)","v":""},"X",{"$f":"IF('Saisie des équipes'!$C$5=\"\",\"\",'Saisie des équipes'!$C$5)","v":""},"x",null,"",null,1,1,1,0,null,0,null,{"$f":"IF('Saisie des équipes'!$F$4=\"\",\"\",'Saisie des équipes'!$F$4)","v":""},"X",{"$f":"IF('Saisie des équipes'!$F$5=\"\",\"\",'Saisie des équipes'!$F$5)","v":""},"x",null,"",null,1,1,1,0,null,0,null,{"$f":"IF('Saisie des équipes'!$I$4=\"\",\"\",'Saisie des équipes'!$I$4)","v":""},"X",{"$f":"IF('Saisie des équipes'!$I$5=\"\",\"\",'Saisie des équipes'!$I$5)","v":""},"x",null,"",null,1,1,1,0,null,0]
[null,{"$f":"IF(E22<>G22,\"Résultats incomplets\",\"\")","v":""},null,{"$f":"IF(F22<>H22,\"Il y a une ou des erreur(s) de saisie\",\"\")","v":""},{"$f":"COUNTIF(E7:E21,\"\")","v":0},{"$f":"COUNT(F7:F21)","v":0},{"$f":"COUNTIF(G7:G21,\"à\")","v":0},{"$f":"COUNT(H7:H21)","v":0},null,null,null,null,null,null,null,{"$f":"IF(S22<>U22,\"Résultats incomplets\",\"\")","v":""},null,{"$f":"IF(T22<>V22,\"Il y a une ou des erreur(s) de saisie\",\"\")","v":""},{"$f":"COUNTIF(S7:S21,\"\")","v":0},{"$f":"COUNT(T7:T21)","v":0},{"$f":"COUNTIF(U7:U21,\"à\")","v":0},{"$f":"COUNT(V7:V21)","v":0},null,null,null,null,null,null,null,{"$f":"IF(AG22<>AI22,\"Résultats incomplets\",\"\")","v":""},null,{"$f":"IF(AH22<>AJ22,\"Il y a une ou des erreur(s) de saisie\",\"\")","v":""},{"$f":"COUNTIF(AG7:AG21,\"\")","v":0},{"$f":"COUNT(AH7:AH21)","v":0},{"$f":"COUNTIF(AI7:AI21,\"à\")","v":0},{"$f":"COUNT(AJ7:AJ21)","v":0}]

{"sheet":"Résultats non classés","index":2,"n_rows":9,"n_cols":18,"rows_kept":9,"cut":false,"hidden":false,"merged":[[1,1,1,5],[1,7,1,11],[1,13,1,17]]}
[]
[null,"Poule A",null,null,null,null,null,"Poule B",null,null,null,null,null,"Poule C"]
[null,"Equipe","Points","Buts marqués","Buts encaissés","Différence de buts",null,"Equipe","Points","Buts marqués","Buts encaissés","Différence de buts",null,"Equipe","Points","Buts marqués","Buts encaissés","Différence de buts"]
[null,{"$f":"IF('Saisie des équipes'!C3=\"\",\"\",'Saisie des équipes'!C3)","v":""},{"$f":"IF(ISERROR('Saisie des résultats'!L7+'Saisie des résultats'!L11+'Saisie des résultats'!L15+'Saisie des résultats'!L18+'Saisie des résultats'!L20),\"\",'Saisie des résultats'!L7+'Saisie des résultats'!L11+'Saisie des résultats'!L15+'Saisie des résultats'!L18+'Saisie des résultats'!L20)","v":0},{"$f":"'Saisie des résultats'!F7+'Saisie des résultats'!F11+'Saisie des résultats'!F15+'Saisie des résultats'!F18+'Saisie des résultats'!F20","v":0},{"$f":"'Saisie des résultats'!H7+'Saisie des résultats'!H11+'Saisie des résultats'!H15+'Saisie des résultats'!H18+'Saisie des résultats'!H20","v":0},{"$f":"D4-E4","v":0},null,{"$f":"IF('Saisie des équipes'!F3=\"\",\"\",'Saisie des équipes'!F3)","v":""},{"$f":"IF(ISERROR('Saisie des résultats'!Z7+'Saisie des résultats'!Z11+'Saisie des résultats'!Z15+'Saisie des résultats'!Z18+'Saisie des résultats'!Z20),\"\",'Saisie des résultats'!Z7+'Saisie des résultats'!Z11+'Saisie des résultats'!Z15+'Saisie des résultats'!Z18+'Saisie des résultats'!Z20)","v":0},{"$f":"'Saisie des résultats'!T7+'Saisie des résultats'!T11+'Saisie des résultats'!T15+'Saisie des résultats'!T18+'Saisie des résultats'!T20","v":0},{"$f":"'Saisie des résultats'!V7+'Saisie des résultats'!V11+'Saisie des résultats'!V15+'Saisie des résultats'!V18+'Saisie des résultats'!V20","v":0},{"$f":"J4-K4","v":0},null,{"$f":"IF('Saisie des équipes'!I3=\"\",\"\",'Saisie des équipes'!I3)","v":""},{"$f":"IF(ISERROR('Saisie des résultats'!AN7+'Saisie des résultats'!AN11+'Saisie des résultats'!AN15+'Saisie des résultats'!AN18+'Saisie des résultats'!AN20),\"\",'Saisie des résultats'!AN7+'Saisie des résultats'!AN11+'Saisie des résultats'!AN15+'Saisie des résultats'!AN18+'Saisie des résultats'!AN20)","v":0},{"$f":"'Saisie des résultats'!AH7+'Saisie des résultats'!AH11+'Saisie des résultats'!AH15+'Saisie des résultats'!AH18+'Saisie des résultats'!AH20","v":0},{"$f":"'Saisie des résultats'!AJ7+'Saisie des résultats'!AJ11+'Saisie des résultats'!AJ15+'Saisie des résultats'!AJ18+'Saisie des résultats'!AJ20","v":0},{"$f":"P4-Q4","v":0}]
[null,{"$f":"IF('Saisie des équipes'!C4=\"\",\"\",'Saisie des équipes'!C4)","v":""},{"$f":"'Saisie des résultats'!L8+'Saisie des résultats'!L10+'Saisie des résultats'!L14+'Saisie des résultats'!L21+'Saisie des résultats'!N18","v":0},{"$f":"'Saisie des résultats'!F8+'Saisie des résultats'!F10+'Saisie des résultats'!F14+'Saisie des résultats'!F21+'Saisie des résultats'!H18","v":0},{"$f":"'Saisie des résultats'!H8+'Saisie des résultats'!H10+'Saisie des résultats'!H14+'Saisie des résultats'!H21+'Saisie des résultats'!F18","v":0},0,null,{"$f":"IF('Saisie des équipes'!F4=\"\",\"\",'Saisie des équipes'!F4)","v":""},{"$f":"'Saisie des résultats'!Z8+'Saisie des résultats'!Z10+'Saisie des résultats'!Z14+'Saisie des résultats'!Z21+'Saisie des résultats'!AB18","v":0},{"$f":"'Saisie des résultats'!T8+'Saisie des résultats'!T10+'Saisie des résultats'!T14+'Saisie des résultats'!T21+'Saisie des résultats'!V18","v":0},{"$f":"'Saisie des résultats'!V8+'Saisie des résultats'!V10+'Saisie des résultats'!V14+'Saisie des résultats'!V21+'Saisie des résultats'!T18","v":0},0,null,{"$f":"IF('Saisie des équipes'!I4=\"\",\"\",'Saisie des équipes'!I4)","v":""},{"$f":"'Saisie des résultats'!AN8+'Saisie des résultats'!AN10+'Saisie des résultats'!AN14+'Saisie des résultats'!AN21+'Saisie des résultats'!AP18","v":0},{"$f":"'Saisie des résultats'!AH8+'Saisie des résultats'!AH10+'Saisie des résultats'!AH14+'Saisie des résultats'!AH21+'Saisie des résultats'!AJ18","v":0},{"$f":"'Saisie des résultats'!AJ8+'Saisie des résultats'!AJ10+'Saisie des résultats'!AJ14+'Saisie des résultats'!AJ21+'Saisie des résultats'!AH18","v":0},0]
[null,{"$f":"IF('Saisie des équipes'!C5=\"\",\"\",'Saisie des équipes'!C5)","v":""},{"$f":"'Saisie des résultats'!L9+'Saisie des résultats'!L13+'Saisie des résultats'!L17+'Saisie des résultats'!N11+'Saisie des résultats'!N21","v":0},{"$f":"'Saisie des résultats'!F9+'Saisie des résultats'!F13+'Saisie des résultats'!F17+'Saisie des résultats'!H11+'Saisie des résultats'!H21","v":0},{"$f":"'Saisie des résultats'!H9+'Saisie des résultats'!H13+'Saisie des résultats'!H17+'Saisie des résultats'!F11+'Saisie des résultats'!F21","v":0},0,null,{"$f":"IF('Saisie des équipes'!F5=\"\",\"\",'Saisie des équipes'!F5)","v":""},{"$f":"'Saisie des résultats'!Z9+'Saisie des résultats'!Z13+'Saisie des résultats'!Z17+'Saisie des résultats'!AB11+'Saisie des résultats'!AB21","v":0},{"$f":"'Saisie des résultats'!T9+'Saisie des résultats'!T13+'Saisie des résultats'!T17+'Saisie des résultats'!V11+'Saisie des résultats'!V21","v":0},{"$f":"'Saisie des résultats'!V9+'Saisie des résultats'!V13+'Saisie des résultats'!V17+'Saisie des résultats'!T11+'Saisie des résultats'!T21","v":0},0,null,{"$f":"IF('Saisie des équipes'!I5=\"\",\"\",'Saisie des équipes'!I5)","v":""},{"$f":"'Saisie des résultats'!AN9+'Saisie des résultats'!AN13+'Saisie des résultats'!AN17+'Saisie des résultats'!AP11+'Saisie des résultats'!AP21","v":0},{"$f":"'Saisie des résultats'!AH9+'Saisie des résultats'!AH13+'Saisie des résultats'!AH17+'Saisie des résultats'!AJ11+'Saisie des résultats'!AJ21","v":0},{"$f":"'Saisie des résultats'!AJ9+'Saisie des résultats'!AJ13+'Saisie des résultats'!AJ17+'Saisie des résultats'!AH11+'Saisie des résultats'!AH21","v":0},0]
[null,{"$f":"IF('Saisie des équipes'!C6=\"\",\"\",'Saisie des équipes'!C6)","v":""},{"$f":"'Saisie des résultats'!L12+'Saisie des résultats'!L16+'Saisie des résultats'!N9+'Saisie des résultats'!N14+'Saisie des résultats'!N20","v":0},{"$f":"'Saisie des résultats'!F12+'Saisie des résultats'!F16+'Saisie des résultats'!H9+'Saisie des résultats'!H14+'Saisie des résultats'!H20","v":0},{"$f":"'Saisie des résultats'!H12+'Saisie des résultats'!H16+'Saisie des résultats'!F9+'Saisie des résultats'!F14+'Saisie des résultats'!F20","v":0},0,null,{"$f":"IF('Saisie des équipes'!F6=\"\",\"\",'Saisie des équipes'!F6)","v":""},{"$f":"'Saisie des résultats'!Z12+'Saisie des résultats'!Z16+'Saisie des résultats'!AB9+'Saisie des résultats'!AB14+'Saisie des résultats'!AB20","v":0},{"$f":"'Saisie des résultats'!T12+'Saisie des résultats'!T16+'Saisie des résultats'!V9+'Saisie des résultats'!V14+'Saisie des résultats'!V20","v":0},{"$f":"'Saisie des résultats'!V12+'Saisie des résultats'!V16+'Saisie des résultats'!T9+'Saisie des résultats'!T14+'Saisie des résultats'!T20","v":0},0,null,{"$f":"IF('Saisie des équipes'!I6=\"\",\"\",'Saisie des équipes'!I6)","v":""},{"$f":"'Saisie des résultats'!AN12+'Saisie des résultats'!AN16+'Saisie des résultats'!AP9+'Saisie des résultats'!AP14+'Saisie des résultats'!AP20","v":0},{"$f":"'Saisie des résultats'!AH12+'Saisie des résultats'!AH16+'Saisie des résultats'!AJ9+'Saisie des résultats'!AJ14+'Saisie des résultats'!AJ20","v":0},{"$f":"'Saisie des résultats'!AJ12+'Saisie des résultats'!AJ16+'Saisie des résultats'!AH9+'Saisie des résultats'!AH14+'Saisie des résultats'!AH20","v":0},0]
[null,{"$f":"IF('Saisie des équipes'!C7=\"\",\"\",'Saisie des équipes'!C7)","v":""},{"$f":"'Saisie des résultats'!L19+'Saisie des résultats'!N8+'Saisie des résultats'!N15+'Saisie des résultats'!N17+'Saisie des résultats'!N12","v":0},{"$f":"'Saisie des résultats'!F19+'Saisie des résultats'!H8+'Saisie des résultats'!H12+'Saisie des résultats'!H15+'Saisie des résultats'!H17","v":0},{"$f":"'Saisie des résultats'!H19+'Saisie des résultats'!F8+'Saisie des résultats'!F12+'Saisie des résultats'!F15+'Saisie des résultats'!F17","v":0},0,null,{"$f":"IF('Saisie des équipes'!F7=\"\",\"\",'Saisie des équipes'!F7)","v":""},{"$f":"'Saisie des résultats'!Z19+'Saisie des résultats'!AB8+'Saisie des résultats'!AB15+'Saisie des résultats'!AB17+'Saisie des résultats'!AB12","v":0},{"$f":"'Saisie des résultats'!T19+'Saisie des résultats'!V8+'Saisie des résultats'!V12+'Saisie des résultats'!V15+'Saisie des résultats'!V17","v":0},{"$f":"'Saisie des résultats'!V19+'Saisie des résultats'!T8+'Saisie des résultats'!T12+'Saisie des résultats'!T15+'Saisie des résultats'!T17","v":0},0,null,{"$f":"IF('Saisie des équipes'!I7=\"\",\"\",'Saisie des équipes'!I7)","v":""},{"$f":"'Saisie des résultats'!AN19+'Saisie des résultats'!AP8+'Saisie des résultats'!AP15+'Saisie des résultats'!AP17+'Saisie des résultats'!AP12","v":0},{"$f":"'Saisie des résultats'!AH19+'Saisie des résultats'!AJ8+'Saisie des résultats'!AJ12+'Saisie des résultats'!AJ15+'Saisie des résultats'!AJ17","v":0},{"$f":"'Saisie des résultats'!AH8+'Saisie des résultats'!AH12+'Saisie des résultats'!AH15+'Saisie des résultats'!AH17+'Saisie des résultats'!AJ19","v":0},0]
[null,{"$f":"IF('Saisie des équipes'!C8=\"\",\"\",'Saisie des équipes'!C8)","v":""},{"$f":"'Saisie des résultats'!N7+'Saisie des résultats'!N10+'Saisie des résultats'!N13+'Saisie des résultats'!N16+'Saisie des résultats'!N19","v":0},{"$f":"'Saisie des résultats'!H7+'Saisie des résultats'!H10+'Saisie des résultats'!H13+'Saisie des résultats'!H16+'Saisie des résultats'!H19","v":0},{"$f":"'Saisie des résultats'!F7+'Saisie des résultats'!F10+'Saisie des résultats'!F13+'Saisie des résultats'!F16+'Saisie des résultats'!F19","v":0},0,null,{"$f":"IF('Saisie des équipes'!F8=\"\",\"\",'Saisie des équipes'!F8)","v":""},{"$f":"'Saisie des résultats'!AB7+'Saisie des résultats'!AB10+'Saisie des résultats'!AB13+'Saisie des résultats'!AB16+'Saisie des résultats'!AB19","v":0},{"$f":"'Saisie des résultats'!V7+'Saisie des résultats'!V10+'Saisie des résultats'!V13+'Saisie des résultats'!V16+'Saisie des résultats'!V19","v":0},{"$f":"'Saisie des résultats'!T7+'Saisie des résultats'!T10+'Saisie des résultats'!T13+'Saisie des résultats'!T16+'Saisie des résultats'!T19","v":0},0,null,{"$f":"IF('Saisie des équipes'!I8=\"\",\"\",'Saisie des équipes'!I8)","v":""},{"$f":"'Saisie des résultats'!AP7+'Saisie des résultats'!AP10+'Saisie des résultats'!AP13+'Saisie des résultats'!AP16+'Saisie des résultats'!AP19","v":0},{"$f":"'Saisie des résultats'!AJ7+'Saisie des résultats'!AJ10+'Saisie des résultats'!AJ13+'Saisie des résultats'!AJ16+'Saisie des résultats'!AJ19","v":0},{"$f":"'Saisie des résultats'!AH7+'Saisie des résultats'!AH10+'Saisie des résultats'!AH13+'Saisie des résultats'!AH16+'Saisie des résultats'!AH19","v":0},0]

{"sheet":"Résultats classés","index":3,"n_rows":9,"n_cols":20,"rows_kept":9,"cut":false,"hidden":false,"merged":[[1,15,1,16],[1,17,1,19],[1,1,1,2],[1,3,1,5],[1,8,1,9],[1,10,1,12]]}
[]
[null,"Classement",null,"Poule A",null,null,null,null,"Classement",null,"Poule B",null,null,null,null,"Classement",null,"Poule C"]
[null,"Equipe","Points","Buts marqués","Buts encaissés","Différence de buts",null,null,"Equipe","Points","Buts marqués","Buts encaissés","Différence de buts",null,null,"Equipe","Points","Buts marqués","Buts encaissés","Différence de buts"]
["1er",null,null,null,null,null,null,"1er",null,null,null,null,null,null,"1er"]
["2ème",null,null,null,null,null,null,"2ème",null,null,null,null,null,null,"2ème"]
["3ème",null,null,null,null,null,null,"3ème",null,null,null,null,null,null,"3ème"]
["4ème",null,null,null,null,null,null,"4ème",null,null,null,null,null,null,"4ème"]
["5ème",null,null,null,null,null,null,"5ème",null,null,null,null,null,null,"5ème"]
["6ème ",null,null,null,null,null,null,"6ème ",null,null,null,null,null,null,"6ème "]

{"sheet":"Phases Finales (1&2)","index":4,"n_rows":31,"n_cols":14,"rows_kept":31,"cut":false,"hidden":false,"merged":[[14,12,15,12],[28,12,29,12],[21,12,22,12],[18,4,19,4],[26,4,27,4],[22,8,23,8],[30,8,31,8],[26,8,27,8],[2,4,3,4],[10,4,11,4],[6,8,7,8]]}
["1er poule A","Score"]
[{"$f":"IF('Résultats classés'!B4=\"\",\"\",'Résultats classés'!B4)","v":""}]
[null,null,null,null,{"$f":"IF(OR(B2>$B$6,A6=\"\"), A2, IF(OR(B2<$B$6,A2=\"\"), A6, \"\"))","v":0},"Score"]
[]
["Meilleur 3ème (1)","Score"]
[{"$f":"'Saisie des équipes'!C5","v":0}]
[null,null,null,null,null,null,null,null,{"$f":"IF(OR(F4>$F$12,E11=\"\"), E3, IF(OR(F4<$F$12,E3=\"\"), E11, \"\"))","v":0},"Score"]
[]
["1er poule C","Score"]
[{"$f":"IF('Résultats classés'!P4=\"\",\"\",'Résultats classés'!P4)","v":""}]
[null,null,null,null,{"$f":"IF(OR(B10<$B$14,A10=\"\"), A14,IF(OR(B10>$B$14,A14=\"\"), A10, \"\"))","v":""},"Score"]
[]
["2ème poule B","Score"]
[{"$f":"IF('Résultats classés'!I5=\"\",\"\",'Résultats classés'!I5)","v":""}]
[null,null,null,null,null,null,null,null,null,null,null,null,{"$f":"IF(OR(J8>$J$24,I23=\"\"), I7, IF(OR(J8<$J$24,I7=\"\"), I23, \"\"))","v":""},"Place"]
[null,null,null,null,null,null,null,null,null,null,null,null,null,"1er"]
["2ème poule A","Score"]
[{"$f":"IF('Résultats classés'!B5=\"\",\"\",'Résultats classés'!B5)","v":""}]
[null,null,null,null,{"$f":"IF(OR(B18>$B$22,A22=\"\"), A18, IF(OR(B18<$B$22,A18=\"\"), A22, \"\"))","v":""},"Score"]
[]
["2ème poule C","Score"]
[{"$f":"IF('Résultats classés'!P5=\"\",\"\",'Résultats classés'!P5)","v":""},null,null,null,null,null,null,null,null,null,null,null,{"$f":"IF(OR(J8>$J$24,I23=\"\"), I23, IF(OR(J8<$J$24,I7=\"\"), I7, \"\"))","v":""},"Place"]
[null,null,null,null,null,null,null,null,{"$f":"IF(OR(F20>$F$28,E27=\"\"), E19, IF(OR(F20<$F$28,E19=\"\"), E27, \"\"))","v":0},"Score",null,null,null,"2ème"]
[]
["Meilleur 3ème (2)","Score"]
[{"$f":"'Saisie des équipes'!F7","v":0}]
[null,null,null,null,{"$f":"IF(OR(B26<$B$30,A26=\"\"), A30, IF(OR(B26>$B$30,A30=\"\"), A26, \"\"))","v":0},"Score",null,null,{"$f":"IF(OR(F4>$F$12,E11=\"\"), E11, IF(OR(F4<$F$12,E3=\"\"), E3, \"\"))","v":""},"Score"]
[]
["1er poule B","Score",null,null,null,null,null,null,null,null,null,null,{"$f":"IF(OR(J28>$J$32,I31=\"\"), I27, IF(OR(J28<$J$32,I27=\"\"), I31, \"\"))","v":""},"Place"]
[{"$f":"IF('Résultats classés'!I4=\"\",\"\",'Résultats classés'!I4)","v":""},null,null,null,null,null,null,null,null,null,null,null,null,"3ème"]
[null,null,null,null,null,null,null,null,{"$f":"IF(OR(F20>$F$28,E27=\"\"), E27, IF(OR(F20<$F$28,E19=\"\"), E19, \"\"))","v":""},"Score"]

{"sheet":"Planning","index":5,"n_rows":40,"n_cols":11,"rows_kept":40,"cut":false,"hidden":false,"merged":[[36,1,37,1],[36,2,37,2],[36,5,37,5],[36,6,37,6],[34,9,35,9],[34,10,35,10],[36,9,37,9],[36,10,37,10],[38,2,39,2],[38,5,39,5],[38,6,39,6],[38,9,39,9],[38,10,39,10],[38,1,39,1],[32,9,33,9],[32,10,33,10],[32,1,33,1],[32,2,33,2],[34,1,35,1],[34,2,35,2],[34,5,35,5],[34,6,35,6],[32,5,33,5],[32,6,33,6],[30,5,31,5],[30,6,31,6],[28,1,29,1],[28,2,29,2],[28,5,29,5],[28,6,29,6],[28,9,29,9],[28,10,29,10],[30,9,31,9],[30,10,31,10],[30,1,31,1],[30,2,31,2],[20,9,21,9],[20,10,21,10],[22,9,23,9],[22,10,23,10],[24,9,25,9],[24,10,25,10],[26,9,27,9],[26,10,27,10],[24,1,25,1],[24,2,25,2],[26,1,27,1],[26,2,27,2],[26,5,27,5],[26,6,27,6],[24,5,25,5],[24,6,25,6],[22,1,23,1],[22,2,23,2],[22,5,23,5],[22,6,23,6],[20,1,21,1],[20,2,21,2],[20,5,21,5],[20,6,21,6],[18,9,19,9],[18,10,19,10],[16,1,17,1],[16,2,17,2],[18,1,19,1],[18,2,19,2],[18,5,19,5],[18,6,19,6],[16,5,17,5],[16,6,17,6],[10,9,11,9],[10,10,11,10],[8,1,9,1],[8,2,9,2],[16,9,17,9],[16,10,17,10],[12,6,13,6],[14,1,15,1],[14,2,15,2],[14,5,15,5],[14,6,15,6],[12,9,13,9],[12,10,13,10],[14,9,15,9],[14,10,15,10],[3,9,3,10],[6,1,7,1],[6,2,7,2],[6,5,7,5],[6,6,7,6],[6,9,7,9],[6,10,7,10],[8,9,9,9],[8,10,9,10],[0,1,0,2],[0,5,0,6],[3,1,3,2],[3,5,3,6],[8,5,9,5],[8,6,9,6],[12,1,13,1],[12,2,13,2],[12,5,13,5],[10,1,11,1],[10,2,11,2],[10,5,11,5],[10,6,11,6]]}
[null,"Durée des matchs",null,null,null,"Durée des pauses"]
[null,10,"minutes",null,null,5,"minutes"]
[]
["DEBUT des","TV 1",null,null,null,"TV 2",null,null,null,"TV 3"]
["MATCHS","Matchs","Arbitres",null,null,"Matchs","Arbitres",null,null,"Matchs","Arbitres"]
[]
["19:30:00","Match 1",null,null,{"$f":"A7","v":"19:30:00"},null,null,null,{"$f":"E7","v":"19:30:00"}]
[{"$f":"IF(ISTEXT($B$2),\"\",(A7+(B2*0.0006944444)))","v":"19:40:00"},null,null,null,{"$f":"A8","v":"19:40:00"},null,null,null,{"$f":"E8","v":"19:40:00"}]
[{"$f":"A8+(F2*0.0006944444)","v":"19:45:00"},"Match 2",null,null,{"$f":"A9","v":"19:45:00"},null,null,null,{"$f":"E9","v":"19:45:00"}]
[{"$f":"IF(ISTEXT($B$2),\"\",(A9+($B$2*0.0006944444)))","v":"19:55:00"},null,null,null,"19:55:00",null,null,null,"19:55:00"]
[{"$f":"A10+($F$2*0.0006944444)","v":"20:00:00"},"Match 3",null,null,"20:00:00",null,null,null,"20:00:00"]
[{"$f":"IF(ISTEXT($B$2),\"\",(A11+($B$2*0.0006944444)))","v":"20:10:00"},null,null,null,"20:10:00",null,null,null,"20:10:00"]
[{"$f":"A12+($F$2*0.0006944444)","v":"20:15:00"},"Match 4",null,null,"20:15:00",null,null,null,"20:15:00"]
[{"$f":"IF(ISTEXT($B$2),\"\",(A13+($B$2*0.0006944444)))","v":"20:25:00"},null,null,null,"20:25:00",null,null,null,"20:25:00"]
[{"$f":"A14+($F$2*0.0006944444)","v":"20:30:00"},"Match 5",null,null,"20:30:00",null,null,null,"20:30:00"]
[{"$f":"IF(ISTEXT($B$2),\"\",(A15+($B$2*0.0006944444)))","v":"20:40:00"},null,null,null,"20:40:00",null,null,null,"20:40:00"]
[{"$f":"A16+($F$2*0.0006944444)","v":"20:45:00"},"Match 6",null,null,"20:45:00",null,null,null,"20:45:00"]
[{"$f":"IF(ISTEXT($B$2),\"\",(A17+($B$2*0.0006944444)))","v":"20:55:00"},null,null,null,"20:55:00",null,null,null,"20:55:00"]
[{"$f":"A18+($F$2*0.0006944444)","v":"21:00:00"},"Match 7",null,null,"21:00:00",null,null,null,"21:00:00"]
[{"$f":"IF(ISTEXT($B$2),\"\",(A19+($B$2*0.0006944444)))","v":"21:10:00"},null,null,null,"21:10:00",null,null,null,"21:10:00"]
[{"$f":"A20+($F$2*0.0006944444)","v":"21:15:00"},"Match 8",null,null,"21:15:00",null,null,null,"21:15:00"]
[{"$f":"IF(ISTEXT($B$2),\"\",(A21+($B$2*0.0006944444)))","v":"21:25:00"},null,null,null,"21:25:00",null,null,null,"21:25:00"]
[{"$f":"A22+($F$2*0.0006944444)","v":"21:30:00"},"Match 9",null,null,"21:30:00",null,null,null,"21:30:00"]
[{"$f":"IF(ISTEXT($B$2),\"\",(A23+($B$2*0.0006944444)))","v":"21:40:00"},null,null,null,"21:40:00",null,null,null,"21:40:00"]
[{"$f":"A24+($F$2*0.0006944444)","v":"21:44:59.999"},"Match 10",null,null,"21:44:59.999",null,null,null,"21:44:59.999"]
[{"$f":"IF(ISTEXT($B$2),\"\",(A25+($B$2*0.0006944444)))","v":"21:54:59.999"},null,null,null,"21:54:59.999",null,null,null,"21:54:59.999"]
[{"$f":"A26+($F$2*0.0006944444)","v":"21:59:59.999"},"Match 11",null,null,"21:59:59.999",null,null,null,"21:59:59.999"]
[{"$f":"IF(ISTEXT($B$2),\"\",(A27+($B$2*0.0006944444)))","v":"22:09:59.999"},null,null,null,"22:09:59.999",null,null,null,"22:09:59.999"]
[{"$f":"A28+($F$2*0.0006944444)","v":"22:14:59.999"},"Match 12",null,null,"22:14:59.999",null,null,null,"22:14:59.999"]
[{"$f":"IF(ISTEXT($B$2),\"\",(A29+($B$2*0.0006944444)))","v":"22:24:59.999"},null,null,null,"22:24:59.999",null,null,null,"22:24:59.999"]
[{"$f":"A30+($F$2*0.0006944444)","v":"22:29:59.999"},"Match 13",null,null,"22:29:59.999",null,null,null,"22:29:59.999"]
[{"$f":"IF(ISTEXT($B$2),\"\",(A31+($B$2*0.0006944444)))","v":"22:39:59.999"},null,null,null,"22:39:59.999",null,null,null,"22:39:59.999"]
[{"$f":"A32+($F$2*0.0006944444)","v":"22:44:59.999"},"Match 14",null,null,"22:44:59.999",null,null,null,"22:44:59.999"]
[{"$f":"IF(ISTEXT($B$2),\"\",(A33+($B$2*0.0006944444)))","v":"22:54:59.999"},null,null,null,"22:54:59.999",null,null,null,"22:54:59.999"]
[{"$f":"A34+($F$2*0.0006944444)","v":"22:59:59.999"},"Match 15",null,null,"22:59:59.999",null,null,null,"22:59:59.999"]
[{"$f":"IF(ISTEXT($B$2),\"\",(A35+($B$2*0.0006944444)))","v":"23:09:59.999"},null,null,null,"23:09:59.999",null,null,null,"23:09:59.999"]
[{"$f":"A36+($F$2*0.0006944444)","v":"23:14:59.999"},"Match 16",null,null,"23:14:59.999",null,null,null,"23:14:59.999"]
[{"$f":"IF(ISTEXT($B$2),\"\",(A37+($B$2*0.0006944444)))","v":"23:24:59.999"},null,null,null,"23:24:59.999",null,null,null,"23:24:59.999"]
[{"$f":"A38+($F$2*0.0006944444)","v":"23:29:59.999"},"Match 17",null,null,"23:29:59.999",null,null,null,"23:29:59.999"]
[{"$f":"IF(ISTEXT($B$2),\"\",(A39+($B$2*0.0006944444)))","v":"23:39:59.999"},null,null,null,"23:39:59.999",null,null,null,"23:39:59.999"]