{"text_format":"1","workbook":"xlsx","n_sheets":6,"sheets":["Résumé","Équipes","Collection","Recherche","Glossaire","Base de données"],"not_rendered":{"charts":0,"images":139,"macros":1,"external_links":0,"defined_names":14,"comments":0,"pivot_tables":0},"unopened":[],"bounds":{"document_bytes":16777216,"sheet_cells":100000,"rows_first":2000,"rows_last":500,"rows_between":2000,"halvings":0,"cell_chars":16384,"cell_head_chars":4096},"cells_cut":0,"cells_raw":0,"read":"whole","date_system":"1900"}

{"sheet":"Résumé","index":0,"n_rows":15,"n_cols":4,"rows_kept":15,"cut":false,"hidden":false,"merged":[[1,1,1,3]]}
[]
[null,"Ma Collection - Résumé"]
[]
[null,"Quantité de figurines :",{"$f":"COUNTIFS(Collection!F:F,\"<>\"&\"Token\",Collection!G:G,\"<>\"&\"\")-1","v":0},{"$f":"\"/ \"&COUNTIFS(Collection!F:F,\"<>\"&\"Token\",Collection!F:F,\"<>\"&\"\")-2","v":"/ 110"}]
[null,"Quantité de tokens :",{"$f":"COUNTIFS(Collection!F:F,\"Token\",Collection!G:G,\"<>\"&\"\")","v":0},{"$f":"\"/ \"&COUNTIFS(Collection!F:F,\"Token\",Collection!F:F,\"<>\"&\"\")","v":"/ 28"}]
[]
[null,"Figurines"]
[null,"Saison 1 :",{"$f":"COUNTIFS(Collection!F:F,\"<>\"&\"Token\",Collection!G:G,\"<>\"&\"\",Collection!E:E,\"Saison 1\")","v":0},{"$f":"\"/ \"&COUNTIFS(Collection!F:F,\"<>\"&\"Token\",Collection!E:E,\"Saison 1\")","v":"/ 53"}]
[null,"Saison 2 :",{"$f":"COUNTIFS(Collection!F:F,\"<>\"&\"Token\",Collection!G:G,\"<>\"&\"\",Collection!E:E,\"Saison 2\")","v":0},{"$f":"\"/ \"&COUNTIFS(Collection!F:F,\"<>\"&\"Token\",Collection!E:E,\"Saison 2\")","v":"/ 49"}]
[null,"Saison 3 :",{"$f":"COUNTIFS(Collection!F:F,\"<>\"&\"Token\",Collection!G:G,\"<>\"&\"\",Collection!E:E,\"Saison 3\")","v":0},{"$f":"\"/ \"&COUNTIFS(Collection!F:F,\"<>\"&\"Token\",Collection!E:E,\"Saison 3\")","v":"/ 8"}]
[]
[null,"Tokens"]
[null,"Saison 1 :",{"$f":"COUNTIFS(Collection!F:F,\"Token\",Collection!G:G,\"<>\"&\"\",Collection!E:E,\"Saison 1\")","v":0},{"$f":"\"/ \"&COUNTIFS(Collection!F:F,\"Token\",Collection!E:E,\"Saison 1\")","v":"/ 17"}]
[null,"Saison 2 :",{"$f":"COUNTIFS(Collection!F:F,\"Token\",Collection!G:G,\"<>\"&\"\",Collection!E:E,\"Saison 2\")","v":0},{"$f":"\"/ \"&COUNTIFS(Collection!F:F,\"Token\",Collection!E:E,\"Saison 2\")","v":"/ 11"}]
[null,"Saison 3 :",{"$f":"COUNTIFS(Collection!F:F,\"Token\",Collection!G:G,\"<>\"&\"\",Collection!E:E,\"Saison 3\")","v":0},{"$f":"\"/ \"&COUNTIFS(Collection!F:F,\"Token\",Collection!E:E,\"Saison 3\")","v":"/ 0"}]
{"$rows_left_out":1}
{"sheet":"Équipes","index":1,"n_rows":53,"n_cols":19,"rows_kept":53,"cut":false,"hidden":false,"merged":[[42,1,42,9],[52,5,52,9],[39,5,39,9],[0,1,1,9],[3,1,3,9],[16,1,16,9],[29,1,29,9],[13,5,13,9],[26,5,26,9]]}
[null,"Création d'équipes"]
[]
[]
[null,"Équipe 1"]
[null,"Nom","Classe","Niveau","Initiative","PM","PV","PA","Pouvoirs","Rareté",null,"Quantité","Commune","Rare","Spéciale","Boss","Doublons","Bannies","Bandits"]
[null,null,{"$f":"IF(B6=\"\",\"\",(VLOOKUP(B6,'Base de données'!$B$1:$AV$2000,2,FALSE)))","v":""},{"$f":"IF(B6=\"\",\"\",(VLOOKUP(B6,'Base de données'!$B$1:$AV$2000,3,FALSE)))","v":""},{"$f":"IF(B6=\"\",\"\",(VLOOKUP(B6,'Base de données'!$B$1:$AV$2000,4,FALSE)))","v":""},{"$f":"IF(B6=\"\",\"\",(VLOOKUP(B6,'Base de données'!$B$1:$AV$2000,5,FALSE)))","v":""},{"$f":"IF(B6=\"\",\"\",(VLOOKUP(B6,'Base de données'!$B$1:$AV$2000,6,FALSE)))","v":""},{"$f":"IF(B6=\"\",\"\",(VLOOKUP(B6,'Base de données'!$B$1:$AV$2000,7,FALSE)))","v":""},{"$f":"IF(B6=\"\",\"\",(VLOOKUP(B6,'Base de données'!$B$1:$AV$2000,44,FALSE)))","v":""},{"$f":"IF(B6=\"\",\"\",(VLOOKUP(B6,'Base de données'!$B$1:$AV$2000,47,FALSE)))","v":""},null,{"$f":"COUNTIFS($B$6:$B$13,B6,$J$6:$J$13,J6)","v":0},{"$f":"IF(AND($J$6=\"Commune\",$L$6>2),\"Erreur\",\"Ok\")","v":"Ok"},{"$f":"IF(AND($J$6=\"Rare\",$L$6>1),\"Erreur\",\"Ok\")","v":"Ok"},{"$f":"IF(AND($J$6=\"Spéciale\",$L$6>3),\"Erreur\",\"Ok\")","v":"Ok"},{"$f":"IF(COUNTIF(C6,\"*Boss*\")>0,\"Boss\",\"Ok\")","v":"Ok"},{"$f":"IF(COUNTIF(B6:B13,\"*Adamaï*\")>1,\"Trop de Adamaï\",\"Ok\")","v":"Ok"},{"$f":"IF(COUNTIF(B6:B13,\"*Liane Zolie*\")>0,\"Liane Zolie Bannie\",\"Ok\")","v":"Ok"},{"$f":"IF(COUNTIF(C6:C13,\"*bandit*\")>4,\"Ok\",\"Pas assez\")","v":"Pas assez"}]
[null,null,{"$f":"IF(B7=\"\",\"\",(VLOOKUP(B7,'Base de données'!$B$1:$AV$2000,2,FALSE)))","v":""},{"$f":"IF(B7=\"\",\"\",(VLOOKUP(B7,'Base de données'!$B$1:$AV$2000,3,FALSE)))","v":""},{"$f":"IF(B7=\"\",\"\",(VLOOKUP(B7,'Base de données'!$B$1:$AV$2000,4,FALSE)))","v":""},{"$f":"IF(B7=\"\",\"\",(VLOOKUP(B7,'Base de données'!$B$1:$AV$2000,5,FALSE)))","v":""},{"$f":"IF(B7=\"\",\"\",(VLOOKUP(B7,'Base de données'!$B$1:$AV$2000,6,FALSE)))","v":""},{"$f":"IF(B7=\"\",\"\",(VLOOKUP(B7,'Base de données'!$B$1:$AV$2000,7,FALSE)))","v":""},{"$f":"IF(B7=\"\",\"\",(VLOOKUP(B7,'Base de données'!$B$1:$AV$2000,44,FALSE)))","v":""},{"$f":"IF(B7=\"\",\"\",(VLOOKUP(B7,'Base de données'!$B$1:$AV$2000,47,FALSE)))","v":""},null,0,{"$f":"IF(AND($J$7=\"Commune\",$L$7>2),\"Erreur\",\"Ok\")","v":"Ok"},{"$f":"IF(AND($J$7=\"Rare\",$L$7>1),\"Erreur\",\"Ok\")","v":"Ok"},{"$f":"IF(AND($J$7=\"Spéciale\",$L$7>3),\"Erreur\",\"Ok\")","v":"Ok"},{"$f":"IF(COUNTIF(C7,\"*Boss*\")>0,\"Boss\",\"Ok\")","v":"Ok"},{"$f":"IF(COUNTIF(B6:B13,\"*Yugo*\")>1,\"Trop de Yugo\",\"Ok\")","v":"Ok"},{"$f":"IF(COUNTIF(B6:B13,\"*Terminatot Gaulde*\")>0,\"Terminatot Gaulde Bannie\",\"Ok\")","v":"Ok"},{"$f":"IF(SUM(D6:D13)>14,\"Trop haut\",\"Ok\")","v":"Ok"}]
[null,null,{"$f":"IF(B8=\"\",\"\",(VLOOKUP(B8,'Base de données'!$B$1:$AV$2000,2,FALSE)))","v":""},{"$f":"IF(B8=\"\",\"\",(VLOOKUP(B8,'Base de données'!$B$1:$AV$2000,3,FALSE)))","v":""},{"$f":"IF(B8=\"\",\"\",(VLOOKUP(B8,'Base de données'!$B$1:$AV$2000,4,FALSE)))","v":""},{"$f":"IF(B8=\"\",\"\",(VLOOKUP(B8,'Base de données'!$B$1:$AV$2000,5,FALSE)))","v":""},{"$f":"IF(B8=\"\",\"\",(VLOOKUP(B8,'Base de données'!$B$1:$AV$2000,6,FALSE)))","v":""},{"$f":"IF(B8=\"\",\"\",(VLOOKUP(B8,'Base de données'!$B$1:$AV$2000,7,FALSE)))","v":""},{"$f":"IF(B8=\"\",\"\",(VLOOKUP(B8,'Base de données'!$B$1:$AV$2000,44,FALSE)))","v":""},{"$f":"IF(B8=\"\",\"\",(VLOOKUP(B8,'Base de données'!$B$1:$AV$2000,47,FALSE)))","v":""},null,0,{"$f":"IF(AND($J$8=\"Commune\",$L$8>2),\"Erreur\",\"Ok\")","v":"Ok"},{"$f":"IF(AND($J$8=\"Rare\",$L$8>1),\"Erreur\",\"Ok\")","v":"Ok"},{"$f":"IF(AND($J$8=\"Spéciale\",$L$8>3),\"Erreur\",\"Ok\")","v":"Ok"},"Ok",{"$f":"IF(COUNTIF(B6:B13,\"*Tristepin*\")>1,\"Trop de Tristepin\",\"Ok\")","v":"Ok"},null,{"$f":"IF(SUMIF(C6:C13,\"bandit\",D6:D13)<12,\"Pas assez\",\"Ok\")","v":"Pas assez"}]
[null,null,{"$f":"IF(B9=\"\",\"\",(VLOOKUP(B9,'Base de données'!$B$1:$AV$2000,2,FALSE)))","v":""},{"$f":"IF(B9=\"\",\"\",(VLOOKUP(B9,'Base de données'!$B$1:$AV$2000,3,FALSE)))","v":""},{"$f":"IF(B9=\"\",\"\",(VLOOKUP(B9,'Base de données'!$B$1:$AV$2000,4,FALSE)))","v":""},{"$f":"IF(B9=\"\",\"\",(VLOOKUP(B9,'Base de données'!$B$1:$AV$2000,5,FALSE)))","v":""},{"$f":"IF(B9=\"\",\"\",(VLOOKUP(B9,'Base de données'!$B$1:$AV$2000,6,FALSE)))","v":""},{"$f":"IF(B9=\"\",\"\",(VLOOKUP(B9,'Base de données'!$B$1:$AV$2000,7,FALSE)))","v":""},{"$f":"IF(B9=\"\",\"\",(VLOOKUP(B9,'Base de données'!$B$1:$AV$2000,44,FALSE)))","v":""},{"$f":"IF(B9=\"\",\"\",(VLOOKUP(B9,'Base de données'!$B$1:$AV$2000,47,FALSE)))","v":""},null,0,{"$f":"IF(AND($J$9=\"Commune\",$L$9>2),\"Erreur\",\"Ok\")","v":"Ok"},{"$f":"IF(AND($J$9=\"Rare\",$L$9>1),\"Erreur\",\"Ok\")","v":"Ok"},{"$f":"IF(AND($J$9=\"Spéciale\",$L$9>3),\"Erreur\",\"Ok\")","v":"Ok"},"Ok",{"$f":"IF(COUNTIF(B6:B13,\"*Qilby*\")>1,\"Trop de Qilby\",\"Ok\")","v":"Ok"},null,{"$f":"IF(COUNTIF(B6:B13,\"Riktus Elite\")<1,\"Sans Élite\",\"Ok\")","v":"Sans Élite"}]
[null,null,{"$f":"IF(B10=\"\",\"\",(VLOOKUP(B10,'Base de données'!$B$1:$AV$2000,2,FALSE)))","v":""},{"$f":"IF(B10=\"\",\"\",(VLOOKUP(B10,'Base de données'!$B$1:$AV$2000,3,FALSE)))","v":""},{"$f":"IF(B10=\"\",\"\",(VLOOKUP(B10,'Base de données'!$B$1:$AV$2000,4,FALSE)))","v":""},{"$f":"IF(B10=\"\",\"\",(VLOOKUP(B10,'Base de données'!$B$1:$AV$2000,5,FALSE)))","v":""},{"$f":"IF(B10=\"\",\"\",(VLOOKUP(B10,'Base de données'!$B$1:$AV$2000,6,FALSE)))","v":""},{"$f":"IF(B10=\"\",\"\",(VLOOKUP(B10,'Base de données'!$B$1:$AV$2000,7,FALSE)))","v":""},{"$f":"IF(B10=\"\",\"\",(VLOOKUP(B10,'Base de données'!$B$1:$AV$2000,44,FALSE)))","v":""},{"$f":"IF(B10=\"\",\"\",(VLOOKUP(B10,'Base de données'!$B$1:$AV$2000,47,FALSE)))","v":""},null,0,{"$f":"IF(AND($J$10=\"Commune\",$L$10>2),\"Erreur\",\"Ok\")","v":"Ok"},{"$f":"IF(AND($J$10=\"Rare\",$L$10>1),\"Erreur\",\"Ok\")","v":"Ok"},{"$f":"IF(AND($J$10=\"Spéciale\",$L$10>3),\"Erreur\",\"Ok\")","v":"Ok"},"Ok"]
[null,null,{"$f":"IF(B11=\"\",\"\",(VLOOKUP(B11,'Base de données'!$B$1:$AV$2000,2,FALSE)))","v":""},{"$f":"IF(B11=\"\",\"\",(VLOOKUP(B11,'Base de données'!$B$1:$AV$2000,3,FALSE)))","v":""},{"$f":"IF(B11=\"\",\"\",(VLOOKUP(B11,'Base de données'!$B$1:$AV$2000,4,FALSE)))","v":""},{"$f":"IF(B11=\"\",\"\",(VLOOKUP(B11,'Base de données'!$B$1:$AV$2000,5,FALSE)))","v":""},{"$f":"IF(B11=\"\",\"\",(VLOOKUP(B11,'Base de données'!$B$1:$AV$2000,6,FALSE)))","v":""},{"$f":"IF(B11=\"\",\"\",(VLOOKUP(B11,'Base de données'!$B$1:$AV$2000,7,FALSE)))","v":""},{"$f":"IF(B11=\"\",\"\",(VLOOKUP(B11,'Base de données'!$B$1:$AV$2000,44,FALSE)))","v":""},{"$f":"IF(B11=\"\",\"\",(VLOOKUP(B11,'Base de données'!$B$1:$AV$2000,47,FALSE)))","v":""},null,0,{"$f":"IF(AND($J$11=\"Commune\",$L$11>2),\"Erreur\",\"Ok\")","v":"Ok"},{"$f":"IF(AND($J$11=\"Rare\",$L$11>1),\"Erreur\",\"Ok\")","v":"Ok"},{"$f":"IF(AND($J$11=\"Spéciale\",$L$11>3),\"Erreur\",\"Ok\")","v":"Ok"},"Ok"]
[null,null,{"$f":"IF(B12=\"\",\"\",(VLOOKUP(B12,'Base de données'!$B$1:$AV$2000,2,FALSE)))","v":""},{"$f":"IF(B12=\"\",\"\",(VLOOKUP(B12,'Base de données'!$B$1:$AV$2000,3,FALSE)))","v":""},{"$f":"IF(B12=\"\",\"\",(VLOOKUP(B12,'Base de données'!$B$1:$AV$2000,4,FALSE)))","v":""},{"$f":"IF(B12=\"\",\"\",(VLOOKUP(B12,'Base de données'!$B$1:$AV$2000,5,FALSE)))","v":""},{"$f":"IF(B12=\"\",\"\",(VLOOKUP(B12,'Base de données'!$B$1:$AV$2000,6,FALSE)))","v":""},{"$f":"IF(B12=\"\",\"\",(VLOOKUP(B12,'Base de données'!$B$1:$AV$2000,7,FALSE)))","v":""},{"$f":"IF(B12=\"\",\"\",(VLOOKUP(B12,'Base de données'!$B$1:$AV$2000,44,FALSE)))","v":""},{"$f":"IF(B12=\"\",\"\",(VLOOKUP(B12,'Base de données'!$B$1:$AV$2000,47,FALSE)))","v":""},null,0,{"$f":"IF(AND($J$12=\"Commune\",$L$12>2),\"Erreur\",\"Ok\")","v":"Ok"},{"$f":"IF(AND($J$12=\"Rare\",$L$12>1),\"Erreur\",\"Ok\")","v":"Ok"},{"$f":"IF(AND($J$12=\"Spéciale\",$L$12>3),\"Erreur\",\"Ok\")","v":"Ok"},"Ok"]
[null,null,{"$f":"IF(B13=\"\",\"\",(VLOOKUP(B13,'Base de données'!$B$1:$AV$2000,2,FALSE)))","v":""},{"$f":"IF(B13=\"\",\"\",(VLOOKUP(B13,'Base de données'!$B$1:$AV$2000,3,FALSE)))","v":""},{"$f":"IF(B13=\"\",\"\",(VLOOKUP(B13,'Base de données'!$B$1:$AV$2000,4,FALSE)))","v":""},{"$f":"IF(B13=\"\",\"\",(VLOOKUP(B13,'Base de données'!$B$1:$AV$2000,5,FALSE)))","v":""},{"$f":"IF(B13=\"\",\"\",(VLOOKUP(B13,'Base de données'!$B$1:$AV$2000,6,FALSE)))","v":""},{"$f":"IF(B13=\"\",\"\",(VLOOKUP(B13,'Base de données'!$B$1:$AV$2000,7,FALSE)))","v":""},{"$f":"IF(B13=\"\",\"\",(VLOOKUP(B13,'Base de données'!$B$1:$AV$2000,44,FALSE)))","v":""},{"$f":"IF(B13=\"\",\"\",(VLOOKUP(B13,'Base de données'!$B$1:$AV$2000,47,FALSE)))","v":""},null,0,{"$f":"IF(AND($J$13=\"Commune\",$L$13>2),\"Erreur\",\"Ok\")","v":"Ok"},{"$f":"IF(AND($J$13=\"Rare\",$L$13>1),\"Erreur\",\"Ok\")","v":"Ok"},{"$f":"IF(AND($J$13=\"Spéciale\",$L$13>3),\"Erreur\",\"Ok\")","v":"Ok"},"Ok"]
[null,null,null,{"$f":"SUM(D6:D13)&\"/12\"","v":"0/12"},{"$f":"IF(S14=\"Exception001\",\"Exception001\",IF(D14<>\"12/12\",\"Erreur001\",IF(OR(M14=\"Erreur002\",N14=\"Erreur002\",O14=\"Erreur002\"),\"Erreur002\",IF(P14=\"Erreur003\",\"Erreur003\",IF(Q14=\"Erreur004\",\"Erreur004\",IF(R14=\"Erreur005\",\"Erreur005\",\"Équipe prête\"))))))","v":"Erreur001"},{"$f":"IF(E14=\"Équipe prête\",\"\",VLOOKUP(E14,Glossaire!B1:C500,2,FALSE))","v":"Vous n'avez pas le bon nombre de niveaux"},null,null,null,null,null,"Résultat :",{"$f":"IF(COUNTIF($M$6:$M$13,\"Erreur\")>0,\"Erreur002\",\"Ok\")","v":"Ok"},{"$f":"IF(COUNTIF($N$6:$N$13,\"Erreur\")>0,\"Erreur002\",\"Ok\")","v":"Ok"},{"$f":"IF(COUNTIF($O$6:$O$13,\"Erreur\")>0,\"Erreur002\",\"Ok\")","v":"Ok"},{"$f":"IF(COUNTIF($P$6:$P$13,\"Boss\")>1,\"Erreur003\",\"Ok\")","v":"Ok"},{"$f":"IF(COUNTIF($Q$6:$Q$13,\"Ok\")<4,\"Erreur004\",\"Ok\")","v":"Ok"},{"$f":"IF(COUNTIF($R$6:$R$13,\"Ok\")<2,\"Erreur005\",\"Ok\")","v":"Ok"},{"$f":"IF(COUNTIF(S6:S13,\"Ok\")<4,\"Ok\",\"Exception001\")","v":"Ok"}]
[]
{"$rows_left_out":39}
{"sheet":"Collection","index":2,"n_rows":140,"n_cols":9,"rows_kept":140,"cut":false,"hidden":false,"merged":[]}
["Numéro","Image","Nom","Collection","Saison","Rareté","Acquise","Quantité","En ligne"]
[51,null,"Adamaï","Blind Box 2","Saison 2","Rare"]
[83,null,"Adamaï - Dragon","Flunch 2014","Saison 2","Rare"]
[1,null,"Alie Zèle","Blind Box 1","Saison 1","Commune"]
[39,null,"Amalia","Pack Confrérie du Tofu","Saison 1","Rare"]
[31,null,"Anna Tommy","KrosMaster Arena","Saison 1","Commune"]
["AL",null,"Arbre","Pack Décors 1","Saison 1","Token"]
["AW",null,"Arbre Frigost","KickStarter 2013","Saison 1","Token"]
[89,null,"Arthur Bine","Hypergame Warriors","Saison 2","Rare"]
[52,null,"Ayan","Blind Box 2","Saison 2","Commune"]
[32,null,"Bad Aboum","KrosMaster Arena","Saison 1","Commune"]
["AE",null,"Bombe à Eau","Pack Bombes 1","Saison 1","Token"]
["AF",null,"Bombe Incendiaire","Pack Bombes 1","Saison 1","Token"]
["AQ",null,"Boufmouth","KickStarter 2013","Saison 2","Token"]
["AB",null,"Bouftous","Pack Monstres 1","Saison 1","Token"]
{"$rows_left_out":126}
{"sheet":"Recherche","index":3,"n_rows":14,"n_cols":8,"rows_kept":14,"cut":false,"hidden":false,"merged":[[3,5,3,6],[4,5,4,6],[4,1,4,4],[1,1,1,7],[10,1,10,7]]}
[]
[null,"Rechercher une figurine par son nom"]
[]
[null,null,null,null,null,"Entrez le Nom"]
[null,"Rechercher une figurine :",null,null,null,null,null,"Appuyez ici \npour l'image"]
[]
[null,"Numéro","Image","Nom","Classe","Collection","Saison","Rareté"]
[null,{"$f":"IFERROR(INDEX(collection,MATCH($F$5,nomcollect,0),1),\"XX\")","v":"XX"},null,{"$f":"IF($F$5=\"\",\"\",IFERROR(VLOOKUP($F$5,données2,1,FALSE),\"Erreur\"))","v":""},{"$f":"IF($F$5=\"\",\"\",IFERROR(VLOOKUP($F$5,données2,2,FALSE),\"Erreur\"))","v":""},{"$f":"IF($F$5=\"\",\"\",IFERROR(VLOOKUP($F$5,données2,45,FALSE),\"Erreur\"))","v":""},{"$f":"IF($F$5=\"\",\"\",IFERROR(VLOOKUP($F$5,données2,46,FALSE),\"Erreur\"))","v":""},{"$f":"IF($F$5=\"\",\"\",IFERROR(VLOOKUP($F$5,données2,47,FALSE),\"Erreur\"))","v":""}]
[]
[]
[null,"Rechercher des figurines par critères"]
[]
[null,"Niveau","Rareté"]
[null,null,null,{"$f":"IF(AND($B$14=\"\",$C$14=\"\"),\"Entrez 1 ou 2 critères\",\"\")","v":"Entrez 1 ou 2 critères"},"Appuyez ici pour lancer"]

{"sheet":"Glossaire","index":4,"n_rows":88,"n_cols":3,"rows_kept":88,"cut":false,"hidden":false,"merged":[]}
["Catégorie","Terme","Détails"]
["Base de données","Rareté - Commune","Peut se retrouver 2 fois dans une équipe"]
["Base de données","Rareté - Rare","Peut se retrouver 1 fois dans une équipe"]
["Base de données","Rareté - Spécial","Peut se retrouver 3 fois dans une équipe"]
["Base de données","Vision - Droite","Doit respecter les règles de vision en ligne droite"]
["Base de données","Vision - Libre","N'a pas à respecter les règles de vision"]
["Base de données","Vision - Normale","Doit respecter les règles de vision"]
["Base de données","Vision - Poing","Les quatre cases adjacentes"]
["Base de données","Vision - Soi-même","Ne peut être effectué que sur soi-même"]
["Équipes","Erreur001","Vous n'avez pas le bon nombre de niveaux"]
["Équipes","Erreur002","Une figurine est en double/triple alors qu'elle ne doit pas l'être"]
["Équipes","Erreur003","Vous avez deux \"Boss\" dans votre équipe"]
["Équipes","Erreur004","Deux figurines avec le même nom ne peuvent pas être jouées ensemble (Yugo, Adamaï, Tristepin et Qilby)"]
["Équipes","Erreur005","Une des figurines est bannie (Liane Zolie et Terminatot Gaulde)"]
["Équipes","Exception001","Le Riktus Elite permet de dépasser les niveaux de 1 ou 2 (voir l'habileté Chef de Bande)"]
{"$rows_left_out":74}
{"sheet":"Base de données","index":5,"n_rows":112,"n_cols":48,"rows_kept":112,"cut":false,"hidden":false,"merged":[[0,44,1,44],[0,45,1,45],[0,46,1,46],[0,47,1,47],[0,0,1,0],[0,1,1,1],[0,2,1,2],[0,3,1,3],[0,4,1,4],[0,5,1,5],[0,8,0,16],[0,17,0,25],[0,26,0,34],[0,35,0,43],[0,6,1,6],[0,7,1,7]]}
["Numéro","Nom","Classe","Niveau","Initiative","PM","PV","PA","Habileté 1",null,null,null,null,null,null,null,null,"Habileté 2",null,null,null,null,null,null,null,null,"Habileté 3",null,null,null,null,null,null,null,null,"Habileté 4",null,null,null,null,null,null,null,null,"Pouvoirs","Collection","Saison","Rareté"]
[null,null,null,null,null,null,null,null,"Nom","Effet","Portée","Augmente","Vision","Coût","Dégâts","Élément","Limite","Nom","Effet","Portée","Augmente","Vision","Coût","Dégâts","Élément","Limite","Nom","Effet","Portée","Augmente","Vision","Coût","Dégâts","Élément","Limite","Nom","Effet","Portée","Augmente","Vision","Coût","Dégâts","Élément","Limite"]
[1,"Alie Zèle","Eniripsa",4,3,3,11,7,"Mot vampirique","Vol de vie","1-4","Oui","Normale","4 PA",1,"Eau","Non","Mot Revitalisant","Zone Croix","1-3","Oui","Normale","3 PA",1,"Soin","Non",null,null,null,null,null,null,null,null,null,null,null,null,null,null,null,null,null,null,"Stimulation","Blind Box 1","Saison 1","Commune"]
[2,"Chevalier Feuille","Chevalier - Tourmenteur",3,0,3,11,5,"Ignominie","Vol de vie",1,"Non","Poing","5 PA",2,"Terre","Non","Crapautage","-1PM ou -2PM","1-3","Oui","Normale","5 PA",1,"Terre","Non",null,null,null,null,null,null,null,null,null,null,null,null,null,null,null,null,null,null,"Résistance Terre","Blind Box 1","Saison 1","Rare"]
[3,"Chevalier Flamme","Chevalier - Tourmenteur",3,4,3,9,7,"Dévastation Incandescante","Zone Croix","1-4","Oui","Normale","4 PA",1,"Feu","Non","Fusion","+2 PA ou +3 PA si autre Chevalier en Jeu","0","Non","Soi-même","1 PA 2 PV","Aucun","Aucun","Non",null,null,null,null,null,null,null,null,null,null,null,null,null,null,null,null,null,null,"Résistance Feu","Blind Box 1","Saison 1","Rare"]
[4,"Chevalier Goutte","Chevalier - Tourmenteur",3,2,3,10,6,"Lourde Heure"," -1 PA","1-3","Oui","Normale","5 PA",2,"Eau","Non","Restauration","+1 Dégât Si un autre Chevalier est un jeu","0-3","Oui","Normale","5 PA",1,"Soin","Non",null,null,null,null,null,null,null,null,null,null,null,null,null,null,null,null,null,null,"Résistance Eau","Blind Box 1","Saison 1","Rare"]
[5,"Chevalier Nuage","Chevalier - Tourmenteur",3,6,4,8,6,"Tir d'un Bord","Aucun","1-5","Oui","Droite","3 PA",1,"Air ","Non","Discute en Fuite","+1 PM ou +2 PM si autre Chevalier en jeu","0","Non","Soi-même","3 PA","Aucun","Aucun","1/tour",null,null,null,null,null,null,null,null,null,null,null,null,null,null,null,null,null,null,"Résistance Air","Blind Box 1","Saison 1","Rare"]
[6,"Chevalier Ténèbres","Chevalier - Tourmenteur",6,8,4,15,7,"Tir Cruel","Aucun","1-4","Oui","Droite","4 PA",2,"Air","Non","Dévastation","Zone Croix","1-3","Oui","Normale","5 PA",2,"Feu","Non","Vil Age","-1 PA Chaque Coup Critique Comte double","1-2","Oui","Normale","6 PA",2,"Eau","Non","Infâmie","-1 PM Vol de Vie","1","Non","Poing","7 PA",2,"Terre","Non","Armure, Maître Chevalier","Blind Box 1","Saison 1","Rare"]
[7,"Coa Gulay","Sacrieur",1,6,3,7,5,"Punition","Aucun",1,"Non","Poing","5 PA",3,"Feu","Non",null,null,null,null,null,null,null,null,null,null,null,null,null,null,null,null,null,null,null,null,null,null,null,null,null,null,null,"Aucun","Blind Box 1","Saison 1","Commune"]
[8,"Daïe Guéri","Eniripsa",1,0,3,5,5,"Mot Blessant","Aucun","1-3","Oui","Normale","5 PA",1,"Air","Non","Mot Doux","Aucun","1-4","Oui","Normale","5 PA",1,"Soin","Non",null,null,null,null,null,null,null,null,null,null,null,null,null,null,null,null,null,null,"Aucun","Blind Box 1","Saison 1","Rare"]
[9,"Dany Osheun","Ecaflip",4,5,4,12,6,"Quitte ou Double","Jouer à Pile ou Face; Pile : Dany perd tout ses PA/PM, Face : Dany gagne immédiatement 2 PA","1-2","Non","Droite","3 PA",2,"Neutre","Non","Pile ou Face","50% de +3 dommages air","2-5","Oui","Normale","5 PA",0,"Air","Non",null,null,null,null,null,null,null,null,null,null,null,null,null,null,null,null,null,null,"Tacle, Esquive","Blind Box 1","Saison 1","Commune"]
[10,"Dokfa Talys","Zobal",5,9,4,14,6,"Furia","Se rapproche 1","1-2","Oui","Droite","2 PA",1,"Air","Non","Apathie","-1 PM","2-5","Oui","Normale","4 PA",1,"Terre","Non",null,null,null,null,null,null,null,null,null,null,null,null,null,null,null,null,null,null,"Critique, Tacle, Aura de Rapidité","Blind Box 1","Saison 1","Rare"]
[11,"Globule la Crapule","Sacrieur",4,3,4,14,7,"Pied du Sacrieur","Perce-Armure",1,"Non","Poing","3 PA",1,"Terre","Non","Folie Sanguinaire","Vol de Vie, +2 dommages eau contre les alliés","1","Non","Normale","2 PA",0,"Eau","Non","Transfert de Vie","Zone Croix","2-4","Oui","Normale","5 Pa + 4 PV",3,"Soin","Non",null,null,null,null,null,null,null,null,null,"Démence","Blind Box 1","Saison 1","Rare"]
[12,"Goultard","Iop",6,7,4,16,8,"Epée Céleste","Zone Croix","1-3","Oui","Normale","4 PA",1,"Feu","Non","Epée du Juste","+5 dommages feu contre cibles lvl>4","1","Non","Poing","5 PA",0,"Feu","Non","Charge","Se Rapproche de 2 cases du personnage ciblé","1-3","Oui","Droite","3 PA",1,"Terre","1/tour","Supercut","-1 PA -1 PM","1","Non","Poing","Aucun",2,"Air","1/partie","Critique, Goultarminator","Blind Box 1","Saison 1","Rare"]
[13,"Jems Blond","Crâ",4,8,3,8,6,"Flèche Ardente","Aucun ","2-6","Oui","Normale","3 PA",1,"Feu","Non","Flèche d'Immolation","Zone Croix","2-4","Oui","Normale","5 PA",2,"Feu","Non","Flèche Explosive","Zone Carré","2-3","Non","Droite","6 PA",3,"Feu","Non",null,null,null,null,null,null,null,null,null,"Esquive, Résistance Feu","Blind Box 1","Saison 1","Commune"]
{"$rows_left_out":97}