{"text_format":"1","workbook":"xlsx","n_sheets":2,"sheets":["BDD","Analyse globale"],"not_rendered":{"charts":0,"images":0,"macros":1,"external_links":0,"defined_names":9,"comments":0,"pivot_tables":0},"unopened":[],"bounds":{"document_bytes":16777216,"sheet_cells":100000,"rows_first":2000,"rows_last":500,"rows_between":2000,"halvings":0,"cell_chars":16384,"cell_head_chars":4096},"cells_cut":0,"cells_raw":0,"read":"whole","date_system":"1904"}

{"sheet":"BDD","index":0,"n_rows":11,"n_cols":27,"rows_kept":11,"cut":false,"hidden":false,"merged":[[0,0,1,0],[0,3,0,14],[0,1,1,1],[0,2,1,2],[0,15,0,26]]}
["Nom","Secteur","Poste",2013,null,null,null,null,null,null,null,null,null,null,null,2014]
[null,null,null,"Janvier","Février","Mars","Avril","Mai","Juin","Juillet","Août","Septembre","Octobre","Novembre","Décembre","Janvier","Février","Mars","Avril","Mai","Juin","Juillet","Août","Septembre","Octobre","Novembre","Décembre"]
["A","P","AT",0.21180555555555555,0.35069444444444442,0.38194444444444442,0.4826388888888889,0.4548611111111111,0.63194444444444442,0.34027777777777773,1.3888888888888888E-2,5.5555555555555552E-2,0.21875,0.44791666666666669,null,0.36458333333333331,0.53472222222222221,0.71875]
["Z","P","D",1.7291666666666667,2.3125,2.2604166666666665,2.5,2.5104166666666665,2.5104166666666665,2.6145833333333335,2.71875,2.65625,2.9895833333333335,3.2083333333333335,null,3.7291666666666665,3.7291666666666665,3.9375,4.416666666666667]
["E","P","D",0.51041666666666663,0.94791666666666663,1.3645833333333333,1.7395833333333333,1.1354166666666667,0.875,0.46875,0.84375,0.66666666666666663,1.0729166666666667,1.1979166666666667,null,1.4479166666666667,1.7916666666666667,1.375]
["R","P","AT",0.82638888888888884,0.97916666666666663,0.72222222222222221,0.53819444444444442,0.51736111111111105,0.76041666666666663,0.61111111111111105,0.6875,0.65625,0.90277777777777779,1.3368055555555556,null,1.5451388888888891,0.51041666666666663,0.94097222222222221,0.85416666666666663]
["T","P","AT",{"$f":"-\"0:45\"","v":-3.125E-2},1.3888888888888888E-2,5.5555555555555552E-2,3.8194444444444441E-2,5.5555555555555552E-2,1.0416666666666666E-2,{"$f":"-\"0:40\"","v":-2.7777777777777776E-2},{"$f":"-\"2:55\"","v":-0.12152777777777778},5.2083333333333336E-2,7.2916666666666671E-2,9.0277777777777776E-2,null,7.6388888888888895E-2,8.6805555555555566E-2]
["Y","P","D",0.25,0.27083333333333331,0.20833333333333334,0.14583333333333334,0.20833333333333334,0.25,0.125,0.20833333333333334,0.125,0.3125,0.30208333333333331,null,0.39583333333333331,0.72916666666666663]
["U","P","D",0.46875,0.52083333333333337,0.34722222222222227,0.3888888888888889,0.22916666666666666,null,8.3333333333333329E-2,0.1875,0.39583333333333331,0.375,0.30208333333333331,null,0.25,0.14583333333333334,0.75,1.1666666666666667]
["I","P","D",{"$f":"-\"1:30\"","v":-6.25E-2},0,{"$f":"-\"1:30\"","v":-6.25E-2},2.0833333333333332E-2,2.0833333333333332E-2,0.125,6.25E-2,2.0833333333333332E-2,0.16666666666666666,0,6.25E-2,null,8.3333333333333329E-2,0.20833333333333334,0.10416666666666667]
["O","P","D",0.22916666666666666,0.27083333333333331,0.125,0.125,0.11458333333333333,0.22916666666666666,0.28125,0.1875,9.375E-2,0.27083333333333331,null,null,0.3125,0.38541666666666669,0.39583333333333331]

{"sheet":"Analyse globale","index":1,"n_rows":11,"n_cols":6,"rows_kept":11,"cut":false,"hidden":false,"merged":[[0,5,1,5],[0,0,1,0],[0,1,1,1],[0,2,1,2],[0,4,1,4],[0,3,1,3]]}
["Nom","Secteur","Poste","Avant \nDernière valeur","Dernière valeur ","Variation"]
[]
["A","P","AT",{"$f":"INDEX(BDD!D3:AA3,,MATCH('Analyse globale'!E3,BDD!D3:AA3)-1)","v":0.53472222222222221},{"$f":"LOOKUP(9^9,BDD!K3:AA3)","v":0.71875},{"$f":"E3-D3","v":0.18402777777777779}]
["Z","P","D",{"$f":"INDEX(BDD!D4:AA4,,MATCH('Analyse globale'!E4,BDD!D4:AA4)-1)","v":3.9375},{"$f":"LOOKUP(9^9,BDD!K4:AA4)","v":4.416666666666667},{"$f":"E4-D4","v":0.47916666666666696}]
["E","P","D",{"$f":"INDEX(BDD!D5:AA5,,MATCH('Analyse globale'!E5,BDD!D5:AA5)-1)","v":1.0729166666666667},{"$f":"LOOKUP(9^9,BDD!K5:AA5)","v":1.375},0.30208333333333326]
["R","P","AT",{"$f":"INDEX(BDD!D6:AA6,,MATCH('Analyse globale'!E6,BDD!D6:AA6)-1)","v":0.6875},{"$f":"LOOKUP(9^9,BDD!K6:AA6)","v":0.85416666666666663},{"$f":"E6-D6","v":0.16666666666666663}]
["T","P","AT",{"$f":"INDEX(BDD!D7:AA7,,MATCH('Analyse globale'!E7,BDD!D7:AA7)-1)","v":7.6388888888888895E-2},{"$f":"LOOKUP(9^9,BDD!K7:AA7)","v":8.6805555555555566E-2},1.0416666666666671E-2]
["Y","P","D",{"$f":"INDEX(BDD!D8:AA8,,MATCH('Analyse globale'!E8,BDD!D8:AA8)-1)","v":0.39583333333333331},{"$f":"LOOKUP(9^9,BDD!K8:AA8)","v":0.72916666666666663},0.33333333333333331]
["U","P","D",{"$f":"INDEX(BDD!D9:AA9,,MATCH('Analyse globale'!E9,BDD!D9:AA9)-1)","v":0.75},{"$f":"LOOKUP(9^9,BDD!K9:AA9)","v":1.1666666666666667},{"$f":"E9-D9","v":0.41666666666666674}]
["I","P","D",{"$f":"INDEX(BDD!D10:AA10,,MATCH('Analyse globale'!E10,BDD!D10:AA10)-1)","v":0},{"$f":"LOOKUP(9^9,BDD!K10:AA10)","v":0.10416666666666667},0.10416666666666667]
["O","P","D",{"$f":"INDEX(BDD!D11:AA11,,MATCH('Analyse globale'!E11,BDD!D11:AA11)-1)","v":0.38541666666666669},{"$f":"LOOKUP(9^9,BDD!K11:AA11)","v":0.39583333333333331},1.041666666666663E-2]