{"text_format":"1","workbook":"xlsx","n_sheets":3,"sheets":["Feuil1","pt","Feuil3"],"not_rendered":{"charts":0,"images":1,"macros":1,"external_links":0,"defined_names":3,"comments":0,"pivot_tables":0},"unopened":[],"bounds":{"document_bytes":16777216,"sheet_cells":100000,"rows_first":2000,"rows_last":500,"rows_between":2000,"halvings":0,"cell_chars":16384,"cell_head_chars":4096},"cells_cut":0,"cells_raw":0,"read":"whole","date_system":"1900"}

{"sheet":"Feuil1","index":0,"n_rows":130,"n_cols":23,"rows_kept":130,"cut":false,"hidden":false,"merged":[[44,7,44,10],[62,7,62,10],[71,7,71,10]]}
[null,null,null,null,null,null,null,null,null,null,null,null,null,null,null,null,null,null," "," ","Pts",null,"J"]
[null,"22ème journée (18 et 19 février)","2014-03-22","p","c","+/-",null,{"$f":"N3","v":"ASM Clermont Auvergne"},{"$f":"O3","v":64},{"$f":"N10","v":"U. Bordeaux-Bègles"},55]
[null,"Perpignan",4,1,"Biarritz",null,null,{"$f":"N4","v":"Toulon"},{"$f":"O4","v":61},"Brive",51,null,{"$f":"W3","v":1},{"$f":"VLOOKUP(W3,$S$2:$U$17,2,0)","v":"ASM Clermont Auvergne"},{"$f":"VLOOKUP(W3,$S$2:$U$17,3,0)","v":64},1,null,null,{"$f":"RANK(V3,$V$3:V17)","v":6},"Toulouse",{"$f":"55+$D$9","v":57},{"$f":"U3+0.1","v":57.1},1]
[null,"Bayonne",1,4,"U. Bordeaux-Bègles",null,null,"Montpellier",61,"Grenoble",50,null,2,"Toulon",61,{"$f":"P3+1","v":2},null,null,{"$f":"RANK(V4,$V$3:$V$18)","v":7},"Racing Métro 92",{"$f":"52+$D$7","v":56},{"$f":"U4+0.2","v":56.2},{"$f":"W3+1","v":2}]
[null,"Castres",5,0,"Brive",null,null,"Castres Olympique",60,"Perpignan",46,null,3,"Montpellier",61,{"$f":"P4+1","v":3},null,null,{"$f":"RANK(V5,$V$3:$V$18)","v":3},"Montpellier",{"$f":"57+$D$6","v":61},{"$f":"U5+0.3","v":61.3},{"$f":"W4+1","v":3}]
[null,"Oyonnax",0,4,"Montpellier",null,null,"Stade Français",58,"Aviron Bayonnais",44,null,4,"Castres Olympique",60,4,null,null,2,"Toulon",{"$f":"60+$D$8","v":61},{"$f":"U6+0.4","v":61.4},4]
[null,"Grenoble",0,4,"Racing Métro 92",null,null,"Toulouse",57,"Oyonnax",39,null,5,"Stade Français",58,5,null,null,1,"ASM Clermont Auvergne",{"$f":"60+$C$8","v":64},{"$f":"U7+0.5","v":64.5},5]
[null,"Clermont",4,1,"Toulon",null,null,"Racing Métro 92",56,"Biarritz Olympique",24,null,6,"Toulouse",57,6,null,null,14,"Biarritz Olympique",{"$f":"23+$D$3","v":24},{"$f":"U8+0.6","v":24.6},6]
[null,"Stade Français",2,2,"Toulouse",null,null,"08/03 ecosse France",null,"15/03 France Irlande",null,null,7,"Racing Métro 92",56,7,null,null,12,"Aviron Bayonnais",{"$f":"43+$C$4","v":44},{"$f":"U9+0.7","v":44.7},7]
[null,null,null,null,null,null,null,null,null,null,null,null,8,"U. Bordeaux-Bègles",55,8,null,null,4,"Castres Olympique",{"$f":"55+$C$5","v":60},{"$f":"U10+0.8","v":60.8},8]
[null,"23ème journée (4 et 5 mars)","2014-03-28",null,null,null,null,{"$f":"N20","v":"Montpellier"},{"$f":"O20","v":66},{"$f":"N27","v":"U. Bordeaux-Bègles"},{"$f":"O27","v":58},null,9,"Brive",51,9,null,null,5,"Stade Français",{"$f":"56+$C$9","v":58},{"$f":"U11+0.9","v":58.9},9]
[null,"Montpellier",5,null,"Bayonne",null,null,{"$f":"N21","v":"ASM Clermont Auvergne"},{"$f":"O21","v":65},{"$f":"N28","v":"Brive"},{"$f":"O28","v":55},null,10,"Grenoble",50,10,null,null,11,"Perpignan",{"$f":"42+$C$3","v":46},{"$f":"U12+0.21","v":46.21},10]
[null,"Biarritz",2,2,"Castres",null,null,"Toulon",65,"Grenoble",50,null,11,"Perpignan",46,11,null,null,10,"Grenoble",{"$f":"50+$C$7","v":50},{"$f":"U13+0.01","v":50.01},11]
[null,"Brive",4,1,"Clermont",null,null,"Castres Olympique",62,"Oyonnax",48,null,12,"Aviron Bayonnais",44,12,null,null,13,"Oyonnax",{"$f":"39+$C$6","v":39},{"$f":"U14+0.02","v":39.020000000000003},12]
[null,"Oyonnax",5,null,"Grenoble",null,null,"Racing Métro 92",60,"Perpignan",46,null,13,"Oyonnax",39,13,null,null,9,"Brive",{"$f":"51+$D$5","v":51},{"$f":"U15+0.03","v":51.03},13]
[null,"U. Bordeaux-Bègles",4,null,"Perpignan",null,null,"Stade Français",58,"Aviron Bayonnais",44,null,14,"Biarritz Olympique",24,14,null,null,8,"U. Bordeaux-Bègles",{"$f":"51+$D$4","v":55},{"$f":"U16+0.04","v":55.04},14]
[null,"Stade Français",null,4,"Racing Métro 92",null,null,"Toulouse",58,"Biarritz Olympique",26,null,null,null,null,null,null,null,null,null,null,null,"totowsky"]
[null,"Toulon",4,1,"Toulouse",null,null,"5 avril 1/4 hcup"]
[]
[null,"24ème journée (11 et 12 mars)","2014-04-11",null,null,null,null,{"$f":"N35","v":"Montpellier"},{"$f":"O35","v":70},{"$f":"N42","v":"Toulouse"},{"$f":"O42","v":58},null,1,{"$f":"VLOOKUP(M20,$S$20:$U$33,2,0)","v":"Montpellier"},{"$f":"VLOOKUP(M20,$S$20:$U$33,3,0)","v":66},1,null,null,{"$f":"RANK(V20,$V$20:$V$34)","v":7},"Toulouse",{"$f":"55+$D$9+$D$18","v":58},{"$f":"U20+0.1","v":58.1},1]
[null,"Racing Métro 92",5,null,"Biarritz",null,null,{"$f":"N36","v":"ASM Clermont Auvergne"},{"$f":"O36","v":69},{"$f":"N43","v":"Brive"},{"$f":"O43","v":55},null,2,{"$f":"VLOOKUP(M21,$S$20:$U$33,2,0)","v":"ASM Clermont Auvergne"},{"$f":"VLOOKUP(M21,$S$20:$U$33,3,0)","v":65},1,null,null,{"$f":"RANK(V21,$V$20:$V$34)","v":5},"Racing Métro 92",{"$f":"52+$D$7+$D$17","v":60},{"$f":"U21+0.2","v":60.2},{"$f":"W20+1","v":2}]
[null,"Toulouse",null,null,"Brive",null,null,"Toulon",69,"Perpignan",51,null,{"$f":"3","v":3},"Toulon",65,1,null,null,1,"Montpellier",{"$f":"57+$D$6+$C$12","v":66},{"$f":"U22+0.3","v":66.3},{"$f":"W21+1","v":3}]
[null,"Clermont",4,null,"Castres",null,null,"Racing Métro 92",65,"Grenoble",51,null,{"$f":"W23","v":4},"Castres Olympique",62,1,null,null,3,"Toulon",{"$f":"60+$D$8+$C$18","v":65},{"$f":"U23+0.4","v":65.400000000000006},4]
[null,"Grenoble",1,4,"Montpellier",null,null,"Castres Olympique",62,"Aviron Bayonnais",48,null,5,"Racing Métro 92",60,1,null,null,2,"ASM Clermont Auvergne",{"$f":"60+$C$8+$D$14","v":65},{"$f":"U24+0.5","v":65.5},5]
[null,"Perpignan",5,null,"Oyonnax",null,null,"U. Bordeaux-Bègles",59,"Oyonnax",48,null,6,"Stade Français",58,1,null,null,14,"Biarritz Olympique",{"$f":"23+$D$3+$C$13","v":26},{"$f":"U25+0.6","v":26.6},6]
[null,"Bayonne",4,null,"Stade Français",null,null,"Stade Français",58,"Biarritz Olympique",26,null,7,"Toulouse",58,1,null,null,13,"Aviron Bayonnais",{"$f":"43+$C$4+$D$12","v":44},{"$f":"U26+0.7","v":44.7},7]
[null,"U. Bordeaux-Bègles",1,4,"Toulon","maz",null,null,null,null,null,null,8,"U. Bordeaux-Bègles",58,1,null,null,4,"Castres Olympique",{"$f":"55+$C$5+$D$13","v":62},{"$f":"U27+0.8","v":62.8},8]
[null,null,null,null,null,null,null,null,null,null,null,null,9,"Brive",55,1,null,null,6,"Stade Français",{"$f":"56+$C$9+$C$17","v":58},{"$f":"U28+0.9","v":58.9},9]
[null,"25ème journée (25, 26 et 27 mars)","2014-04-18",null,null,null,null,{"$f":"N53","v":"Toulon"},{"$f":"O53","v":73},{"$f":"N60","v":"U. Bordeaux-Bègles"},{"$f":"O60","v":59},null,10,"Grenoble",50,1,null,null,12,"Perpignan",{"$f":"42+$C$3+$D$16","v":46},{"$f":"U29+0.21","v":46.21},10]
[null,"Grenoble",4,null,"Bayonne",null,null,{"$f":"N54","v":"Montpellier"},{"$f":"O54","v":70},{"$f":"N61","v":"Brive"},{"$f":"O61","v":59},null,11,"Oyonnax",48,1,null,null,10,"Grenoble",{"$f":"50+$C$7+$D$15","v":50},{"$f":"U30+0.01","v":50.01},11]
[null,"Stade Français",4,null,"U. Bordeaux-Bègles",null,null,"ASM Clermont Auvergne",69,"Grenoble",55,null,12,"Perpignan",46,1,null,null,11,"Oyonnax",{"$f":"39+$C$6+$C$15+$C$48","v":48},{"$f":"U31+0.02","v":48.02},12]
[null,"Biarritz",null,4,"Brive",null,null,"Racing Métro 92",69,"Perpignan",51,null,13,"Aviron Bayonnais",44,1,null,null,9,"Brive",{"$f":"51+$D$5+$C$14","v":55},{"$f":"U32+0.03","v":55.03},13]
[null,"Racing Métro 92",4,null,"Clermont",null,null,"Castres Olympique",66,"Aviron Bayonnais",48,null,14,"Biarritz Olympique",26,1,null,null,8,"U. Bordeaux-Bègles",{"$f":"50+$D$4+$C$16+$D$48","v":58},{"$f":"U33+0.04","v":58.04},14]
[null,"Castres",4,null,"Montpellier",null,null,"Stade Français",62,"Oyonnax",48]
[null,"Perpignan",null,4,"Toulon",null,null,"Toulouse",62,"Biarritz Olympique",26,null,{"$f":"W35","v":1},{"$f":"VLOOKUP(M35,$S$35:$U$49,2,0)","v":"Montpellier"},{"$f":"VLOOKUP(M35,$S$35:$U$49,3,0)","v":70},1,null,null,{"$f":"RANK($V35,$V$35:$V$49)","v":8},"Toulouse",{"$f":"55+$D$9+$D$18+$C$22","v":58},{"$f":"U35+0.1","v":58.1},1]
[null,"Oyonnax",0,4,"Toulouse","maz",null,"27/04  1/2 hcup",null,null,null,null,2,{"$f":"VLOOKUP(M36,$S$35:$U$49,2,0)","v":"ASM Clermont Auvergne"},{"$f":"VLOOKUP(M36,$S$35:$U$49,3,0)","v":69},1,null,null,{"$f":"RANK($V36,$V$35:$V$49)","v":4},"Racing Métro 92",{"$f":"52+$D$7+$C$21+$D$17","v":65},{"$f":"U36+0.2","v":65.2},{"$f":"W35+1","v":2}]
[null,null,null,null,null,null,null,null,null,null,null,null,3,"Toulon",69,1,null,null,1,"Montpellier",{"$f":"57+$D$6+$D$24+$C$12","v":70},{"$f":"U37+0.3","v":70.3},{"$f":"W36+1","v":3}]
[null,"26ème journée (1 et 2 avril)","2014-05-02",null,null,null,null,{"$f":"N69","v":"Toulon"},77,{"$f":"N76","v":"Stade Français"},62,null,4,"Racing Métro 92",65,1,null,null,3,"Toulon",{"$f":"60+$D$8+$D$27+$C$18","v":69},{"$f":"U38+0.4","v":69.400000000000006},4]
[null,"U. Bordeaux-Bègles",4,null,"Biarritz",null,null,"ASM Clermont Auvergne",74,"Castres Olympique",61,null,5,"Castres Olympique",62,1,null,null,2,"ASM Clermont Auvergne",{"$f":"60+$C$8+$C$23+$D$14","v":69},{"$f":"U39+0.5","v":69.5},5]
[null,"Bayonne",4,null,"Castres",null,null,"Montpellier",74,"Grenoble",55,null,6,"U. Bordeaux-Bègles",59,1,null,null,14,"Biarritz Olympique",{"$f":"23+$D$3+$D$21+$C$13","v":26},{"$f":"U40+0.6","v":26.6},6]
[null,"Toulouse",5,null,"Grenoble",null,null,"Racing Métro 92",69,"Aviron Bayonnais",52,null,7,"Stade Français",58,1,null,null,12,"Aviron Bayonnais",{"$f":"43+$C$4+$C$26+$D$12","v":48},{"$f":"U41+0.7","v":48.7},7]
[null,"Brive",4,null,"Oyonnax",null,null,"Toulouse",67,"Perpignan",51,null,8,"Toulouse",58,1,null,null,5,"Castres Olympique",{"$f":"55+$C$5+$D$23+$D$13","v":62},{"$f":"U42+0.8","v":62.8},8]
[null,"Toulon",4,null,"Stade Français",null,null,"U. Bordeaux-Bègles",63,"Oyonnax",48,null,9,"Brive",55,1,null,null,7,"Stade Français",{"$f":"56+$C$9+$D$26+$C$17","v":58},{"$f":"U43+0.9","v":58.9},9]
[null,"Clermont",5,null,"Perpignan",null,null,"Brive",63,"Biarritz Olympique",26,null,10,"Perpignan",51,1,null,null,10,"Perpignan",{"$f":"42+$C$3+$C$25+$D$16","v":51},{"$f":"U44+0.21","v":51.21},10]
[null,"Montpellier",4,null,"Racing Métro 92",null,null,"barrage top 14 9/05 1/2 16/05  24/05 finale hcup finale top 14 31/05",null,null,null,null,11,"Grenoble",51,1,null,null,11,"Grenoble",{"$f":"50+$C$7+$C$24+$D$15","v":51},{"$f":"U45+0.01","v":51.01},11]
[null,null,null,null,null,null,null,null,null,null,null,null,12,"Aviron Bayonnais",48,1,null,null,13,"Oyonnax",{"$f":"39+$C$6+$D$25+$C$15+$C$48","v":48},{"$f":"U46+0.02","v":48.02},12]
[null,"match en retard",null,null,null,null,null,null,null,null,null,null,13,"Oyonnax",48,1,null,null,9,"Brive",{"$f":"51+$D$5+$D$22+$C$14","v":55},{"$f":"U47+0.03","v":55.03},13]
[null,"Oyonnax",4,null,"U. Bordeaux-Bègles",null,null,null,null,null,null,null,14,"Biarritz Olympique",26,1,null,null,6,"U. Bordeaux-Bègles",{"$f":"50+$C$27+$C$16+$D$4+$D$48","v":59},{"$f":"U48+0.04","v":59.04},14]
[]
[]
[]
[]
[null,null,null,null,null,null,null,null,null,null,null,null,{"$f":"W53","v":1},{"$f":"VLOOKUP(W53,$S$53:$U$67,2,0)","v":"Toulon"},{"$f":"VLOOKUP(W53,$S$53:$U$67,3,0)","v":73},1,null,null,{"$f":"RANK(V53,$V$53:$V$67)","v":7},"Toulouse",{"$f":"55+$D$9+$D$36+$D$18+$C$22","v":62},{"$f":"U53+0.1","v":62.1},1]
[null,null,null,null,null,null,null,null,null,null,null,null,2,{"$f":"VLOOKUP(W54,$S$53:$U$67,2,0)","v":"Montpellier"},{"$f":"VLOOKUP(W54,$S$53:$U$67,3,0)","v":70},{"$f":"P53+1","v":2},null,null,{"$f":"RANK(V54,$V$53:$V$67)","v":4},"Racing Métro 92",{"$f":"52+$D$7+$C$33+$C$21+$D$17","v":69},{"$f":"U54+0.2","v":69.2},{"$f":"W53+1","v":2}]
[null,null,null,null,null,null,null,null,null,null,null,null,3,"ASM Clermont Auvergne",69,{"$f":"P54+1","v":3},null,null,2,"Montpellier",{"$f":"57+$D$6+$D$24+$D$34+$C$12","v":70},{"$f":"U55+0.3","v":70.3},{"$f":"W54+1","v":3}]
[null,null,null,null,null,null,null,null,null,null,null,null,4,"Racing Métro 92",69,4,null,null,1,"Toulon",{"$f":"60+$D$8+$D$35+$D$27+$C$18","v":73},{"$f":"U56+0.4","v":73.400000000000006},4]
[null,null,null,null,null,null,null,null,null,null,null,null,5,"Castres Olympique",66,5,null,null,3,"ASM Clermont Auvergne",{"$f":"60+$C$8+$D$33+$C$23+$D$14","v":69},{"$f":"U57+0.5","v":69.5},5]
[null,null,null,null,null,null,null,null,null,null,null,null,6,"Stade Français",62,6,null,null,14,"Biarritz Olympique",{"$f":"23+$D$3+$C$32+$D$21+$C$13","v":26},{"$f":"U58+0.6","v":26.6},6]
[null,null,null,null,null,null,null,null,null,null,null,null,7,"Toulouse",62,7,null,null,12,"Aviron Bayonnais",{"$f":"43+$C$4+$D$30+$C$26+$D$12","v":48},{"$f":"U59+0.7","v":48.7},7]
[null,null,null,null,null,null,null,null,null,null,null,null,8,"U. Bordeaux-Bègles",59,8,null,null,5,"Castres Olympique",{"$f":"55+$C$5+$C$34+$D$23+$D$13","v":66},{"$f":"U60+0.8","v":66.8},8]
[null,null,null,null,null,null,null,null,null,null,null,null,9,"Brive",59,9,null,null,6,"Stade Français",{"$f":"56+$C$9+$C$31+$D$26+$C$17","v":62},{"$f":"U61+0.9","v":62.9},9]
[null,null,null,null,null,null,null,null,null,null,null,null,10,"Grenoble",55,10,null,null,11,"Perpignan",{"$f":"42+$C$3+$C$35+$C$25+$D$16","v":51},{"$f":"U62+0.21","v":51.21},10]
[null,null,null,null,null,null,null,null,null,null,null,null,11,"Perpignan",51,11,null,null,10,"Grenoble",{"$f":"50+$C$7+$C$30+$C$24+$D$15","v":55},{"$f":"U63+0.01","v":55.01},11]
[null,null,null,null,null,null,null,null,null,null,null,null,12,"Aviron Bayonnais",48,12,null,null,13,"Oyonnax",{"$f":"39+$C$6+$C$36+$D$25+$C$15+$C$48","v":48},{"$f":"U64+0.02","v":48.02},12]
[null,null,null,null,null,null,null,{"$f":"N117","v":"Toulouse"},69,{"$f":"N124","v":"Perpignan"},55,null,13,"Oyonnax",48,13,null,null,9,"Brive",{"$f":"51+$D$5+$D$22+$C$14+$D$32","v":59},{"$f":"U65+0.03","v":59.03},13]
[null,null,null,null,null,null,null,"ASM Clermont Auvergne",67,"Biarritz Olympique",52,null,14,"Biarritz Olympique",26,14,null,null,8,"U. Bordeaux-Bègles",{"$f":"50+$C$27+$C$16+$D$4+$D$31+$D$48","v":59},{"$f":"U66+0.04","v":59.04},14]
[null,null,null,null,null,null,null,"Toulon",64,"Castres Olympique",48]
[null,null,null,null,null,null,null,"Montpellier",64,"Grenoble",41]
[null,null,null,null,null,null,null,"Aviron Bayonnais",63,"Brive",40,null,{"$f":"W69","v":1},{"$f":"VLOOKUP(W69,$S$69:$U$83,2,0)","v":"Toulon"},{"$f":"VLOOKUP(W69,$S$69:$U$83,3,0)","v":77},1,null,null,{"$f":"RANK(V69,$V$69:$V$83)","v":5},"Toulouse",{"$f":"55+$D$9+$C$41+$D$36+$D$18+$C$22","v":67},{"$f":"U69+0.1","v":67.099999999999994},1]
[null,null,null,null,null,null,null,"Racing Métro 92",63,"Oyonnax",35,null,2,{"$f":"VLOOKUP(W70,$S$69:$U$83,2,0)","v":"ASM Clermont Auvergne"},{"$f":"VLOOKUP(W70,$S$69:$U$83,3,0)","v":74},{"$f":"P69+1","v":2},null,null,{"$f":"RANK(V70,$V$69:$V$83)","v":4},"Racing Métro 92",{"$f":"52+$D$7+$D$45+$C$33+$C$21+$D$17","v":69},{"$f":"U70+0.2","v":69.2},{"$f":"W69+1","v":2}]
[null,null,null,null,null,null,null,"Stade Français",57,"U. Bordeaux-Bègles",15,null,3,"Montpellier",74,{"$f":"P70+1","v":3},null,null,3,"Montpellier",{"$f":"57+$D$6+$C$45+$D$24+$D$34+$C$12","v":74},{"$f":"U71+0.3","v":74.3},{"$f":"W70+1","v":3}]
[null,null,null,null,null,null,null,"finale hcup 21 mai",null,null,null,null,4,"Racing Métro 92",69,4,null,null,1,"Toulon",{"$f":"60+$D$8+$C$43+$D$35+$D$27+$C$18","v":77},{"$f":"U72+0.4","v":77.400000000000006},4]
[null,null,null,null,null,null,null,null,null,null,null,null,5,"Toulouse",67,5,null,null,2,"ASM Clermont Auvergne",{"$f":"60+$C$8+$C$44+$D$33+$C$23+$D$14","v":74},{"$f":"U73+0.5","v":74.5},5]
[null,null,null,null,null,null,null,null,null,null,null,null,6,"U. Bordeaux-Bègles",63,6,null,null,14,"Biarritz Olympique",{"$f":"23+$D$3+$D$39+$C$32+$D$21+$C$13","v":26},{"$f":"U74+0.6","v":26.6},6]
[null,null,null,null,null,null,null,null,null,null,null,null,7,"Brive",63,7,null,null,11,"Aviron Bayonnais",{"$f":"43+$C$4+$C$40+$D$30+$C$26+$D$12","v":52},{"$f":"U75+0.7","v":52.7},7]
[null,null,null,null,null,null,null,null,null,null,null,null,8,"Stade Français",62,8,null,null,9,"Castres Olympique",{"$f":"55+$C$7+$D$40+$C$34+$D$23+$D$13","v":61},{"$f":"U76+0.8","v":61.8},8]
[null,null,null,null,null,null,null,null,null,null,null,null,9,"Castres Olympique",61,9,null,null,8,"Stade Français",{"$f":"56+$C$9+$D$43+$C$31+$D$26+$C$17","v":62},{"$f":"U77+0.9","v":62.9},9]
[null,null,null,null,null,null,null,null,null,null,null,null,10,"Grenoble",55,10,null,null,12,"Perpignan",{"$f":"42+$C$3+$D$44+$C$35+$C$25+$D$16","v":51},{"$f":"U78+0.21","v":51.21},10]
[null,null,null,null,null,null,null,null,null,null,null,null,11,"Aviron Bayonnais",52,11,null,null,10,"Grenoble",{"$f":"50+$C$7+$D$41+$C$30+$C$24+$D$15","v":55},{"$f":"U79+0.01","v":55.01},11]
[null,null,null,null,null,null,null,null,null,null,null,null,12,"Perpignan",51,12,null,null,13,"Oyonnax",{"$f":"39+$C$6+$D$42+$C$36+$D$25+$C$15+$C$48","v":48},{"$f":"U80+0.02","v":48.02},12]
[null,null,null,null,null,null,null,null,null,null,null,null,13,"Oyonnax",48,13,null,null,7,"Brive",{"$f":"51+$D$5+$C$42+$D$22+$C$14+$D$32","v":63},{"$f":"U81+0.03","v":63.03},13]
[null,null,null,null,null,null,null,null,null,null,null,null,14,"Biarritz Olympique",26,14,null,null,6,"U. Bordeaux-Bègles",{"$f":"50+$C$27+$C$16+$D$4+D31+C39","v":63},{"$f":"U82+0.04","v":63.04},14]
[]
[]
[null,null,null,null,null,null,null,null,null,null,null,null,{"$f":"W85","v":1},{"$f":"VLOOKUP(W85,$S$84:$U$99,2,0)","v":"ASM Clermont Auvergne"},{"$f":"VLOOKUP(W85,$S$85:$U$99,3,0)","v":64},1,null,null,{"$f":"RANK(V85,$V$85:$V$99)","v":5},"Toulouse",{"$f":"55+$D$9","v":57},{"$f":"U85+0.1","v":57.1},1]
[null,null,null,null,null,null,null,null,null,null,null,null,2,{"$f":"VLOOKUP(W86,$S$84:$U$99,2,0)","v":"Toulon"},{"$f":"VLOOKUP(W86,$S$85:$U$99,3,0)","v":61},{"$f":"P85+1","v":2},null,null,{"$f":"RANK(V86,$V$85:$V$99)","v":6},"Racing Métro 92",{"$f":"52+$D$7","v":56},{"$f":"U86+0.2","v":56.2},{"$f":"W85+1","v":2}]
[null,null,null,null,null,null,null,null,null,null,null,null,3,"Montpellier",61,{"$f":"P86+1","v":3},null,null,3,"Montpellier",{"$f":"57+$D$6","v":61},{"$f":"U87+0.3","v":61.3},{"$f":"W86+1","v":3}]
[null,null,null,null,null,null,null,null,null,null,null,null,4,"Stade Français",58,4,null,null,2,"Toulon",{"$f":"60+$D$8","v":61},{"$f":"U88+0.4","v":61.4},4]
[null,null,null,null,null,null,null,null,null,null,null,null,5,"Toulouse",57,5,null,null,1,"ASM Clermont Auvergne",{"$f":"60+$C$8","v":64},{"$f":"U89+0.5","v":64.5},5]
[null,null,null,null,null,null,null,null,null,null,null,null,6,"Racing Métro 92",56,6,null,null,14,"Biarritz Olympique",{"$f":"21+$D$3","v":22},{"$f":"U90+0.6","v":22.6},6]
[null,null,null,null,null,null,null,null,null,null,null,null,7,"Castres Olympique",55,7,null,null,12,"Aviron Bayonnais",{"$f":"39+$C$4","v":40},{"$f":"U91+0.7","v":40.700000000000003},7]
[null,null,null,null,null,null,null,null,null,null,null,null,8,"U. Bordeaux-Bègles",54,8,null,null,7,"Castres Olympique",{"$f":"55+$C$7","v":55},{"$f":"U92+0.8","v":55.8},8]
[null,null,null,null,null,null,null,null,null,null,null,null,9,"Brive",51,9,null,null,4,"Stade Français",{"$f":"56+$C$9","v":58},{"$f":"U93+0.9","v":58.9},9]
[null,null,null,null,null,null,null,null,null,null,null,null,10,"Grenoble",50,10,null,null,11,"Perpignan",{"$f":"42+$C$3","v":46},{"$f":"U94+0.21","v":46.21},10]
[null,null,null,null,null,null,null,null,null,null,null,null,11,"Perpignan",46,11,null,null,10,"Grenoble",{"$f":"50+$C$7","v":50},{"$f":"U95+0.01","v":50.01},11]
[null,null,null,null,null,null,null,null,null,null,null,null,12,"Aviron Bayonnais",40,12,null,null,13,"Oyonnax",{"$f":"36+$C$6","v":36},{"$f":"U96+0.02","v":36.020000000000003},12]
[null,null,null,null,null,null,null,null,null,null,null,null,13,"Oyonnax",36,13,null,null,9,"Brive",{"$f":"51+$D$5","v":51},{"$f":"U97+0.03","v":51.03},13]
[null,null,null,null,null,null,null,null,null,null,null,null,14,"Biarritz Olympique",22,14,null,null,{"$f":"RANK($V$16,$V$3:$V$17)","v":8},"U. Bordeaux-Bègles",{"$f":"50+$D$4","v":54},{"$f":"U98+0.04","v":54.04},14]
[]
[]
[null,null,null,null,null,null,null,null,null,null,null,null,{"$f":"W101","v":1},{"$f":"VLOOKUP(W101,$S$101:$U$1114,2,0)","v":"Toulouse"},{"$f":"VLOOKUP(W101,$S$101:$U$1114,3,0)","v":69},1,null,null,{"$f":"RANK(V101,$V$101:$V$114)","v":1},"Toulouse",{"$f":"60+$C$61+$D$51+$D$39+$D$31+$C$23+$D$15+$C$5","v":69},{"$f":"U101+0.1","v":69.099999999999994},1]
[null,null,null,null,null,null,null,null,null,null,null,null,2,{"$f":"VLOOKUP(W102,$S$101:$U$1114,2,0)","v":"ASM Clermont Auvergne"},{"$f":"VLOOKUP(W102,$S$101:$U$1114,3,0)","v":67},{"$f":"P101+1","v":2},null,null,{"$f":"RANK(V102,$V$101:$V$114)","v":6},"Racing Métro 92",{"$f":"53+$C$58+$D$48+$D$40+$C$31+$D$22+$D$13+$D$4","v":63},{"$f":"U102+0.2","v":63.2},{"$f":"W101+1","v":2}]
[null,null,null,null,null,null,null,null,null,null,null,null,3,"Toulon",64,{"$f":"P102+1","v":3},null,null,4,"Montpellier",{"$f":"52+$D$62+$C$50+$D$42+$C$34+$D$24+$C$17+$D$7","v":64},{"$f":"U103+0.3","v":64.3},{"$f":"W102+1","v":3}]
[null,null,null,null,null,null,null,null,null,null,null,null,4,"Montpellier",64,4,null,null,3,"Toulon",{"$f":"49+$C$57+$C$51+$C$43+$D$35+$C$25+$D$18+$D$8","v":64},{"$f":"U104+0.4","v":64.400000000000006},4]
[null,null,null,null,null,null,null,null,null,null,null,null,5,"Aviron Bayonnais",63,5,null,null,2,"ASM Clermont Auvergne",{"$f":"49+$C$63+$D$54+$C$45+$D$36+$D$27+$C$18+$C$9","v":67},{"$f":"U105+0.5","v":67.5},5]
[null,null,null,null,null,null,null,null,null,null,null,null,6,"Racing Métro 92",63,6,null,null,9,"Biarritz Olympique",{"$f":"48+$D$59+$C$49+$D$45+$C$32+$C$22+$C$14+$D$5","v":52},{"$f":"U106+0.6","v":52.6},6]
[null,null,null,null,null,null,null,null,null,null,null,null,7,"Stade Français",57,7,null,null,5,"Aviron Bayonnais",{"$f":"48+$C$60+$D$50+$C$40+$D$32+$D$21+$C$15+$D$9","v":63},{"$f":"U107+0.7","v":63.7},7]
[null,null,null,null,null,null,null,null,null,null,null,null,8,"Perpignan",55,8,null,null,10,"Castres Olympique",{"$f":"47+$C$59+$D$53+$D$44+$C$35+$C$27+$D$16+$C$7","v":48},{"$f":"U108+0.8","v":48.8},8]
[null,null,null,null,null,null,null,null,null,null,null,null,9,"Biarritz Olympique",52,9,null,null,7,"Stade Français",{"$f":"44+$D$60+$C$54+$D$43+$D$34+$C$26+$C$12+$D$6","v":57},{"$f":"U109+0.9","v":57.9},9]
[null,null,null,null,null,null,null,null,null,null,null,null,10,"Castres Olympique",48,10,null,null,8,"Perpignan",{"$f":"41+$D$57+$C$48+$C$39+$D$30+$C$21+$D$12+$D$3","v":55},{"$f":"U110+0.21","v":55.21},10]
[null,null,null,null,null,null,null,null,null,null,null,null,11,"Grenoble",41,11,null,null,11,"Grenoble",{"$f":"28+$D$58+$D$52+$C$44+$C$36+$D$26+$D$17+$C$8","v":41},{"$f":"U111+0.01","v":41.01},11]
[null,null,null,null,null,null,null,null,null,null,null,null,12,"Brive",40,12,null,null,13,"Oyonnax",{"$f":"28+$D$63+$C$52+$D$41+$C$30+$C$24+$D$14+$C$4","v":35},{"$f":"U112+0.02","v":35.020000000000003},12]
[null,null,null,null,null,null,null,null,null,null,null,null,13,"Oyonnax",35,13,null,null,12,"Brive",{"$f":"27+$C$62+$D$49+$C$41+$C$33+$D$23+$C$16+$C$6","v":40},{"$f":"U113+0.03","v":40.03},13]
[null,null,null,null,null,null,null,null,null,null,null,null,14,"U. Bordeaux-Bègles",15,14,null,null,14,"U. Bordeaux-Bègles",{"$f":"5+$D$61+$C$53+$C$42+$D$33+$D$25+$C$13+$C$3","v":15},{"$f":"U114+0.04","v":15.04},14]
[]
[]
[null,null,null,null,null,null,null,null,null,null,null,null,{"$f":"W117","v":1},{"$f":"VLOOKUP(W117,$S$117:$U$131,2,0)","v":"Toulouse"},{"$f":"VLOOKUP(W117,$S$117:$U$131,3,0)","v":69},1,null,null,{"$f":"RANK(V117,$V$117:$V$131)","v":1},"Toulouse",{"$f":"60+$C$72+$C$61+$D$51+$D$39+$D$31+$C$23+$D$15+$C$5","v":69},{"$f":"U117+0.1","v":69.099999999999994},1]
[null,null,null,null,null,null,null,null,null,null,null,null,2,{"$f":"VLOOKUP(W118,$S$117:$U$131,2,0)","v":"ASM Clermont Auvergne"},{"$f":"VLOOKUP(W118,$S$117:$U$131,3,0)","v":67},{"$f":"P117+1","v":2},null,null,{"$f":"RANK(V118,$V$117:$V$131)","v":6},"Racing Métro 92",{"$f":"53+$D$67+$C$58+$D$48+$D$40+$C$31+$D$22+$D$13+$D$4","v":63},{"$f":"U118+0.2","v":63.2},{"$f":"W117+1","v":2}]
[null,null,null,null,null,null,null,null,null,null,null,null,3,"Toulon",64,{"$f":"P118+1","v":3},null,null,4,"Montpellier",{"$f":"52+$C$71+$D$62+$C$50+$D$42+$C$34+$D$24+$C$17+$D$7","v":64},{"$f":"U119+0.3","v":64.3},{"$f":"W118+1","v":3}]
[null,null,null,null,null,null,null,null,null,null,null,null,4,"Montpellier",64,4,null,null,3,"Toulon",{"$f":"49+$D$71+$C$57+$C$51+$C$43+$D$35+$C$25+$D$18+$D$8","v":64},{"$f":"U120+0.4","v":64.400000000000006},4]
[null,null,null,null,null,null,null,null,null,null,null,null,5,"Aviron Bayonnais",63,5,null,null,2,"ASM Clermont Auvergne",{"$f":"49+$D$72+$C$63+$D$54+$C$45+$D$36+$D$27+$C$18+$C$9","v":67},{"$f":"U121+0.5","v":67.5},5]
[null,null,null,null,null,null,null,null,null,null,null,null,6,"Racing Métro 92",63,6,null,null,9,"Biarritz Olympique",{"$f":"48+$C$68+$D$59+$C$49+$D$45+$C$32+$C$22+$C$14+$D$5","v":52},{"$f":"U122+0.6","v":52.6},6]
[null,null,null,null,null,null,null,null,null,null,null,null,7,"Stade Français",57,7,null,null,5,"Aviron Bayonnais",{"$f":"48+$D$69+$C$60+$D$50+$C$40+$D$32+$D$21+$C$15+$D$9","v":63},{"$f":"U123+0.7","v":63.7},7]
[null,null,null,null,null,null,null,null,null,null,null,null,8,"Perpignan",55,8,null,null,10,"Castres Olympique",{"$f":"47+$D$66+$C$59+$D$53+$D$44+$C$35+$C$27+$D$16+$C$7","v":48},{"$f":"U124+0.8","v":48.8},8]
[null,null,null,null,null,null,null,null,null,null,null,null,9,"Biarritz Olympique",52,9,null,null,7,"Stade Français",{"$f":"44+$C$67+$D$60+$C$54+$D$43+$D$34+$C$26+$C$12+$D$6","v":57},{"$f":"U125+0.9","v":57.9},9]
[null,null,null,null,null,null,null,null,null,null,null,null,10,"Castres Olympique",48,10,null,null,8,"Perpignan",{"$f":"41+$C$66+$D$57+$C$48+$C$39+$D$30+$C$21+$D$12+$D$3","v":55},{"$f":"U126+0.21","v":55.21},10]
[null,null,null,null,null,null,null,null,null,null,null,null,11,"Grenoble",41,11,null,null,11,"Grenoble",{"$f":"28+$C$70+$D$58+$D$52+$C$44+$C$36+$D$26+$D$17+$C$8","v":41},{"$f":"U127+0.01","v":41.01},11]
[null,null,null,null,null,null,null,null,null,null,null,null,12,"Brive",40,12,null,null,13,"Oyonnax",{"$f":"28+$C$69+$D$63+$C$52+$D$41+$C$30+$C$24+$D$14+$C$4","v":35},{"$f":"U128+0.02","v":35.020000000000003},12]
[null,null,null,null,null,null,null,null,null,null,null,null,13,"Oyonnax",35,13,null,null,12,"Brive",{"$f":"27+$D$70+$C$62+$D$49+$C$41+$C$33+$D$23+$C$16+$C$6","v":40},{"$f":"U129+0.03","v":40.03},13]
[null,null,null,null,null,null,null,null,null,null,null,null,14,"U. Bordeaux-Bègles",15,14,null,null,14,"U. Bordeaux-Bègles",{"$f":"5+$D$68+$D$61+$C$53+$C$42+$D$33+$D$25+$C$13+$C$3","v":15},{"$f":"U130+0.04","v":15.04},14]

{"sheet":"pt","index":1,"n_rows":7,"n_cols":4,"rows_kept":7,"cut":false,"hidden":false,"merged":[]}
[5,null,0,0]
[4,null,0,0]
[2,null,0,0]
[1,null,0,0]
[0,null,0,0]
[null,null,0,0]
[null,null,0,0]

{"sheet":"Feuil3","index":2,"n_rows":0,"n_cols":0,"rows_kept":0,"cut":false,"hidden":false,"merged":[]}