{"text_format":"1","workbook":"xlsx","n_sheets":5,"sheets":["Accueil","Scores","Data","Debug","Temp"],"not_rendered":{"charts":0,"images":7,"macros":1,"external_links":1,"defined_names":237,"comments":0,"pivot_tables":0},"unopened":[],"bounds":{"document_bytes":16777216,"sheet_cells":100000,"rows_first":2000,"rows_last":500,"rows_between":2000,"halvings":0,"cell_chars":16384,"cell_head_chars":4096},"cells_cut":0,"cells_raw":0,"read":"whole","date_system":"1900"}

{"sheet":"Accueil","index":0,"n_rows":77,"n_cols":8,"rows_kept":77,"cut":false,"hidden":false,"merged":[]}
[]
[null,null,null,"TOURNOI"]
[]
[]
[]
[]
[]
["Les Scores"]
[]
["Inscrivez vos pronostics ou les résultats des matchs dans les tableaux ci-dessous."]
["Les calculs se feront automatiquement."]
["Et les équipes se positionneront dans le tableau final."]
[]
["Publiez vos résultats et obtenez votre classement parmi tous les concurrents."]
[]
[]
[]
[]
[]
[]
[]
[]
[]
[]
[]
[]
[]
[]
[]
[]
[]
[]
[]
[]
[]
[]
[]
["REGLEMENT:"]
["* Le tournoi doit se déroule dans un temps bien déterminé. Je propose deux semaines maximum"]
["* match de poule se déroulant en un seul match ( 3 matchs chacun), aller retour pour la phase finale"]
["* Après chaque match, vous retranscrivez dans le fichier Score le résultat de vos confrontations"]
["* Deux équipes de chaque groupe passeront au tour suivant"]
["* Si égalité il y a, les équipes se départageront au goal average, puis au goal average particulier ( claculé automatiquement par le fichier excel)"]
["*  Choix des équipes : limitation aux équipes 4 étoiles 1/2 maximum. Pour la phase finale (à partir des quarts) choix libre de l’équipe qui reçoit…"]
["* Entendez vous avec vos adversaires de la poule pour trouver un horaire de rencontre vous arrangeant tous deux ( tous les match de poules devront être terminés dans la semaine qui suit le commencement du tournoi)"]
["* Rester fair-play au maximum"]
[]
[]
[]
[]
[]
[]
[]
[]
[]
[]
[]
[]
[]
[]
[null,null,null,null,null,null,null,"Les participants "]
[]
[null,null,null,null,null,null,null,"Tôkio : Yahiko_aka"]
[null,null,null,null,null,null,null,"Tzympoyr: Youssef-DZ"]
[null,null,null,null,null,null,null,"FREEKY: FREEKY07"]
[null,null,null,null,null,null,null,"Samos: Panam750"]
[null,null,null,null,null,null,null,"SKIKDI: Amininho15"]
[null,null,null,null,null,null,null,"WaldDZ: Waldz16"]
[null,null,null,null,null,null,null,"Nahr59: sucrebladi"]
[null,null,null,null,null,null,null,"OMarseille: OMarseille13Mad"]
[null,null,null,null,null,null,null,"Algerien93 carrat: algerien-93600"]
[null,null,null,null,null,null,null,"MethodMan: hamza31"]
[null,null,null,null,null,null,null,"Oasis Ragui08"]
[null,null,null,null,null,null,null,"Versace:  Versace12"]
[null,null,null,null,null,null,null,"Elhaj : elhaj08"]
[null,null,null,null,null,null,null,"mehdi-dz : mehdii-3"]
[null,null,null,null,null,null,null,"Malek: Dz-malek"]

{"sheet":"Scores","index":1,"n_rows":36,"n_cols":93,"rows_kept":36,"cut":false,"hidden":false,"merged":[[26,24,27,25],[26,26,27,26],[10,18,11,18],[18,18,19,18],[18,19,19,19],[12,18,13,18],[12,19,13,19],[16,18,17,18],[16,19,17,19],[23,18,24,18],[23,19,24,19],[21,18,22,21],[21,22,22,22],[10,19,11,19],[30,18,30,23],[29,18,29,23],[1,31,1,38],[2,31,2,38],[1,13,1,20],[6,19,7,19],[8,18,9,18],[8,19,9,19],[6,18,7,18],[1,25,2,26],[6,27,6,28],[7,27,7,28],[8,27,8,28],[5,26,5,28],[26,18,27,19],[26,20,27,20]]}
[null,null,null,null,null,null,null,null,null,null,{"$f":"Data!T49","v":0}]
[null,null,null,null,null,null,null,null,null,null,null,null,null,null,null,null,null,null,null,null,null,null,null,null,null,{"$f":"Data!T50","v":0}]
[]
[null,null,null,null,null,null,null,null,null,null,null,null,null,null,null,null,null,null,null,null,null,null,null,null,null,"-> Téléchargez gratuitement une version d'essai d'Office 2010"]
[null,null,null,null,null,null,null,null,null,null,null,null,null,null,null,null,null,null,null,null,null,null,null,null,null,"->Profitez des promos Office 2010 du moment !"]
[null,{"$f":"Data!T29","v":"Groupe A"},null,null,null,null,null,null,null,null,null,null,null,null,null,null,null,null,{"$f":"Data!T33","v":"Quarts de finale"},null,null,null,"Pen",null,null,null,{"$f":"Data!T41","v":"Statistiques"},null,null,null,null,null,null,null,null,"AJ","AK","AL","AM","AN","AO","AP","AQ","AR","AS","AT","AU","AV","AW","AX","AY","AZ","BA","BB","BC","BD","BE","BF","BG","BH","BI","BJ","BK","BL","BM","BN","BO","BP","BO","BP",null,{"$f":"IF($BL8,IF(E7-F7<0,-0.5,IF(F7-E7<0,0.5,0)),IF($BH8,IF($AY8>$AY9,-0.5,IF($AY8<$AY9,0.5,0)),IF($BI8,IF($AZ8>$AZ9,-0.5, IF($AZ8<$AZ9,0.5,0)),0)))","v":0},null,{"$f":"F11-E11","v":0}]
[null,"2012-06-08","18:00:00",{"$f":"Data!T2","v":"Panam750"},3,1,{"$f":"Data!T3","v":"Ragui08"},null,null,{"$f":"Data!T29","v":"Groupe A"},{"$f":"Data!T38","v":"Pts"},{"$f":"Data!T39","v":"BP"},{"$f":"Data!T40","v":"BC"},{"$f":"\"+/-\"","v":"+/-"},null,null,null,null,"2012-06-21","20:45:00",{"$f":"IF(OR(I9<2),Data!T27,T(J8))","v":"Panam750"},4,null,"(3.3)",null,null,{"$f":"Data!T42","v":"Succès"},{"$f":"IF(ISBLANK(Data!T21),0,Data!T21/100)","v":0.06},null,null,null,null,null,null,null,null,"Rank","Team","Pts","GF","GA","GD","Ag1","Ag2","Ag3","Ag4","Sp1","Sp2","Sp3","Sp4","T123","T124","T134","T234","Rk1","Rk2","Rk3","Rk4","T1234","T123","T124","T134","T234","T12","T13","T14","T23","T24","T34","NoT","sRk1","sRk2","sRk3","sRk4","T1x","T2x","T3x","T4x"," Règle d","T1x","T2x","T3x","T4x","T1234","T123","T124","T134","T234","TXXX?"]
[null,"2012-06-08","20:45:00",{"$f":"Data!T4","v":"Waldz16"},1,2,{"$f":"Data!T5","v":"Yahiko_aka"},null,{"$f":"AH8","v":1},{"$f":"INDEX(AL8:AL11,MATCH(AJ8,$AK8:$AK11,0))","v":"Panam750"},{"$f":"INDEX(AM8:AM11,MATCH(AJ8,$AK8:$AK11,0))","v":5},{"$f":"INDEX(AN8:AN11,MATCH(AJ8,$AK8:$AK11,0))","v":6},{"$f":"INDEX(AO8:AO11,MATCH(AJ8,$AK8:$AK11,0))","v":4},{"$f":"INDEX(AP8:AP11,MATCH(AJ8,$AK8:$AK11,0))","v":2},null,null,null,null,null,null,{"$f":"IF(OR(I18<3,I17<2),Data!T27,T(J17))","v":"algerien-93600"},6,null,"(3.1)",null,null,{"$f":"Data!T43","v":"Position"},{"$f":"IF(ISBLANK(Data!T22),\"\",Data!T22)","v":367},null,null,null,null,null,1,{"$f":"ROUND(AJ8,0)","v":1},{"$f":"MIN(AK8:AK11)","v":0.95000000000000018},{"$f":"SUM(BC8:BF8)+2.45","v":0.95000000000000018},{"$f":"D7","v":"Panam750"},{"$f":"SUM(AQ8:AT8)","v":5},{"$f":"E7+E9+F11","v":6},{"$f":"F7+F9+E11","v":4},{"$f":"AN8-AO8","v":2},"x",{"$f":"IF(ISBLANK(E7),0,IF(E7>F7,3,IF(E7=F7,1,0)))","v":3},{"$f":"IF(ISBLANK(E9),0,IF(E9>F9,3,IF(E9=F9,1,0)))","v":1},{"$f":"IF(ISBLANK(F11),0,IF(F11>E11,3,IF(F11=E11,1,0)))","v":1},"x",{"$f":"(10*(AP8-AP9)+AN8-AN9>0)","v":true},{"$f":"10*(AP8-AP10)+AN8-AN10>0","v":true},{"$f":"10*(AP8-AP11)+AN8-AN11>0","v":true},{"$f":"10000*(AR8+AS8)+(E9-F9+E7-F7)*100+(E9+E7)","v":40205},{"$f":"10000*(AR8+AT8)+(E7-F7+F11-E11)*100+(E7+F11)","v":40204},{"$f":"10000*(AS8+AT8)+(E9-F9+F11-E11)*100+(E9+F11)","v":20003},"x","x",{"$f":"IF($AM8>$AM9,-0.5,IF($AM9>$AM8,0.5,IF(CK8=1,CC8,IF(BX8<>0,BX8,IF(AV8,-0.5,IF(AU9,0.5,BT8))))))","v":-0.5},{"$f":"IF($AM8>$AM10,-0.5,IF($AM10>$AM8,0.5,IF(CK8=1,CD8,IF(BY8<>0,BY8,IF(AW8,-0.5,IF(AU10,0.5,BU8))))))","v":-0.5},{"$f":"IF($AM8>$AM11,-0.5,IF($AM11>$AM8,0.5,IF(CK8=1,CE8,IF(BZ8<>0,BZ8,IF(AX8,-0.5,IF(AU11,0.5,BV8))))))","v":-0.5},{"$f":"AND(AND(AM8=AM9,AM9=AM10,AM10=AM11),AND(AN8=AN9,AN9=AN10,AN10=AN11),AND(AO8=AO9,AO9=AO10,AO10=AO11))","v":false},{"$f":"AND(NOT(BG8),AM8=AM9,AM8=AM10,AN8=AN9,AN8=AN10,AO8=AO9,AO8=AO10)","v":false},{"$f":"AND(NOT(BG8),AM8=AM9,AM8=AM11,AN8=AN9,AN8=AN11,AO8=AO9,AO8=AO11)","v":false},{"$f":"AND(NOT(BG8),AM8=AM10,AM8=AM11,AN8=AN10,AN8=AN11,AO8=AO10,AO8=AO11)","v":false},{"$f":"AND(NOT(BG8),AM9=AM10,AM9=AM11,AN9=AN10,AN9=AN11,AO9=AO10,AO9=AO11)","v":false},{"$f":"AND(NOT(BG8),NOT(BH8),NOT(BI8),AM8=AM9,AN8=AN9,AO8=AO9)","v":false},{"$f":"AND(NOT(BG8),NOT(BH8),NOT(BJ8),AM8=AM10,AN8=AN10,AO8=AO10)","v":false},{"$f":"AND(NOT(BG8),NOT(BI8),NOT(BJ8),AM8=AM11,AN8=AN11,AO8=AO11)","v":false},{"$f":"AND(NOT(BG8),NOT(BH8),NOT(BK8),AM9=AM10,AN9=AN10)","v":false},{"$f":"AND(NOT(BG8),NOT(BI8),NOT(BK8),AM9=AM11,AN9=AN11,AO9=AO11)","v":false},{"$f":"AND(NOT(BG8),NOT(BJ8),NOT(BK8),AM10=AM11,AN10=AN11,AO10=AO11)","v":false},{"$f":"AND(NOT(BG8:BQ8))","v":true},"x",{"$f":"IF($BL8,IF(F7-E7<0,-0.5,IF(E7-F7<0,0.5,0)),IF($BH8,IF($AY8>$AY9,-0.5,IF($AY8<$AY9,0.5,0)),IF($BI8,IF($AZ8>$AZ9,-0.5, IF($AZ8<$AZ9,0.5,0)),0)))","v":0},{"$f":"IF($BM8,IF(F9-E9<0,-0.5,IF(E9-F9<0,0.5,0)),IF($BH8,IF($AY8>$AY10,-0.5,IF($AY8<$AY10,0.5,0)),IF($BJ8,IF($BA8>$BA10,-0.5,IF($BA8<$BA10,0.5,0)),0)))","v":0},{"$f":"IF($BN8,IF(E11-F11<0,-0.5,IF(F11-E11<0,0.5,0)),IF($BI8,IF($AZ8>$AZ11,-0.5,IF($AZ8<$AZ11,0.5,0)),IF($BJ8,IF($BA8>$BA11,-0.5, IF($BA8<$BA11,0.5,0)),0)))","v":0},"x",{"$f":"IF(ISBLANK(E7),0,IF(AR8=0,0.5,IF(AR8=3,-0.5,0)))","v":-0.5},{"$f":"IF(ISBLANK(E9),0,IF(AS8=0,0.5,IF(AS8=3,-0.5,0)))","v":0},{"$f":"IF(ISBLANK(F11),0,IF(AT8=0,0.5,IF(AT8=3,-0.5,0)))","v":0},null,"x",{"$f":"IF(100*AP8+AN8>=MAX(100*AP11+AN11,100*AP10+AN10),-0.5, 0.5)","v":-0.5},{"$f":"IF(100*AP8+AN8>=MAX(100*AP9+AN9,100*AP11+AN11),-0.5, 0.5)","v":-0.5},{"$f":"IF(100*AP8+AN8>=MAX(100*AP9+AN9,100*AP10+AN10),-0.5, 0.5)","v":-0.5},{"$f":"AND(AM8=AM9,AM9=AM10,AM10=AM11)","v":false},{"$f":"IF(AND(NOT(CF8),AM8=AM9,AM8=AM10),1,0)","v":0},{"$f":"IF(AND(NOT(CF8),AM8=AM9,AM8=AM11),1,0)","v":0},{"$f":"IF(AND(NOT(CF8),AM8=AM10,AM8=AM11),1,0)","v":0},{"$f":"IF(AND(NOT(CF8),AM9=AM10,AM9=AM11),1,0)","v":0},{"$f":"IF(OR(CH8,CI8,CJ8),1,0)","v":0}]
[null,"2012-06-12","20:45:00",{"$f":"D7","v":"Panam750"},2,2,{"$f":"D8","v":"Waldz16"},null,{"$f":"AH9","v":2},{"$f":"INDEX(AL8:AL11,MATCH(AJ9,$AK8:$AK11,0))","v":"Yahiko_aka"},{"$f":"INDEX(AM8:AM11,MATCH(AJ9,$AK8:$AK11,0))","v":5},{"$f":"INDEX(AN8:AN11,MATCH(AJ9,$AK8:$AK11,0))","v":3},{"$f":"INDEX(AO8:AO11,MATCH(AJ9,$AK8:$AK11,0))","v":2},{"$f":"INDEX(AP8:AP11,MATCH(AJ9,$AK8:$AK11,0))","v":1},null,null,null,null,"2012-06-22","20:45:00",{"$f":"IF(OR(I17<2),Data!T27,T(J16))","v":"Dz-malek"},6,null,"(4.1)",null,null,{"$f":"Data!T44","v":"Total"},{"$f":"IF(ISBLANK(Data!T23),\"\",Data!T23)","v":2757},null,null,null,null,null,{"$f":"IF(ROUND(AJ9,0)=ROUND(AJ8,0),AH8,2)","v":2},{"$f":"ROUND(AJ9,0)","v":2},{"$f":"MAX(MIN(AK8:AK10),MIN(AK8,AK9,AK11),MIN(AK8,AK10,AK11),MIN(AK9:AK11))","v":1.98},{"$f":"SUM(BC9:BF9)+2.46","v":3.96},{"$f":"G7","v":"Ragui08"},{"$f":"SUM(AQ9:AT9)","v":2},{"$f":"F7+F10+E12","v":3},{"$f":"E7+E10+F12","v":5},{"$f":"AN9-AO9","v":-2},{"$f":"IF(ISBLANK(F7),0,IF(AR8=3,0,IF(AR8=1,1,3)))","v":0},"x",{"$f":"IF(ISBLANK(E12),0,IF(AR10=3,0,IF(AR10=1,1,3)))","v":1},{"$f":"IF(ISBLANK(F10),0,IF(F10>E10,3,IF(F10=E10,1,0)))","v":1},{"$f":"(10*(AP8-AP9)+AN8-AN9<0)","v":false},"x",{"$f":"10*(AP9-AP10)+AN9-AN10>0","v":false},{"$f":"10*(AP9-AP11)+AN9-AN11>0","v":false},{"$f":"10000*(AQ9+AS9)+(F7-E7+E12-F12)*100+(F7+E12)","v":9803},{"$f":"10000*(AQ9+AT9)+(F7-E7+F10-E10)*100+(F7+F10)","v":9801},"x",{"$f":"10000*(AS9+AT9)+(F10-E10+E12-F12)*100+(F10+E12)","v":20002},{"$f":"IF($AM8>$AM9,0.5,IF($AM9>$AM8,-0.5,IF(CK8=1,CB9,IF(BW9<>0,BW9,IF(AV8,0.5,IF(AU9,-0.5,BT8))))))","v":0.5},"x",{"$f":"IF($AM9>$AM10,-0.5,IF($AM10>$AM9,0.5,IF(CK8=1,CD9,IF(BY9<>0,BY9,IF(AW9,-0.5,IF(AV10,0.5,BU9))))))","v":0.5},{"$f":"IF($AM9>$AM11,-0.5,IF($AM11>$AM9,0.5,IF(CK8=1,CE9,IF(BZ9<>0,BZ9,IF(AX9,-0.5,IF(AV11,0.5,BV9))))))","v":0.5},null,null,null,null,null,null,null,null,null,null,null,null,null,"x",{"$f":"IF($BO8,IF(F12-E12<0,-0.5,IF(E12-F12<0,0.5,0)),IF($BH8,IF($AY9>$AY10,-0.5,IF($AY9<$AY10,0.5,0)),IF($BK8,IF($BB9>$BB10,-0.5,IF($BB9<$BB10,0.5,0)),0)))","v":0},{"$f":"IF($BP8,IF(E10-F10<0,-0.5,IF(F10-E10<0,0.5,0)),IF($BI8,IF($AZ9>$AZ11,-0.5,IF($AZ9<$AZ11,0.5,0)),IF($BK8,IF($BB9>$BB11,-0.5,IF($BB9<$BB11,0.5,0)),0)))","v":0},{"$f":"-BX8","v":0.5},"x",{"$f":"IF(ISBLANK(E12),0,IF(AS9=0,0.5,IF(AS9=3,-0.5,0)))","v":0},{"$f":"IF(ISBLANK(F10),0,IF(AT9=0,0.5,IF(AT9=3,-0.5,0)))","v":0},null,{"$f":"IF(100*AP9+AN9>=MAX(100*AP10+AN10,100*AP11+AN11),-0.5, 0.5)","v":0.5},"x",{"$f":"IF(100*AP9+AN9>=MAX(100*AP8+AN8,100*AP11+AN11),-0.5, 0.5)","v":0.5},{"$f":"IF(100*AP9+AN9>=MAX(100*AP10+AN10,100*AP8+AN8),-0.5, 0.5)","v":0.5}]
[null,"2012-06-12","18:00:00",{"$f":"G8","v":"Yahiko_aka"},0,0,{"$f":"G7","v":"Ragui08"},null,{"$f":"AH10","v":3},{"$f":"INDEX(AL8:AL11,MATCH(AJ10,$AK8:$AK11,0))","v":"Waldz16"},{"$f":"INDEX(AM8:AM11,MATCH(AJ10,$AK8:$AK11,0))","v":2},{"$f":"INDEX(AN8:AN11,MATCH(AJ10,$AK8:$AK11,0))","v":5},{"$f":"INDEX(AO8:AO11,MATCH(AJ10,$AK8:$AK11,0))","v":6},{"$f":"INDEX(AP8:AP11,MATCH(AJ10,$AK8:$AK11,0))","v":-1},null,null,null,null,null,null,{"$f":"IF(OR(I10<3,I9<2),Data!T27,T(J9))","v":"Yahiko_aka"},1,null,"(0.2)",null,null,null,null,null,null,null,null,null,{"$f":"IF(ROUND(AJ10,0)=ROUND(AJ9,0),AH9,3)","v":3},{"$f":"ROUND(AJ10,0)","v":3},{"$f":"MIN(MAX(AK8:AK10),MAX(AK8,AK9,AK11),MAX(AK8,AK10,AK11),MAX(AK9:AK11))","v":2.97},{"$f":"SUM(BC10:BF10)+2.47","v":2.97},{"$f":"D8","v":"Waldz16"},{"$f":"SUM(AQ10:AT10)","v":2},{"$f":"E8+F9+F12","v":5},{"$f":"F8+E9+E12","v":6},{"$f":"AN10-AO10","v":-1},{"$f":"IF(ISBLANK(F9),0,IF(AS8=3,0,IF(AS8=1,1,3)))","v":1},{"$f":"IF(ISBLANK(F12),0,IF(F12>E12,3,IF(F12=E12,1,0)))","v":1},"x",{"$f":"IF(ISBLANK(E8),0,IF(E8>F8,3,IF(E8=F8,1,0)))","v":0},{"$f":"10*(AP8-AP10)+AN8-AN10<0","v":false},{"$f":"10*(AP9-AP10)+AN9-AN10<0","v":true},"x",{"$f":"10*(AP10-AP11)+AN10-AN11>0","v":false},{"$f":"10000*(AQ10+AR10)+(F9-E9+F12-E12)*100+(F9+F12)","v":20004},"x",{"$f":"10000*(AQ10+AT10)+(E8-F8+F9-E9)*100+(E8+F9)","v":9903},{"$f":"10000*(AR10+AT10)+(E8-F8+F12-E12)*100+(E8+F12)","v":9903},{"$f":"IF($AM8>$AM10,0.5,IF($AM10>$AM8,-0.5,IF(CK8=1,CB10,IF(BW10<>0,BW10,IF(AW8,0.5,IF(AU10,-0.5,BU8))))))","v":0.5},{"$f":"IF($AM9>$AM10,0.5,IF($AM10>$AM9,-0.5,IF(CK8=1,CC10,IF(BX10<>0,BX10,IF(AW9,0.5,IF(AV10,-0.5,BU9))))))","v":-0.5},"x",{"$f":"IF($AM10>$AM11,-0.5,IF($AM11>$AM10,0.5,IF(CK8=1,CE10,IF(BZ10<>0,BZ10,IF(AX10,-0.5,IF(AW11,0.5,BV10))))))","v":0.5},null,null,null,null,null,null,null,null,null,null,null,null,null,null,"x",{"$f":"IF($BQ8,IF(F8-E8<0,-0.5,IF(E8-F8<0,0.5,0)),IF($BJ8,IF($BA10>$BA11,-0.5,IF($BA10<$BA11,0.5,0)),IF($BK8,IF($BB10>$BB11,-0.5,IF($BB10<$BB11,0.5,0)),0)))","v":0},{"$f":"-BY8","v":0},{"$f":"-BY9","v":0},"x",{"$f":"IF(ISBLANK(E8),0,IF(AT10=0,0.5,IF(AT10=3,-0.5,0)))","v":0.5},null,{"$f":"IF(100*AP10+AN10>=MAX(100*AP11+AN11,100*AP9+AN9),-0.5, 0.5)","v":0.5},{"$f":"IF(100*AP10+AN10>=MAX(100*AP8+AN8,100*AP9+AN9),-0.5, 0.5)","v":0.5},"x",{"$f":"IF(100*AP10+AN10>=MAX(100*AP8+AN8,100*AP9+AN9),-0.5, 0.5)","v":0.5}]
[null,"2012-06-16","20:45:00",{"$f":"G8","v":"Yahiko_aka"},1,1,{"$f":"D7","v":"Panam750"},null,{"$f":"AH11","v":4},{"$f":"INDEX(AL8:AL11,MATCH(AJ11,$AK8:$AK11,0))","v":"Ragui08"},{"$f":"INDEX(AM8:AM11,MATCH(AJ11,$AK8:$AK11,0))","v":2},{"$f":"INDEX(AN8:AN11,MATCH(AJ11,$AK8:$AK11,0))","v":3},{"$f":"INDEX(AO8:AO11,MATCH(AJ11,$AK8:$AK11,0))","v":5},{"$f":"INDEX(AP8:AP11,MATCH(AJ11,$AK8:$AK11,0))","v":-2},null,null,null,null,"2012-06-23","20:45:00",{"$f":"IF(OR(I25<2),Data!T27,T(J24))","v":"Youssef-DZ"},4,null,"(2-4)",null,null,null,null,null,null,null,null,null,{"$f":"IF(ROUND(AJ11,0)=ROUND(AJ10,0),AH10,4)","v":4},{"$f":"ROUND(AJ11,0)","v":4},{"$f":"MAX(AK8:AK11)","v":3.96},{"$f":"SUM(BC11:BF11)+2.48","v":1.98},{"$f":"G8","v":"Yahiko_aka"},{"$f":"SUM(AQ11:AT11)","v":5},{"$f":"F8+E10+E11","v":3},{"$f":"E8+F10+F11","v":2},{"$f":"AN11-AO11","v":1},{"$f":"IF(ISBLANK(E11),0,IF(AT8=3,0,IF(AT8=1,1,3)))","v":1},{"$f":"IF(ISBLANK(E10),0,IF(AT9=3,0,IF(AT9=1,1,3)))","v":1},{"$f":"IF(ISBLANK(F8),0,IF(AT10=3,0,IF(AT10=1,1,3)))","v":3},"x",{"$f":"10*(AP8-AP11)+AN8-AN11<0","v":false},{"$f":"10*(AP9-AP11)+AN9-AN11<0","v":true},{"$f":"10*(AP10-AP11)+AN10-AN11<0","v":true},"x","x",{"$f":"10000*(AQ11+AR11)+(E11-F11+E10-F10)*100+(E11+E10)","v":20001},{"$f":"10000*(AQ11+AS11)+(F8-E8+E11-F11)*100+(F8+E11)","v":40103},{"$f":"10000*(AR11+AS11)+(E10-F10+F8-E8)*100+(E10+F8)","v":40102},{"$f":"IF($AM8>$AM11,0.5,IF($AM11>$AM8,-0.5,IF(CK8=1,CB11,IF(BW11<>0,BW11,IF(AX8,0.5,IF(AU11,-0.5,BV8))))))","v":0.5},{"$f":"IF($AM9>$AM11,0.5,IF($AM11>$AM9,-0.5,IF(CK8=1,BX11,IF(BX11<>0,BX11,IF(AX9,0.5,IF(AV11,-0.5,BV9))))))","v":-0.5},{"$f":"IF($AM10>$AM11,0.5,IF($AM11>$AM10,-0.5,IF(CK8=1,CD11,IF(BY11<>0,BY11,IF(AX10,0.5,IF(AW11,-0.5,BV10))))))","v":-0.5},"x",null,null,null,null,null,null,null,null,null,null,null,null,null,null,null,"x",{"$f":"-BZ8","v":0},{"$f":"-BZ9","v":0},{"$f":"-BZ10","v":-0.5},"x",null,{"$f":"IF(100*AP11+AN11>=MAX(100*AP9+AN9,100*AP10+AN10),-0.5, 0.5)","v":-0.5},{"$f":"IF(100*AP11+AN11>=MAX(100*AP8+AN8,100*AP10+AN10),-0.5, 0.5)","v":0.5},{"$f":"IF(100*AP11+AN11>=MAX(100*AP8+AN8,100*AP9+AN9),-0.5, 0.5)","v":0.5},"x"]
[null,"2012-06-16","20:45:00",{"$f":"G7","v":"Ragui08"},2,2,{"$f":"D8","v":"Waldz16"},null,null,{"$f":"IF(OR(I10<3,I9<2),Data!T27,\" \")","v":" "},null,null,null,null,null,null,null,null,null,null,{"$f":"IF(OR(I34<3,I33<2),Data!T27,T(J33))","v":"Amininho15"},8,null,"(4-2)"]
[null,null,null,null,null,null,null,null,null,null,null,null,null,null,null,null,null,null,"2012-06-24","20:45:00",{"$f":"IF(OR(I33<2),Data!T27,T(J32))","v":"Il_fenomeno60"},6,null,"(4-2)",null,null,null,null,null,null,null,{"$f":"Data!T51","v":"Ne pas toucher cette partie des calculs, sinon :"}]
[null,{"$f":"Data!T30","v":"Groupe B"},null,null,null,null,null,null,null,null,null,null,null,null,null,null,null,null,null,null,{"$f":"IF(OR(I26<3,I25<2),Data!T27,T(J25))","v":"mehdii-3"},2,null,"(0.2)"]
[null,"2012-06-09","18:00:00",{"$f":"Data!T6","v":"sucrebladi"},null,null,{"$f":"Data!T7","v":"hamza31"},null,null,{"$f":"Data!T30","v":"Groupe B"},{"$f":"K7","v":"Pts"},{"$f":"L7","v":"BP"},{"$f":"M7","v":"BC"},{"$f":"\"+/-\"","v":"+/-"},null,null,null,null,null,null,null,null,null,null,null,null,null,null,null,null,null,null,null,null,null,null,"Rank","Team","Pts","GF","GA","GD","Ag1","Ag2","Ag3","Ag4","Sp1","Sp2","Sp3","Sp4","T123","T124","T134","T234","Rk1","Rk2","Rk3","Rk4","T1234","T123","T124","T134","T234","T12","T13","T14","T23","T24","T34","NoT","sRk1","sRk2","sRk3","sRk4","T1x","T2x","T3x","T4x"," Règle d","T1x","T2x","T3x","T4x","T1234","T123","T124","T134","T234","TXXX?"]
[null,"2012-06-09","20:45:00",{"$f":"Data!T8","v":"Dz-malek"},6,1,{"$f":"Data!T9","v":"algerien-93600"},null,{"$f":"AH16","v":1},{"$f":"INDEX(AL16:AL19,MATCH(AJ16,$AK16:$AK19,0))","v":"Dz-malek"},{"$f":"INDEX(AM16:AM19,MATCH(AJ16,$AK16:$AK19,0))","v":9},{"$f":"INDEX(AN16:AN19,MATCH(AJ16,$AK16:$AK19,0))","v":11},{"$f":"INDEX(AO16:AO19,MATCH(AJ16,$AK16:$AK19,0))","v":3},{"$f":"INDEX(AP16:AP19,MATCH(AJ16,$AK16:$AK19,0))","v":8},null,null,null,null,{"$f":"Data!T34","v":"Demi-finales"},null,null,null,"Pen",null,null,null,null,null,null,null,null,null,null,1,{"$f":"ROUND(AJ16,0)","v":1},{"$f":"MIN(AK16:AK19)","v":0.9700000000000002},{"$f":"SUM(BC16:BF16)+2.45","v":3.95},{"$f":"D15","v":"sucrebladi"},{"$f":"SUM(AQ16:AT16)","v":0},{"$f":"E15+E17+F19","v":1},{"$f":"F15+F17+E19","v":5},{"$f":"AN16-AO16","v":-4},"x",{"$f":"IF(ISBLANK(E15),0,IF(E15>F15,3,IF(E15=F15,1,0)))","v":0},{"$f":"IF(ISBLANK(E17),0,IF(E17>F17,3,IF(E17=F17,1,0)))","v":0},{"$f":"IF(ISBLANK(F19),0,IF(F19>E19,3,IF(F19=E19,1,0)))","v":0},"x",{"$f":"(10*(AP16-AP17)+AN16-AN17>0)","v":false},{"$f":"10*(AP16-AP18)+AN16-AN18>0","v":false},{"$f":"10*(AP16-AP19)+AN16-AN19>0","v":false},{"$f":"10000*(AR16+AS16)+(E17-F17+E15-F15)*100+(E17+E15)","v":-99},{"$f":"10000*(AR16+AT16)+(E15-F15+F19-E19)*100+(E15+F19)","v":-300},{"$f":"10000*(AS16+AT16)+(F19-E19+E17-F17)*100+(F19+E17)","v":-399},"x","x",{"$f":"IF($AM16>$AM17,-0.5,IF($AM17>$AM16,0.5,IF(CK16=1,CC16,IF(BX16<>0,BX16,IF(AV16,-0.5,IF(AU17,0.5,BT16))))))","v":0.5},{"$f":"IF($AM16>$AM18,-0.5,IF($AM18>$AM16,0.5,IF(CK16=1,CD16,IF(BY16<>0,BY16,IF(AW16,-0.5,IF(AU18,0.5,BU16))))))","v":0.5},{"$f":"IF($AM16>$AM19,-0.5,IF($AM19>$AM16,0.5,IF(CK16=1,CE16,IF(BZ16<>0,BZ16,IF(AX16,-0.5,IF(AU19,0.5,BV16))))))","v":0.5},{"$f":"AND(AND(AM16=AM17,AM17=AM18,AM18=AM19),AND(AN16=AN17,AN17=AN18,AN18=AN19),AND(AO16=AO17,AO17=AO18,AO18=AO19))","v":false},{"$f":"AND(NOT(BG16),AM16=AM17,AM16=AM18,AN16=AN17,AN16=AN18,AO16=AO17,AO16=AO18)","v":false},{"$f":"AND(NOT(BG16),AM16=AM17,AM16=AM19,AN16=AN17,AN16=AN19,AO16=AO17,AO16=AO19)","v":false},{"$f":"AND(NOT(BG16),AM16=AM18,AM16=AM19,AN16=AN18,AN16=AN19,AO16=AO18,AO16=AO19)","v":false},{"$f":"AND(NOT(BG16),AM17=AM18,AM17=AM19,AN17=AN18,AN17=AN19,AO17=AO18,AO17=AO19)","v":false},{"$f":"AND(NOT(BG16),NOT(BH16),NOT(BI16),AM16=AM17,AN16=AN17,AO16=AO17)","v":false},{"$f":"AND(NOT(BG16),NOT(BH16),NOT(BJ16),AM16=AM18,AN16=AN18,AO16=AO18)","v":false},{"$f":"AND(NOT(BG16),NOT(BI16),NOT(BJ16),AM16=AM19,AN16=AN19,AO16=AO19)","v":false},{"$f":"AND(NOT(BG16),NOT(BH16),NOT(BK16),AM17=AM18,AN17=AN18)","v":false},{"$f":"AND(NOT(BG16),NOT(BI16),NOT(BK16),AM17=AM19,AN17=AN19,AO17=AO19)","v":false},{"$f":"AND(NOT(BG16),NOT(BJ16),NOT(BK16),AM18=AM19,AN18=AN19,AO18=AO19)","v":false},{"$f":"AND(NOT(BG16:BQ16))","v":true},"x",{"$f":"IF($BL16,IF(F15-E15<0,-0.5,IF(E15-F15<0,0.5,0)),IF($BH16,IF($AY16>$AY17,-0.5,IF($AY16<$AY17,0.5,0)),IF($BI16,IF($AZ16>$AZ17,-0.5, IF($AZ16<$AZ17,0.5,0)),0)))","v":0},{"$f":"IF($BM16,IF(F17-E17<0,-0.5,IF(E17-F17<0,0.5,0)),IF($BH16,IF($AY16>$AY18,-0.5,IF($AY16<$AY18,0.5,0)),IF($BJ16,IF($BA16>$BA18,-0.5,IF($BA16<$BA18,0.5,0)),0)))","v":0},{"$f":"IF($BN16,IF(E19-F19<0,-0.5,IF(F19-E19<0,0.5,0)),IF($BI16,IF($AZ16>$AZ19,-0.5,IF($AZ16<$AZ19,0.5,0)),IF($BJ16,IF($BA16>$BA19,-0.5, IF($BA16<$BA19,0.5,0)),0)))","v":0},"x",{"$f":"IF(ISBLANK(E15),0,IF(AR16=0,0.5,IF(AR16=3,-0.5,0)))","v":0},{"$f":"IF(ISBLANK(E17),0,IF(AS16=0,0.5,IF(AS16=3,-0.5,0)))","v":0.5},{"$f":"IF(ISBLANK(F19),0,IF(AT16=0,0.5,IF(AT16=3,-0.5,0)))","v":0.5},null,"x",{"$f":"IF(100*AP16+AN16>=MAX(100*AP19+AN19,100*AP18+AN18),-0.5, 0.5)","v":0.5},{"$f":"IF(100*AP16+AN16>=MAX(100*AP17+AN17,100*AP19+AN19),-0.5, 0.5)","v":0.5},{"$f":"IF(100*AP16+AN16>=MAX(100*AP17+AN17,100*AP18+AN18),-0.5, 0.5)","v":0.5},{"$f":"AND(AM16=AM17,AM17=AM18,AM18=AM19)","v":false},{"$f":"IF(AND(NOT(CF16),AM16=AM17,AM16=AM18),1,0)","v":0},{"$f":"IF(AND(NOT(CF16),AM16=AM17,AM16=AM19),1,0)","v":0},{"$f":"IF(AND(NOT(CF16),AM16=AM18,AM16=AM19),1,0)","v":0},{"$f":"IF(AND(NOT(CF16),AM17=AM18,AM17=AM19),1,0)","v":0},{"$f":"IF(OR(CH16,CI16,CJ16),1,0)","v":0}]
[null,"2012-06-13","20:45:00",{"$f":"D15","v":"sucrebladi"},1,2,{"$f":"D16","v":"Dz-malek"},null,{"$f":"AH17","v":2},{"$f":"INDEX(AL16:AL19,MATCH(AJ17,$AK16:$AK19,0))","v":"algerien-93600"},{"$f":"INDEX(AM16:AM19,MATCH(AJ17,$AK16:$AK19,0))","v":6},{"$f":"INDEX(AN16:AN19,MATCH(AJ17,$AK16:$AK19,0))","v":6},{"$f":"INDEX(AO16:AO19,MATCH(AJ17,$AK16:$AK19,0))","v":7},{"$f":"INDEX(AP16:AP19,MATCH(AJ17,$AK16:$AK19,0))","v":-1},null,null,null,null,"2012-06-27","20:45:00",{"$f":"IF(100*V7+W7>100*V8+W8,U7,IF(100*V7+W7<100*V8+W8,U8,\"-\"))","v":"algerien-93600"},10,null,"(4.2)",null,null,null,null,null,null,null,null,null,{"$f":"IF(ROUND(AJ17,0)=ROUND(AJ16,0),AH16,2)","v":2},{"$f":"ROUND(AJ17,0)","v":2},{"$f":"MAX(MIN(AK16:AK18),MIN(AK16,AK17,AK19),MIN(AK16,AK18,AK19),MIN(AK17:AK19))","v":1.98},{"$f":"SUM(BC17:BF17)+2.46","v":2.96},{"$f":"G15","v":"hamza31"},{"$f":"SUM(AQ17:AT17)","v":0},{"$f":"F15+F18+E20","v":2},{"$f":"E15+E18+F20","v":5},{"$f":"AN17-AO17","v":-3},{"$f":"IF(ISBLANK(F15),0,IF(AR16=3,0,IF(AR16=1,1,3)))","v":0},"x",{"$f":"IF(ISBLANK(E20),0,IF(AR18=3,0,IF(AR18=1,1,3)))","v":0},{"$f":"IF(ISBLANK(F18),0,IF(F18>E18,3,IF(F18=E18,1,0)))","v":0},{"$f":"(10*(AP16-AP17)+AN16-AN17<0)","v":true},"x",{"$f":"10*(AP17-AP18)+AN17-AN18>0","v":false},{"$f":"10*(AP17-AP19)+AN17-AN19>0","v":false},{"$f":"10000*(AQ17+AS17)+(F15-E15+E20-F20)*100+(F15+E20)","v":-199},{"$f":"10000*(AQ17+AT17)+(F15-E15+F18-E18)*100+(F15+F18)","v":-99},"x",{"$f":"10000*(AS17+AT17)+(F18-E18+E20-F20)*100+(F18+E20)","v":-298},{"$f":"IF($AM16>$AM17,0.5,IF($AM17>$AM16,-0.5,IF(CK16=1,CB17,IF(BW17<>0,BW17,IF(AV16,0.5,IF(AU17,-0.5,BT16))))))","v":-0.5},"x",{"$f":"IF($AM17>$AM18,-0.5,IF($AM18>$AM17,0.5,IF(CK16=1,CD17,IF(BY17<>0,BY17,IF(AW17,-0.5,IF(AV18,0.5,BU17))))))","v":0.5},{"$f":"IF($AM17>$AM19,-0.5,IF($AM19>$AM17,0.5,IF(CK16=1,CE17,IF(BZ17<>0,BZ17,IF(AX17,-0.5,IF(AV19,0.5,BV17))))))","v":0.5},null,null,null,null,null,null,null,null,null,null,null,null,null,"x",{"$f":"IF($BO16,IF(F20-E20<0,-0.5,IF(E20-F20<0,0.5,0)),IF($BH16,IF($AY17>$AY18,-0.5,IF($AY17<$AY18,0.5,0)),IF($BK16,IF($BB17>$BB18,-0.5,IF($BB17<$BB18,0.5,0)),0)))","v":0},{"$f":"IF($BP16,IF(E18-F18<0,-0.5,IF(F18-E18<0,0.5,0)),IF($BI16,IF($AZ17>$AZ19,-0.5,IF($AZ17<$AZ19,0.5,0)),IF($BK16,IF($BB17>$BB19,-0.5,IF($BB17<$BB19,0.5,0)),0)))","v":0},{"$f":"-BX16","v":0},"x",{"$f":"IF(ISBLANK(E20),0,IF(AS17=0,0.5,IF(AS17=3,-0.5,0)))","v":0.5},{"$f":"IF(ISBLANK(F18),0,IF(AT17=0,0.5,IF(AT17=3,-0.5,0)))","v":0.5},null,{"$f":"IF(100*AP17+AN17>=MAX(100*AP18+AN18,100*AP19+AN19),-0.5, 0.5)","v":0.5},"x",{"$f":"IF(100*AP17+AN17>=MAX(100*AP16+AN16,100*AP19+AN19),-0.5, 0.5)","v":0.5},{"$f":"IF(100*AP17+AN17>=MAX(100*AP18+AN18,100*AP16+AN16),-0.5, 0.5)","v":0.5}]
[null,"2012-06-13","18:00:00",{"$f":"G16","v":"algerien-93600"},2,1,{"$f":"G15","v":"hamza31"},null,{"$f":"AH18","v":3},{"$f":"INDEX(AL16:AL19,MATCH(AJ18,$AK16:$AK19,0))","v":"hamza31"},{"$f":"INDEX(AM16:AM19,MATCH(AJ18,$AK16:$AK19,0))","v":0},{"$f":"INDEX(AN16:AN19,MATCH(AJ18,$AK16:$AK19,0))","v":2},{"$f":"INDEX(AO16:AO19,MATCH(AJ18,$AK16:$AK19,0))","v":5},{"$f":"INDEX(AP16:AP19,MATCH(AJ18,$AK16:$AK19,0))","v":-3},null,null,null,null,null,null,{"$f":"IF(100*V11+W11>100*V12+W12,U11,IF(100*V11+W11<100*V12+W12,U12,\"-\"))","v":"Amininho15"},7,null,"(5.6)",null,null,null,null,null,null,null,null,null,{"$f":"IF(ROUND(AJ18,0)=ROUND(AJ17,0),AH17,3)","v":3},{"$f":"ROUND(AJ18,0)","v":3},{"$f":"MIN(MAX(AK16:AK18),MAX(AK16,AK17,AK19),MAX(AK16,AK18,AK19),MAX(AK17:AK19))","v":2.96},{"$f":"SUM(BC18:BF18)+2.47","v":0.9700000000000002},{"$f":"D16","v":"Dz-malek"},{"$f":"SUM(AQ18:AT18)","v":9},{"$f":"E16+F17+F20","v":11},{"$f":"F16+E17+E20","v":3},{"$f":"AN18-AO18","v":8},{"$f":"IF(ISBLANK(F17),0,IF(AS16=3,0,IF(AS16=1,1,3)))","v":3},{"$f":"IF(ISBLANK(F20),0,IF(F20>E20,3,IF(F20=E20,1,0)))","v":3},"x",{"$f":"IF(ISBLANK(E16),0,IF(E16>F16,3,IF(E16=F16,1,0)))","v":3},{"$f":"10*(AP16-AP18)+AN16-AN18<0","v":true},{"$f":"10*(AP17-AP18)+AN17-AN18<0","v":true},"x",{"$f":"10*(AP18-AP19)+AN18-AN19>0","v":true},{"$f":"10000*(AQ18+AR18)+(F17-E17+F20-E20)*100+(F17+F20)","v":60305},"x",{"$f":"10000*(AQ18+AT18)+(E16-F16+F17-E17)*100+(E16+F17)","v":60608},{"$f":"10000*(AR18+AT18)+(E16-F16+F20-E20)*100+(E16+F20)","v":60709},{"$f":"IF($AM16>$AM18,0.5,IF($AM18>$AM16,-0.5,IF(CK16=1,CB18,IF(BW18<>0,BW18,IF(AW16,0.5,IF(AU18,-0.5,BU16))))))","v":-0.5},{"$f":"IF($AM17>$AM18,0.5,IF($AM18>$AM17,-0.5,IF(CK16=1,CC18,IF(BX18<>0,BX18,IF(AW17,0.5,IF(AV18,-0.5,BU17))))))","v":-0.5},"x",{"$f":"IF($AM18>$AM19,-0.5,IF($AM19>$AM18,0.5,IF(CK16=1,CE18,IF(BZ18<>0,BZ18,IF(AX18,-0.5,IF(AW19,0.5,BV18))))))","v":-0.5},null,null,null,null,null,null,null,null,null,null,null,null,null,null,"x",{"$f":"IF($BQ16,IF(F16-E16<0,-0.5,IF(E16-F16<0,0.5,0)),IF($BJ16,IF($BA18>$BA19,-0.5,IF($BA18<$BA19,0.5,0)),IF($BK16,IF($BB18>$BB19,-0.5,IF($BB18<$BB19,0.5,0)),0)))","v":0},{"$f":"-BY16","v":-0.5},{"$f":"-BY17","v":-0.5},"x",{"$f":"IF(ISBLANK(E16),0,IF(AT18=0,0.5,IF(AT18=3,-0.5,0)))","v":-0.5},null,{"$f":"IF(100*AP18+AN18>=MAX(100*AP19+AN19,100*AP17+AN17),-0.5, 0.5)","v":-0.5},{"$f":"IF(100*AP18+AN18>=MAX(100*AP16+AN16,100*AP17+AN17),-0.5, 0.5)","v":-0.5},"x",{"$f":"IF(100*AP18+AN18>=MAX(100*AP16+AN16,100*AP17+AN17),-0.5, 0.5)","v":-0.5}]
[null,"2012-06-17","20:45:00",{"$f":"G16","v":"algerien-93600"},3,0,{"$f":"D15","v":"sucrebladi"},null,{"$f":"AH19","v":4},{"$f":"INDEX(AL16:AL19,MATCH(AJ19,$AK16:$AK19,0))","v":"sucrebladi"},{"$f":"INDEX(AM16:AM19,MATCH(AJ19,$AK16:$AK19,0))","v":0},{"$f":"INDEX(AN16:AN19,MATCH(AJ19,$AK16:$AK19,0))","v":1},{"$f":"INDEX(AO16:AO19,MATCH(AJ19,$AK16:$AK19,0))","v":5},{"$f":"INDEX(AP16:AP19,MATCH(AJ19,$AK16:$AK19,0))","v":-4},null,null,null,null,"2012-06-28","20:45:00",{"$f":"IF(100*V9+W9>100*V10+W10,U9,IF(100*V9+W9<100*V10+W10,U10,\"-\"))","v":"Dz-malek"},3,null,"(1.0)",null,null,null,null,null,null,null,null,null,{"$f":"IF(ROUND(AJ19,0)=ROUND(AJ18,0),AH18,4)","v":4},{"$f":"ROUND(AJ19,0)","v":4},{"$f":"MAX(AK16:AK19)","v":3.95},{"$f":"SUM(BC19:BF19)+2.48","v":1.98},{"$f":"G16","v":"algerien-93600"},{"$f":"SUM(AQ19:AT19)","v":6},{"$f":"F16+E18+E19","v":6},{"$f":"E16+F18+F19","v":7},{"$f":"AN19-AO19","v":-1},{"$f":"IF(ISBLANK(E19),0,IF(AT16=3,0,IF(AT16=1,1,3)))","v":3},{"$f":"IF(ISBLANK(E18),0,IF(AT17=3,0,IF(AT17=1,1,3)))","v":3},{"$f":"IF(ISBLANK(F16),0,IF(AT18=3,0,IF(AT18=1,1,3)))","v":0},"x",{"$f":"10*(AP16-AP19)+AN16-AN19<0","v":true},{"$f":"10*(AP17-AP19)+AN17-AN19<0","v":true},{"$f":"10*(AP18-AP19)+AN18-AN19<0","v":false},"x","x",{"$f":"10000*(AQ19+AR19)+(E18-F18+E19-F19)*100+(E18+E19)","v":60405},{"$f":"10000*(AQ19+AS19)+(E19-F19+F16-E16)*100+(E19+F16)","v":29804},{"$f":"10000*(AR19+AS19)+(E18-F18+F16-E16)*100+(E18+F16)","v":29603},{"$f":"IF($AM16>$AM19,0.5,IF($AM19>$AM16,-0.5,IF(CK16=1,CB19,IF(BW19<>0,BW19,IF(AX16,0.5,IF(AU19,-0.5,BV16))))))","v":-0.5},{"$f":"IF($AM17>$AM19,0.5,IF($AM19>$AM17,-0.5,IF(CK16=1,BX19,IF(BX19<>0,BX19,IF(AX17,0.5,IF(AV19,-0.5,BV17))))))","v":-0.5},{"$f":"IF($AM18>$AM19,0.5,IF($AM19>$AM18,-0.5,IF(CK16=1,CD19,IF(BY19<>0,BY19,IF(AX18,0.5,IF(AW19,-0.5,BV18))))))","v":0.5},"x",null,null,null,null,null,null,null,null,null,null,null,null,null,null,null,"x",{"$f":"-BZ16","v":-0.5},{"$f":"-BZ17","v":-0.5},{"$f":"-BZ18","v":0.5},"x",null,{"$f":"IF(100*AP19+AN19>=MAX(100*AP17+AN17,100*AP18+AN18),-0.5, 0.5)","v":0.5},{"$f":"IF(100*AP19+AN19>=MAX(100*AP16+AN16,100*AP18+AN18),-0.5, 0.5)","v":0.5},{"$f":"IF(100*AP19+AN19>=MAX(100*AP16+AN16,100*AP17+AN17),-0.5, 0.5)","v":-0.5},"x"]
[null,"2012-06-17","20:45:00",{"$f":"G15","v":"hamza31"},1,3,{"$f":"D16","v":"Dz-malek"},null,null,{"$f":"IF(OR(I18<3,I17<2),Data!T27,\" \")","v":" "},null,null,null,null,null,null,null,null,null,null,{"$f":"IF(100*V13+W13>100*V14+W14,U13,IF(100*V13+W13<100*V14+W14,U14,\"-\"))","v":"Il_fenomeno60"},1,null,"(1.2)"]
[]
[null,{"$f":"Data!T31","v":"Groupe C"},null,null,null,null,null,null,null,null,null,null,null,null,null,null,null,null,{"$f":"Data!T35","v":"Finale"},null,null,null,"Pen",null,null,null,null,null,null,null,null,null,null,null,null,null,null,null,null,null,null,null,null,null,null,null,null,null,null,null,null,null,null,null,null,null,null,null,null,null,null,null,null,null,null,null,null,null,null,null,null,null,null,null,null,null,null,null,null,null,null,null,null,null,null,null,null,null,null,"Egalité 3 équipes"]
[null,"2012-06-10","18:00:00",{"$f":"Data!T10","v":"OMarseille13Mad"},null,null,{"$f":"Data!T11","v":"Versace12"},null,null,{"$f":"Data!T31","v":"Groupe C"},{"$f":"K7","v":"Pts"},{"$f":"L7","v":"BP"},{"$f":"M7","v":"BC"},{"$f":"\"+/-\"","v":"+/-"},null,null,null,null,null,null,null,null,null,null,null,null,null,null,null,null,null,null,null,null,null,null,"Rank","Team","Pts","GF","GA","GD","Ag1","Ag2","Ag3","Ag4","Sp1","Sp2","Sp3","Sp4","T123","T124","T134","T234","Rk1","Rk2","Rk3","Rk4","T1234","T123","T124","T134","T234","T12","T13","T14","T23","T24","T34","NoT","sRk1","sRk2","sRk3","sRk4","T1x","T2x","T3x","T4x"," Règle d","T1x","T2x","T3x","T4x","T1234","T123","T124","T134","T234","TXXX?",1,2,3,4]
[null,"2012-06-10","20:45:00",{"$f":"Data!T12","v":"Youssef-DZ"},1,0,{"$f":"Data!T13","v":"mehdii-3"},null,{"$f":"AH24","v":1},{"$f":"INDEX(AL24:AL27,MATCH(AJ24,$AK24:$AK27,0))","v":"Youssef-DZ"},{"$f":"INDEX(AM24:AM27,MATCH(AJ24,$AK24:$AK27,0))","v":9},{"$f":"INDEX(AN24:AN27,MATCH(AJ24,$AK24:$AK27,0))","v":6},{"$f":"INDEX(AO24:AO27,MATCH(AJ24,$AK24:$AK27,0))","v":1},{"$f":"INDEX(AP24:AP27,MATCH(AJ24,$AK24:$AK27,0))","v":5},null,null,null,null,"2012-07-01","20:45:00",{"$f":"IF(100*V17+W17>100*V18+W18,U17,IF(100*V17+W17<100*V18+W18,U18,\"-\"))","v":"algerien-93600"},1,null,"(1.2)",null,null,null,null,null,null,null,null,null,1,{"$f":"ROUND(AJ24,0)","v":1},{"$f":"MIN(AK24:AK27)","v":0.9700000000000002},{"$f":"SUM(BC24:BF24)+2.45","v":3.95},{"$f":"D23","v":"OMarseille13Mad"},{"$f":"SUM(AQ24:AT24)","v":0},{"$f":"E23+E25+F27","v":0},{"$f":"F23+F25+E27","v":3},{"$f":"AN24-AO24","v":-3},"x",{"$f":"IF(ISBLANK(E23),0,IF(E23>F23,3,IF(E23=F23,1,0)))","v":0},{"$f":"IF(ISBLANK(E25),0,IF(E25>F25,3,IF(E25=F25,1,0)))","v":0},{"$f":"IF(ISBLANK(F27),0,IF(F27>E27,3,IF(F27=E27,1,0)))","v":0},"x",{"$f":"(10*(AP24-AP25)+AN24-AN25>0)","v":false},{"$f":"10*(AP24-AP26)+AN24-AN26>0","v":false},{"$f":"10*(AP24-AP27)+AN24-AN27>0","v":false},{"$f":"10000*(AR24+AS24)+(E25-F25+E23-F23)*100+(E25+E23)","v":-300},{"$f":"10000*(AR24+AT24)+(E23-F23+F27-E27)*100+(E23+F27)+(AY24+BA24)/1000000","v":-5.9999999999999995E-4},{"$f":"10000*(AS24+AT24)+(F27-E27+E25-F25)*100+(F27+E25)","v":-300},"x","x",{"$f":"IF($AM24>$AM25,-0.5,IF($AM25>$AM24,0.5,IF(CK24=1,CC24,IF(BX24<>0,BX24,IF(AV24,-0.5,IF(AU25,0.5,BT24))))))","v":0.5},{"$f":"IF($AM24>$AM26,-0.5,IF($AM26>$AM24,0.5,IF(CK24=1,CD24,IF(BY24<>0,BY24,IF(AW24,-0.5,IF(AU26,0.5,BU24))))))","v":0.5},{"$f":"IF($AM24>$AM27,-0.5,IF($AM27>$AM24,0.5,IF(CK24=1,CE24,IF(BZ24<>0,BZ24,IF(AX24,-0.5,IF(AU27,0.5,BV24))))))","v":0.5},{"$f":"AND(AND(AM24=AM25,AM25=AM26,AM26=AM27),AND(AN24=AN25,AN25=AN26,AN26=AN27),AND(AO24=AO25,AO25=AO26,AO26=AO27))","v":false},{"$f":"AND(NOT(BG24),AM24=AM25,AM24=AM26,AN24=AN25,AN24=AN26,AO24=AO25,AO24=AO26)","v":false},{"$f":"AND(NOT(BG24),AM24=AM25,AM24=AM27,AN24=AN25,AN24=AN27,AO24=AO25,AO24=AO27)","v":false},{"$f":"AND(NOT(BG24),AM24=AM26,AM24=AM27,AN24=AN26,AN24=AN27,AO24=AO26,AO24=AO27)","v":false},{"$f":"AND(NOT(BG24),AM25=AM26,AM25=AM27,AN25=AN26,AN25=AN27,AO25=AO26,AO25=AO27)","v":false},{"$f":"AND(NOT(BG24),NOT(BH24),NOT(BI24),AM24=AM25,AN24=AN25,AO24=AO25)","v":false},{"$f":"AND(NOT(BG24),NOT(BH24),NOT(BJ24),AM24=AM26,AN24=AN26,AO24=AO26)","v":false},{"$f":"AND(NOT(BG24),NOT(BI24),NOT(BJ24),AM24=AM27,AN24=AN27,AO24=AO27)","v":false},{"$f":"AND(NOT(BG24),NOT(BH24),NOT(BK24),AM25=AM26,AN25=AN26)","v":false},{"$f":"AND(NOT(BG24),NOT(BI24),NOT(BK24),AM25=AM27,AN25=AN27,AO25=AO27)","v":false},{"$f":"AND(NOT(BG24),NOT(BJ24),NOT(BK24),AM26=AM27,AN26=AN27,AO26=AO27)","v":false},{"$f":"AND(NOT(BG24:BQ24))","v":true},"x",{"$f":"IF($BL24,IF(F23-E23<0,-0.5,IF(E23-F23<0,0.5,0)),IF($BH24,IF($AY24>$AY25,-0.5,IF($AY24<$AY25,0.5,0)),IF($BI24,IF($AZ24>$AZ25,-0.5, IF($AZ24<$AZ25,0.5,0)),0)))","v":0},{"$f":"IF($BM24,IF(F25-E25<0,-0.5,IF(E25-F25<0,0.5,0)),IF($BH24,IF($AY24>$AY26,-0.5,IF($AY24<$AY26,0.5,0)),IF($BJ24,IF($BA24>$BA26,-0.5,IF($BA24<$BA26,0.5,0)),0)))","v":0},{"$f":"IF($BN24,IF(E27-F27<0,-0.5,IF(F27-E27<0,0.5,0)),IF($BI24,IF($AZ24>$AZ27,-0.5,IF($AZ24<$AZ27,0.5,0)),IF($BJ24,IF($BA24>$BA27,-0.5, IF($BA24<$BA27,0.5,0)),0)))","v":0},"x",{"$f":"IF(ISBLANK(E23),0,IF(AR24=0,0.5,IF(AR24=3,-0.5,0)))","v":0},{"$f":"IF(ISBLANK(E25),0,IF(AS24=0,0.5,IF(AS24=3,-0.5,0)))","v":0.5},{"$f":"IF(ISBLANK(F27),0,IF(AT24=0,0.5,IF(AT24=3,-0.5,0)))","v":0},null,"x",{"$f":"CN24","v":0},{"$f":"CN24","v":0},{"$f":"CN24","v":0},{"$f":"AND(AM24=AM25,AM25=AM26,AM26=AM27)","v":false},{"$f":"IF(AND(NOT(CF24),AM24=AM25,AM24=AM26),1,0)","v":0},{"$f":"IF(AND(NOT(CF24),AM24=AM25,AM24=AM27),1,0)","v":0},{"$f":"IF(AND(NOT(CF24),AM24=AM26,AM24=AM27),1,0)","v":0},{"$f":"IF(AND(NOT(CF24),AM25=AM26,AM25=AM27),1,0)","v":0},{"$f":"IF(OR(CH24,CI24,CJ24),1,0)","v":0},"x",null,{"$f":"IF(AZ24>MAX(AZ25,AZ27),-0.5,IF(AZ24<MIN(AZ25,AZ27),0.5,0))","v":0}]
[null,"2012-06-14","20:45:00",{"$f":"D23","v":"OMarseille13Mad"},0,3,{"$f":"D24","v":"Youssef-DZ"},null,{"$f":"AH25","v":2},{"$f":"INDEX(AL24:AL27,MATCH(AJ25,$AK24:$AK27,0))","v":"mehdii-3"},{"$f":"INDEX(AM24:AM27,MATCH(AJ25,$AK24:$AK27,0))","v":3},{"$f":"INDEX(AN24:AN27,MATCH(AJ25,$AK24:$AK27,0))","v":3},{"$f":"INDEX(AO24:AO27,MATCH(AJ25,$AK24:$AK27,0))","v":3},{"$f":"INDEX(AP24:AP27,MATCH(AJ25,$AK24:$AK27,0))","v":0},null,null,null,null,null,null,{"$f":"IF(100*V19+W19>100*V20+W20,U19,IF(100*V19+W19<100*V20+W20,U20,\"-\"))","v":"Dz-malek"},4,null,"(2.0)",null,null,null,null,null,null,null,null,null,{"$f":"IF(ROUND(AJ25,0)=ROUND(AJ24,0),AH24,2)","v":2},{"$f":"ROUND(AJ25,0)","v":2},{"$f":"MAX(MIN(AK24:AK26),MIN(AK24,AK25,AK27),MIN(AK24,AK26,AK27),MIN(AK25:AK27))","v":1.98},{"$f":"SUM(BC25:BF25)+2.46","v":2.96},{"$f":"G23","v":"Versace12"},{"$f":"SUM(AQ25:AT25)","v":0},{"$f":"F23+F26+E28","v":3},{"$f":"E23+E26+F28","v":5},{"$f":"AN25-AO25","v":-2},{"$f":"IF(ISBLANK(F23),0,IF(AR24=3,0,IF(AR24=1,1,3)))","v":0},"x",{"$f":"IF(ISBLANK(E28),0,IF(AR26=3,0,IF(AR26=1,1,3)))","v":0},{"$f":"IF(ISBLANK(F26),0,IF(F26>E26,3,IF(F26=E26,1,0)))","v":0},{"$f":"(10*(AP24-AP25)+AN24-AN25<0)","v":true},"x",{"$f":"10*(AP25-AP26)+AN25-AN26>0","v":false},{"$f":"10*(AP25-AP27)+AN25-AN27>0","v":false},{"$f":"10000*(AQ25+AS25)+(F23-E23+E28-F28)*100+(F23+E28)","v":-99},{"$f":"10000*(AQ25+AT25)+(F23-E23+F26-E26)*100+(F23+F26)+(AY25+BB25)/1000000","v":-98.000296000000006},"x",{"$f":"10000*(AS25+AT25)+(F26-E26+E28-F28)*100+(F26+E28)","v":-197},{"$f":"IF($AM24>$AM25,0.5,IF($AM25>$AM24,-0.5,IF(CK24=1,CB25,IF(BW25<>0,BW25,IF(AV24,0.5,IF(AU25,-0.5,BT24))))))","v":-0.5},"x",{"$f":"IF($AM25>$AM26,-0.5,IF($AM26>$AM25,0.5,IF(CK24=1,CD25,IF(BY25<>0,BY25,IF(AW25,-0.5,IF(AV26,0.5,BU25))))))","v":0.5},{"$f":"IF($AM25>$AM27,-0.5,IF($AM27>$AM25,0.5,IF(CK24=1,CE25,IF(BZ25<>0,BZ25,IF(AX25,-0.5,IF(AV27,0.5,BV25))))))","v":0.5},null,null,null,null,null,null,null,null,null,null,null,null,null,"x",{"$f":"IF($BO24,IF(F28-E28<0,-0.5,IF(E28-F28<0,0.5,0)),IF($BH24,IF($AY25>$AY26,-0.5,IF($AY25<$AY26,0.5,0)),IF($BK24,IF($BB25>$BB26,-0.5,IF($BB25<$BB26,0.5,0)),0)))","v":0},{"$f":"IF($BP24,IF(E26-F26<0,-0.5,IF(F26-E26<0,0.5,0)),IF($BI24,IF($AZ25>$AZ27,-0.5,IF($AZ25<$AZ27,0.5,0)),IF($BK24,IF($BB25>$BB27,-0.5,IF($BB25<$BB27,0.5,0)),0)))","v":0},{"$f":"-BX24","v":0},"x",{"$f":"IF(ISBLANK(E28),0,IF(AS25=0,0.5,IF(AS25=3,-0.5,0)))","v":0.5},{"$f":"IF(ISBLANK(F26),0,IF(AT25=0,0.5,IF(AT25=3,-0.5,0)))","v":0.5},null,{"$f":"CN25","v":0.5},"x",{"$f":"CN25","v":0.5},{"$f":"CN25","v":0.5},null,null,null,null,null,null,null,"x",{"$f":"IF(AZ25>MAX(AZ24,AZ27),-0.5,IF(AZ25<MIN(AZ24,AZ27),0.5,0))","v":0.5}]
[null,"2012-06-14","18:00:00",{"$f":"G24","v":"mehdii-3"},3,2,{"$f":"G23","v":"Versace12"},null,{"$f":"AH26","v":3},{"$f":"INDEX(AL24:AL27,MATCH(AJ26,$AK24:$AK27,0))","v":"Versace12"},{"$f":"INDEX(AM24:AM27,MATCH(AJ26,$AK24:$AK27,0))","v":0},{"$f":"INDEX(AN24:AN27,MATCH(AJ26,$AK24:$AK27,0))","v":3},{"$f":"INDEX(AO24:AO27,MATCH(AJ26,$AK24:$AK27,0))","v":5},{"$f":"INDEX(AP24:AP27,MATCH(AJ26,$AK24:$AK27,0))","v":-2},null,null,null,null,null,null,null,null,null,null,null,null,null,null,null,null,null,null,null,{"$f":"IF(ROUND(AJ26,0)=ROUND(AJ25,0),AH25,3)","v":3},{"$f":"ROUND(AJ26,0)","v":3},{"$f":"MIN(MAX(AK24:AK26),MAX(AK24,AK25,AK27),MAX(AK24,AK26,AK27),MAX(AK25:AK27))","v":2.96},{"$f":"SUM(BC26:BF26)+2.47","v":0.9700000000000002},{"$f":"D24","v":"Youssef-DZ"},{"$f":"SUM(AQ26:AT26)","v":9},{"$f":"E24+F25+F28","v":6},{"$f":"F24+E25+E28","v":1},{"$f":"AN26-AO26","v":5},{"$f":"IF(ISBLANK(F25),0,IF(AS24=3,0,IF(AS24=1,1,3)))","v":3},{"$f":"IF(ISBLANK(F28),0,IF(F28>E28,3,IF(F28=E28,1,0)))","v":3},"x",{"$f":"IF(ISBLANK(E24),0,IF(E24>F24,3,IF(E24=F24,1,0)))","v":3},{"$f":"10*(AP24-AP26)+AN24-AN26<0","v":true},{"$f":"10*(AP25-AP26)+AN25-AN26<0","v":true},"x",{"$f":"10*(AP26-AP27)+AN26-AN27>0","v":true},{"$f":"10000*(AQ26+AR26)+(F25-E25+F28-E28)*100+(F25+F28)","v":60405},"x",{"$f":"10000*(AQ26+AT26)+(E24-F24+F25-E25)*100+(E24+F25)","v":60404},{"$f":"10000*(AR26+AT26)+(E24-F24+F28-E28)*100+(E24+F28)","v":60203},{"$f":"IF($AM24>$AM26,0.5,IF($AM26>$AM24,-0.5,IF(CK24=1,CB26,IF(BW26<>0,BW26,IF(AW24,0.5,IF(AU26,-0.5,BU24))))))","v":-0.5},{"$f":"IF($AM25>$AM26,0.5,IF($AM26>$AM25,-0.5,IF(CK24=1,CC26,IF(BX26<>0,BX26,IF(AW25,0.5,IF(AV26,-0.5,BU25))))))","v":-0.5},"x",{"$f":"IF($AM26>$AM27,-0.5,IF($AM27>$AM26,0.5,IF(CK24=1,CE26,IF(BZ26<>0,BZ26,IF(AX26,-0.5,IF(AW27,0.5,BV26))))))","v":-0.5},null,null,null,null,null,null,null,null,null,null,null,null,null,null,"x",{"$f":"IF($BQ24,IF(F24-E24<0,-0.5,IF(E24-F24<0,0.5,0)),IF($BJ24,IF($BA26>$BA27,-0.5,IF($BA26<$BA27,0.5,0)),IF($BK24,IF($BB26>$BB27,-0.5,IF($BB26<$BB27,0.5,0)),0)))","v":0},{"$f":"-BY24","v":-0.5},{"$f":"-BY25","v":-0.5},"x",{"$f":"IF(ISBLANK(E24),0,IF(AT26=0,0.5,IF(AT26=3,-0.5,0)))","v":-0.5},null,{"$f":"IF(100*AP26+AN26>=MAX(100*AP27+AN27,100*AP25+AN25),-0.5, 0.5)","v":-0.5},{"$f":"IF(100*AP26+AN26>=MAX(100*AP24+AN24,100*AP25+AN25),-0.5, 0.5)","v":-0.5},"x",{"$f":"IF(100*AP26+AN26>=MAX(100*AP24+AN24,100*AP25+AN25),-0.5, 0.5)","v":-0.5},null,null,null,null,null,null,null,null,"x"]
[null,"2012-06-18","20:45:00",{"$f":"G24","v":"mehdii-3"},null,null,{"$f":"D23","v":"OMarseille13Mad"},null,{"$f":"AH27","v":4},{"$f":"INDEX(AL24:AL27,MATCH(AJ27,$AK24:$AK27,0))","v":"OMarseille13Mad"},{"$f":"INDEX(AM24:AM27,MATCH(AJ27,$AK24:$AK27,0))","v":0},{"$f":"INDEX(AN24:AN27,MATCH(AJ27,$AK24:$AK27,0))","v":0},{"$f":"INDEX(AO24:AO27,MATCH(AJ27,$AK24:$AK27,0))","v":3},{"$f":"INDEX(AP24:AP27,MATCH(AJ27,$AK24:$AK27,0))","v":-3},null,null,null,null,{"$f":"Data!T36","v":"Vainqueur"},null,{"$f":"IF(100*V24+W24>100*V25+W25,U24,IF(100*V25+W25>100*V24+W24,U25,\"-\"))","v":"Dz-malek"},null,null,null,{"$f":"Data!T37","v":"Finaliste"},null,{"$f":"IF(100*V24+W24>100*V25+W25,U25,IF(100*V25+W25>100*V24+W24,U24,\"-\"))","v":"algerien-93600"},null,null,null,null,null,null,{"$f":"IF(ROUND(AJ27,0)=ROUND(AJ26,0),AH26,4)","v":4},{"$f":"ROUND(AJ27,0)","v":4},{"$f":"MAX(AK24:AK27)","v":3.95},{"$f":"SUM(BC27:BF27)+2.48","v":1.98},{"$f":"G24","v":"mehdii-3"},{"$f":"SUM(AQ27:AT27)","v":3},{"$f":"F24+E26+E27","v":3},{"$f":"E24+F26+F27","v":3},{"$f":"AN27-AO27","v":0},{"$f":"IF(ISBLANK(E27),0,IF(AT24=3,0,IF(AT24=1,1,3)))","v":0},{"$f":"IF(ISBLANK(E26),0,IF(AT25=3,0,IF(AT25=1,1,3)))","v":3},{"$f":"IF(ISBLANK(F24),0,IF(AT26=3,0,IF(AT26=1,1,3)))","v":0},"x",{"$f":"10*(AP24-AP27)+AN24-AN27<0","v":true},{"$f":"10*(AP25-AP27)+AN25-AN27<0","v":true},{"$f":"10*(AP26-AP27)+AN26-AN27<0","v":false},"x","x",{"$f":"10000*(AQ27+AR27)+(E26-F26+E27-F27)*100+(E26+E27)+(BA27+BB27)/1000000","v":30103.029902999999},{"$f":"10000*(AQ27+AS27)+(E27-F27+F24-E24)*100+(E27+F24)","v":-100},{"$f":"10000*(AR27+AS27)+(E26-F26+F24-E24)*100+(E26+F24)","v":30003},{"$f":"IF($AM24>$AM27,0.5,IF($AM27>$AM24,-0.5,IF(CK24=1,CB27,IF(BW27<>0,BW27,IF(AX24,0.5,IF(AU27,-0.5,BV24))))))","v":-0.5},{"$f":"IF($AM25>$AM27,0.5,IF($AM27>$AM25,-0.5,IF(CK24=1,BX27,IF(BX27<>0,BX27,IF(AX25,0.5,IF(AV27,-0.5,BV25))))))","v":-0.5},{"$f":"IF($AM26>$AM27,0.5,IF($AM27>$AM26,-0.5,IF(CK24=1,CD27,IF(BY27<>0,BY27,IF(AX26,0.5,IF(AW27,-0.5,BV26))))))","v":0.5},"x",null,null,null,null,null,null,null,null,null,null,null,null,null,null,null,"x",{"$f":"-BZ24","v":0},{"$f":"-BZ25","v":-0.5},{"$f":"-BZ26","v":0.5},"x",null,{"$f":"CN27","v":-0.5},{"$f":"CN27","v":-0.5},{"$f":"CN27","v":-0.5},"x",null,null,null,null,null,null,null,null,{"$f":"IF(AZ27>MAX(AZ25,AZ24),-0.5,0.5)","v":-0.5},"x"]
[null,"2012-06-18","20:45:00",{"$f":"G23","v":"Versace12"},1,2,{"$f":"D24","v":"Youssef-DZ"},null,null,{"$f":"IF(OR(I26<3,I25<2),Data!T27,\" \")","v":" "}]
[]
[null,{"$f":"Data!T32","v":"Groupe D"}]
[null,"2012-06-11","18:00:00",{"$f":"Data!T16","v":"elhaj08"},0,3,{"$f":"Data!T17","v":"Il_fenomeno60"},null,null,{"$f":"Data!T32","v":"Groupe D"},{"$f":"K7","v":"Pts"},{"$f":"L7","v":"BP"},{"$f":"M7","v":"BC"},{"$f":"\"+/-\"","v":"+/-"},null,null,null,null,null,null,null,null,null,null,null,null,null,null,null,null,null,null,null,null,null,null,"Rank","Team","Pts","GF","GA","GD","Ag1","Ag2","Ag3","Ag4","Sp1","Sp2","Sp3","Sp4","T123","T124","T134","T234","Rk1","Rk2","Rk3","Rk4","T1234","T123","T124","T134","T234","T12","T13","T14","T23","T24","T34","NoT","sRk1","sRk2","sRk3","sRk4","T1x","T2x","T3x","T4x"," Règle d","T1x","T2x","T3x","T4x","T1234","T123","T124","T134","T234","TXXX?"]
[null,"2012-06-11","20:45:00",{"$f":"Data!T14","v":"FREEKY07"},0,2,{"$f":"Data!T15","v":"Amininho15"},null,{"$f":"AH32","v":1},{"$f":"INDEX(AL32:AL35,MATCH(AJ32,$AK32:$AK35,0))","v":"Il_fenomeno60"},{"$f":"INDEX(AM32:AM35,MATCH(AJ32,$AK32:$AK35,0))","v":9},{"$f":"INDEX(AN32:AN35,MATCH(AJ32,$AK32:$AK35,0))","v":11},{"$f":"INDEX(AO32:AO35,MATCH(AJ32,$AK32:$AK35,0))","v":2},{"$f":"INDEX(AP32:AP35,MATCH(AJ32,$AK32:$AK35,0))","v":9},null,null,null,null,null,null,null,null,null,null,null,null,null,null,null,null,null,null,null,1,{"$f":"ROUND(AJ32,0)","v":1},{"$f":"MIN(AK32:AK35)","v":0.96},{"$f":"SUM(BC32:BF32)+2.45","v":3.45},{"$f":"D31","v":"elhaj08"},{"$f":"SUM(AQ32:AT32)","v":0},{"$f":"E31+E33+F35","v":1},{"$f":"F31+F33+E35","v":5},{"$f":"AN32-AO32","v":-4},"x",{"$f":"IF(ISBLANK(E31),0,IF(E31>F31,3,IF(E31=F31,1,0)))","v":0},{"$f":"IF(ISBLANK(E33),0,IF(E33>F33,3,IF(E33=F33,1,0)))","v":0},{"$f":"IF(ISBLANK(F35),0,IF(F35>E35,3,IF(F35=E35,1,0)))","v":0},"x",{"$f":"(10*(AP32-AP33)+AN32-AN33>0)","v":false},{"$f":"10*(AP32-AP34)+AN32-AN34>0","v":false},{"$f":"10*(AP32-AP35)+AN32-AN35>0","v":false},{"$f":"10000*(AR32+AS32)+(E33-F33+E31-F31)*100+(E33+E31)","v":-300},{"$f":"10000*(AR32+AT32)+(E31-F31+F35-E35)*100+(E31+F35)","v":-399},{"$f":"10000*(AS32+AT32)+(F35-E35+E33-F33)*100+(F35+E33)","v":-99},"x","x",{"$f":"IF($AM32>$AM33,-0.5,IF($AM33>$AM32,0.5,IF(CK32=1,CC32,IF(BX32<>0,BX32,IF(AV32,-0.5,IF(AU33,0.5,BT32))))))","v":0.5},{"$f":"IF($AM32>$AM34,-0.5,IF($AM34>$AM32,0.5,IF(CK32=1,CD32,IF(BY32<>0,BY32,IF(AW32,-0.5,IF(AU34,0.5,BU32))))))","v":0},{"$f":"IF($AM32>$AM35,-0.5,IF($AM35>$AM32,0.5,IF(CK32=1,CE32,IF(BZ32<>0,BZ32,IF(AX32,-0.5,IF(AU35,0.5,BV32))))))","v":0.5},{"$f":"AND(AND(AM32=AM33,AM33=AM34,AM34=AM35),AND(AN32=AN33,AN33=AN34,AN34=AN35),AND(AO32=AO33,AO33=AO34,AO34=AO35))","v":false},{"$f":"AND(NOT(BG32),AM32=AM33,AM32=AM34,AN32=AN33,AN32=AN34,AO32=AO33,AO32=AO34)","v":false},{"$f":"AND(NOT(BG32),AM32=AM33,AM32=AM35,AN32=AN33,AN32=AN35,AO32=AO33,AO32=AO35)","v":false},{"$f":"AND(NOT(BG32),AM32=AM34,AM32=AM35,AN32=AN34,AN32=AN35,AO32=AO34,AO32=AO35)","v":false},{"$f":"AND(NOT(BG32),AM33=AM34,AM33=AM35,AN33=AN34,AN33=AN35,AO33=AO34,AO33=AO35)","v":false},{"$f":"AND(NOT(BG32),NOT(BH32),NOT(BI32),AM32=AM33,AN32=AN33,AO32=AO33)","v":false},{"$f":"AND(NOT(BG32),NOT(BH32),NOT(BJ32),AM32=AM34,AN32=AN34,AO32=AO34)","v":true},{"$f":"AND(NOT(BG32),NOT(BI32),NOT(BJ32),AM32=AM35,AN32=AN35,AO32=AO35)","v":false},{"$f":"AND(NOT(BG32),NOT(BH32),NOT(BK32),AM33=AM34,AN33=AN34)","v":false},{"$f":"AND(NOT(BG32),NOT(BI32),NOT(BK32),AM33=AM35,AN33=AN35,AO33=AO35)","v":false},{"$f":"AND(NOT(BG32),NOT(BJ32),NOT(BK32),AM34=AM35,AN34=AN35,AO34=AO35)","v":false},{"$f":"AND(NOT(BG32:BQ32))","v":false},"x",{"$f":"IF($BL32,IF(F31-E31<0,-0.5,IF(E31-F31<0,0.5,0)),IF($BH32,IF($AY32>$AY33,-0.5,IF($AY32<$AY33,0.5,0)),IF($BI32,IF($AZ32>$AZ33,-0.5, IF($AZ32<$AZ33,0.5,0)),0)))","v":0},{"$f":"IF($BM32,IF(F33-E33<0,-0.5,IF(E33-F33<0,0.5,0)),IF($BH32,IF($AY32>$AY34,-0.5,IF($AY32<$AY34,0.5,0)),IF($BJ32,IF($BA32>$BA34,-0.5,IF($BA32<$BA34,0.5,0)),0)))","v":0},{"$f":"IF($BN32,IF(E35-F35<0,-0.5,IF(F35-E35<0,0.5,0)),IF($BI32,IF($AZ32>$AZ35,-0.5,IF($AZ32<$AZ35,0.5,0)),IF($BJ32,IF($BA32>$BA35,-0.5, IF($BA32<$BA35,0.5,0)),0)))","v":0},"x",{"$f":"IF(ISBLANK(E31),0,IF(AR32=0,0.5,IF(AR32=3,-0.5,0)))","v":0.5},{"$f":"IF(ISBLANK(E33),0,IF(AS32=0,0.5,IF(AS32=3,-0.5,0)))","v":0},{"$f":"IF(ISBLANK(F35),0,IF(AT32=0,0.5,IF(AT32=3,-0.5,0)))","v":0.5},null,"x",{"$f":"IF(100*AP32+AN32>=MAX(100*AP35+AN35,100*AP34+AN34),-0.5, 0.5)","v":0.5},{"$f":"IF(100*AP32+AN32>=MAX(100*AP33+AN33,100*AP35+AN35),-0.5, 0.5)","v":0.5},{"$f":"IF(100*AP32+AN32>=MAX(100*AP33+AN33,100*AP34+AN34),-0.5, 0.5)","v":0.5},{"$f":"AND(AM32=AM33,AM33=AM34,AM34=AM35)","v":false},{"$f":"IF(AND(NOT(CF32),AM32=AM33,AM32=AM34),1,0)","v":0},{"$f":"IF(AND(NOT(CF32),AM32=AM33,AM32=AM35),1,0)","v":0},{"$f":"IF(AND(NOT(CF32),AM32=AM34,AM32=AM35),1,0)","v":0},{"$f":"IF(AND(NOT(CF32),AM33=AM34,AM33=AM35),1,0)","v":0},{"$f":"IF(OR(CH32,CI32,CJ32),1,0)","v":0}]
[null,"2012-06-15","18:00:00",{"$f":"D31","v":"elhaj08"},null,null,{"$f":"D32","v":"FREEKY07"},null,{"$f":"AH33","v":2},{"$f":"INDEX(AL32:AL35,MATCH(AJ33,$AK32:$AK35,0))","v":"Amininho15"},{"$f":"INDEX(AM32:AM35,MATCH(AJ33,$AK32:$AK35,0))","v":6},{"$f":"INDEX(AN32:AN35,MATCH(AJ33,$AK32:$AK35,0))","v":5},{"$f":"INDEX(AO32:AO35,MATCH(AJ33,$AK32:$AK35,0))","v":6},{"$f":"INDEX(AP32:AP35,MATCH(AJ33,$AK32:$AK35,0))","v":-1},null,null,null,null,null,null,null,null,null,null,null,null,null,null,null,null,null,null,null,{"$f":"IF(ROUND(AJ33,0)=ROUND(AJ32,0),AH32,2)","v":2},{"$f":"ROUND(AJ33,0)","v":2},{"$f":"MAX(MIN(AK32:AK34),MIN(AK32,AK33,AK35),MIN(AK32,AK34,AK35),MIN(AK33:AK35))","v":1.98},{"$f":"SUM(BC33:BF33)+2.46","v":0.96},{"$f":"G31","v":"Il_fenomeno60"},{"$f":"SUM(AQ33:AT33)","v":9},{"$f":"F31+F34+E36","v":11},{"$f":"E31+E34+F36","v":2},{"$f":"AN33-AO33","v":9},{"$f":"IF(ISBLANK(F31),0,IF(AR32=3,0,IF(AR32=1,1,3)))","v":3},"x",{"$f":"IF(ISBLANK(E36),0,IF(AR34=3,0,IF(AR34=1,1,3)))","v":3},{"$f":"IF(ISBLANK(F34),0,IF(F34>E34,3,IF(F34=E34,1,0)))","v":3},{"$f":"(10*(AP32-AP33)+AN32-AN33<0)","v":true},"x",{"$f":"10*(AP33-AP34)+AN33-AN34>0","v":true},{"$f":"10*(AP33-AP35)+AN33-AN35>0","v":true},{"$f":"10000*(AQ33+AS33)+(F31-E31+E36-F36)*100+(F31+E36)","v":60506},{"$f":"10000*(AQ33+AT33)+(F31-E31+F34-E34)*100+(F31+F34)","v":60708},"x",{"$f":"10000*(AS33+AT33)+(F34-E34+E36-F36)*100+(F34+E36)","v":60608},{"$f":"IF($AM32>$AM33,0.5,IF($AM33>$AM32,-0.5,IF(CK32=1,CB33,IF(BW33<>0,BW33,IF(AV32,0.5,IF(AU33,-0.5,BT32))))))","v":-0.5},"x",{"$f":"IF($AM33>$AM34,-0.5,IF($AM34>$AM33,0.5,IF(CK32=1,CD33,IF(BY33<>0,BY33,IF(AW33,-0.5,IF(AV34,0.5,BU33))))))","v":-0.5},{"$f":"IF($AM33>$AM35,-0.5,IF($AM35>$AM33,0.5,IF(CK32=1,CE33,IF(BZ33<>0,BZ33,IF(AX33,-0.5,IF(AV35,0.5,BV33))))))","v":-0.5},null,null,null,null,null,null,null,null,null,null,null,null,null,"x",{"$f":"IF($BO32,IF(F36-E36<0,-0.5,IF(E36-F36<0,0.5,0)),IF($BH32,IF($AY33>$AY34,-0.5,IF($AY33<$AY34,0.5,0)),IF($BK32,IF($BB33>$BB34,-0.5,IF($BB33<$BB34,0.5,0)),0)))","v":0},{"$f":"IF($BP32,IF(E34-F34<0,-0.5,IF(F34-E34<0,0.5,0)),IF($BI32,IF($AZ33>$AZ35,-0.5,IF($AZ33<$AZ35,0.5,0)),IF($BK32,IF($BB33>$BB35,-0.5,IF($BB33<$BB35,0.5,0)),0)))","v":0},{"$f":"-BX32","v":-0.5},"x",{"$f":"IF(ISBLANK(E36),0,IF(AS33=0,0.5,IF(AS33=3,-0.5,0)))","v":-0.5},{"$f":"IF(ISBLANK(F34),0,IF(AT33=0,0.5,IF(AT33=3,-0.5,0)))","v":-0.5},null,{"$f":"IF(100*AP33+AN33>=MAX(100*AP34+AN34,100*AP35+AN35),-0.5, 0.5)","v":-0.5},"x",{"$f":"IF(100*AP33+AN33>=MAX(100*AP32+AN32,100*AP35+AN35),-0.5, 0.5)","v":-0.5},{"$f":"IF(100*AP33+AN33>=MAX(100*AP34+AN34,100*AP32+AN32),-0.5, 0.5)","v":-0.5}]
[null,"2012-06-15","20:45:00",{"$f":"G32","v":"Amininho15"},1,5,{"$f":"G31","v":"Il_fenomeno60"},null,{"$f":"AH34","v":3},{"$f":"INDEX(AL32:AL35,MATCH(AJ34,$AK32:$AK35,0))","v":"elhaj08"},{"$f":"INDEX(AM32:AM35,MATCH(AJ34,$AK32:$AK35,0))","v":0},{"$f":"INDEX(AN32:AN35,MATCH(AJ34,$AK32:$AK35,0))","v":1},{"$f":"INDEX(AO32:AO35,MATCH(AJ34,$AK32:$AK35,0))","v":5},{"$f":"INDEX(AP32:AP35,MATCH(AJ34,$AK32:$AK35,0))","v":-4},null,null,null,null,null,null,null,null,null,null,null,null,null,null,null,null,null,null,null,{"$f":"IF(ROUND(AJ34,0)=ROUND(AJ33,0),AH33,3)","v":3},{"$f":"ROUND(AJ34,0)","v":3},{"$f":"MIN(MAX(AK32:AK34),MAX(AK32,AK33,AK35),MAX(AK32,AK34,AK35),MAX(AK33:AK35))","v":3.45},{"$f":"SUM(BC34:BF34)+2.47","v":3.47},{"$f":"D32","v":"FREEKY07"},{"$f":"SUM(AQ34:AT34)","v":0},{"$f":"E32+F33+F36","v":1},{"$f":"F32+E33+E36","v":5},{"$f":"AN34-AO34","v":-4},{"$f":"IF(ISBLANK(F33),0,IF(AS32=3,0,IF(AS32=1,1,3)))","v":0},{"$f":"IF(ISBLANK(F36),0,IF(F36>E36,3,IF(F36=E36,1,0)))","v":0},"x",{"$f":"IF(ISBLANK(E32),0,IF(E32>F32,3,IF(E32=F32,1,0)))","v":0},{"$f":"10*(AP32-AP34)+AN32-AN34<0","v":false},{"$f":"10*(AP33-AP34)+AN33-AN34<0","v":false},"x",{"$f":"10*(AP34-AP35)+AN34-AN35>0","v":false},{"$f":"10000*(AQ34+AR34)+(F33-E33+F36-E36)*100+(F33+F36)","v":-199},"x",{"$f":"10000*(AQ34+AT34)+(E32-F32+F33-E33)*100+(E32+F33)","v":-200},{"$f":"10000*(AR34+AT34)+(E32-F32+F36-E36)*100+(E32+F36)","v":-399},{"$f":"IF($AM32>$AM34,0.5,IF($AM34>$AM32,-0.5,IF(CK32=1,CB34,IF(BW34<>0,BW34,IF(AW32,0.5,IF(AU34,-0.5,BU32))))))","v":0},{"$f":"IF($AM33>$AM34,0.5,IF($AM34>$AM33,-0.5,IF(CK32=1,CC34,IF(BX34<>0,BX34,IF(AW33,0.5,IF(AV34,-0.5,BU33))))))","v":0.5},"x",{"$f":"IF($AM34>$AM35,-0.5,IF($AM35>$AM34,0.5,IF(CK32=1,CE34,IF(BZ34<>0,BZ34,IF(AX34,-0.5,IF(AW35,0.5,BV34))))))","v":0.5},null,null,null,null,null,null,null,null,null,null,null,null,null,null,"x",{"$f":"IF($BQ32,IF(F32-E32<0,-0.5,IF(E32-F32<0,0.5,0)),IF($BJ32,IF($BA34>$BA35,-0.5,IF($BA34<$BA35,0.5,0)),IF($BK32,IF($BB34>$BB35,-0.5,IF($BB34<$BB35,0.5,0)),0)))","v":0},{"$f":"-BY32","v":0},{"$f":"-BY33","v":0.5},"x",{"$f":"IF(ISBLANK(E32),0,IF(AT34=0,0.5,IF(AT34=3,-0.5,0)))","v":0.5},null,{"$f":"IF(100*AP34+AN34>=MAX(100*AP35+AN35,100*AP33+AN33),-0.5, 0.5)","v":0.5},{"$f":"IF(100*AP34+AN34>=MAX(100*AP32+AN32,100*AP33+AN33),-0.5, 0.5)","v":0.5},"x",{"$f":"IF(100*AP34+AN34>=MAX(100*AP32+AN32,100*AP33+AN33),-0.5, 0.5)","v":0.5}]
[null,"2012-06-19","20:45:00",{"$f":"G32","v":"Amininho15"},2,1,{"$f":"D31","v":"elhaj08"},null,{"$f":"AH35","v":3},{"$f":"INDEX(AL32:AL35,MATCH(AJ35,$AK32:$AK35,0))","v":"FREEKY07"},{"$f":"INDEX(AM32:AM35,MATCH(AJ35,$AK32:$AK35,0))","v":0},{"$f":"INDEX(AN32:AN35,MATCH(AJ35,$AK32:$AK35,0))","v":1},{"$f":"INDEX(AO32:AO35,MATCH(AJ35,$AK32:$AK35,0))","v":5},{"$f":"INDEX(AP32:AP35,MATCH(AJ35,$AK32:$AK35,0))","v":-4},null,null,null,null,null,null,null,null,null,null,null,null,null,null,null,null,null,null,null,{"$f":"IF(ROUND(AJ35,0)=ROUND(AJ34,0),AH34,4)","v":3},{"$f":"ROUND(AJ35,0)","v":3},{"$f":"MAX(AK32:AK35)","v":3.47},{"$f":"SUM(BC35:BF35)+2.48","v":1.98},{"$f":"G32","v":"Amininho15"},{"$f":"SUM(AQ35:AT35)","v":6},{"$f":"F32+E34+E35","v":5},{"$f":"E32+F34+F35","v":6},{"$f":"AN35-AO35","v":-1},{"$f":"IF(ISBLANK(E35),0,IF(AT32=3,0,IF(AT32=1,1,3)))","v":3},{"$f":"IF(ISBLANK(E34),0,IF(AT33=3,0,IF(AT33=1,1,3)))","v":0},{"$f":"IF(ISBLANK(F32),0,IF(AT34=3,0,IF(AT34=1,1,3)))","v":3},"x",{"$f":"10*(AP32-AP35)+AN32-AN35<0","v":true},{"$f":"10*(AP33-AP35)+AN33-AN35<0","v":false},{"$f":"10*(AP34-AP35)+AN34-AN35<0","v":true},"x","x",{"$f":"10000*(AQ35+AR35)+(E34-F34+E35-F35)*100+(E34+E35)","v":29703},{"$f":"10000*(AQ35+AS35)+(E35-F35+F32-E32)*100+(E35+F32)","v":60304},{"$f":"10000*(AR35+AS35)+(E34-F34+F32-E32)*100+(E34+F32)","v":29803},{"$f":"IF($AM32>$AM35,0.5,IF($AM35>$AM32,-0.5,IF(CK32=1,CB35,IF(BW35<>0,BW35,IF(AX32,0.5,IF(AU35,-0.5,BV32))))))","v":-0.5},{"$f":"IF($AM33>$AM35,0.5,IF($AM35>$AM33,-0.5,IF(CK32=1,BX35,IF(BX35<>0,BX35,IF(AX33,0.5,IF(AV35,-0.5,BV33))))))","v":0.5},{"$f":"IF($AM34>$AM35,0.5,IF($AM35>$AM34,-0.5,IF(CK32=1,CD35,IF(BY35<>0,BY35,IF(AX34,0.5,IF(AW35,-0.5,BV34))))))","v":-0.5},"x",null,null,null,null,null,null,null,null,null,null,null,null,null,null,null,"x",{"$f":"-BZ32","v":-0.5},{"$f":"-BZ33","v":0.5},{"$f":"-BZ34","v":-0.5},"x",null,{"$f":"IF(100*AP35+AN35>=MAX(100*AP33+AN33,100*AP34+AN34),-0.5, 0.5)","v":0.5},{"$f":"IF(100*AP35+AN35>=MAX(100*AP32+AN32,100*AP34+AN34),-0.5, 0.5)","v":-0.5},{"$f":"IF(100*AP35+AN35>=MAX(100*AP32+AN32,100*AP33+AN33),-0.5, 0.5)","v":0.5},"x"]
[null,"2012-06-19","20:45:00",{"$f":"G31","v":"Il_fenomeno60"},3,1,{"$f":"D32","v":"FREEKY07"},null,null,{"$f":"IF(OR(I34<3,I33<2),Data!T27,\" \")","v":" "}]

{"sheet":"Data","index":2,"n_rows":53,"n_cols":26,"rows_kept":53,"cut":false,"hidden":false,"merged":[]}
["9A99BCB6-BD58-4412-9424-C26C4ADA32D7","GameId","Score Team 1","Score Team 2","GameName","Team1","Team2",null,"Penalities Team 1","Penalities Team 2",null,null,"GameId","Score Team 1","Score Team 2","Penalty Team 1","Penalty Team 2",null,"TeamId","Name",null,null,"GameId","0x0","0x1","0x2"]
[null,1,{"$f":"IF(ISBLANK(Scores!E7),\"\",Scores!E7)","v":3},{"$f":"IF(ISBLANK(Scores!F7),\"\",Scores!F7)","v":1},"[Poule A] Equipe 1 vs. Equipe 2",{"$f":"Scores!D7","v":"Panam750"},{"$f":"Scores!G7","v":"Ragui08"},null,0,0,null,null,1,1,0,0,0,null,1,"Panam750",null,null,1,47,50,19]
[null,2,{"$f":"IF(ISBLANK(Scores!E8),\"\",Scores!E8)","v":1},{"$f":"IF(ISBLANK(Scores!F8),\"\",Scores!F8)","v":2},"[Poule A] Equipe 3 vs. Equipe 4",{"$f":"Scores!D8","v":"Waldz16"},{"$f":"Scores!G8","v":"Yahiko_aka"},null,0,0,null,null,2,1,1,0,0,null,2,"Ragui08",null,null,2,22,55,53]
["LCID :",3,{"$f":"IF(ISBLANK(Scores!F10),\"\",Scores!F10)","v":0},{"$f":"IF(ISBLANK(Scores!E10),\"\",Scores!E10)","v":0},"[Poule A] Equipe 2 vs. Equipe 4",{"$f":"Scores!G7","v":"Ragui08"},{"$f":"Scores!G8","v":"Yahiko_aka"},null,0,0,null,null,3,0,2,0,0,null,3,"Waldz16",null,null,3,90,220,214]
[1036,4,{"$f":"IF(ISBLANK(Scores!E9),\"\",Scores!E9)","v":2},{"$f":"IF(ISBLANK(Scores!F9),\"\",Scores!F9)","v":2},"[Poule A] Equipe 1 vs. Equipe 3",{"$f":"Scores!D7","v":"Panam750"},{"$f":"Scores!D8","v":"Waldz16"},null,0,0,null,null,4,1,2,0,0,null,4,"Yahiko_aka",null,null,4,93,139,127]
[null,5,{"$f":"IF(ISBLANK(Scores!E12),\"\",Scores!E12)","v":2},{"$f":"IF(ISBLANK(Scores!F12),\"\",Scores!F12)","v":2},"[Poule A] Equipe 2 vs. Equipe 3",{"$f":"Scores!G7","v":"Ragui08"},{"$f":"Scores!D8","v":"Waldz16"},null,0,0,null,null,5,0,2,0,0,null,5,"sucrebladi",null,null,5,71,160,233]
[null,6,{"$f":"IF(ISBLANK(Scores!E11),\"\",Scores!E11)","v":1},{"$f":"IF(ISBLANK(Scores!F11),\"\",Scores!F11)","v":1},"[Poule A] Equipe 4 vs. Equipe 1",{"$f":"Scores!G8","v":"Yahiko_aka"},{"$f":"Scores!D7","v":"Panam750"},null,0,0,null,null,6,1,1,0,0,null,6,"hamza31",null,null,6,95,104,54]
[null,7,{"$f":"IF(ISBLANK(Scores!E15),\"\",Scores!E15)","v":""},{"$f":"IF(ISBLANK(Scores!F15),\"\",Scores!F15)","v":""},"[Poule B] Equipe 1 vs. Equipe 2",{"$f":"Scores!D15","v":"sucrebladi"},{"$f":"Scores!G15","v":"hamza31"},null,0,0,null,null,7,2,0,0,0,null,7,"Dz-malek",null,null,7,10,7,3]
[null,8,{"$f":"IF(ISBLANK(Scores!E16),\"\",Scores!E16)","v":6},{"$f":"IF(ISBLANK(Scores!F16),\"\",Scores!F16)","v":1},"[Poule B] Equipe 3 vs. Equipe 4",{"$f":"Scores!D16","v":"Dz-malek"},{"$f":"Scores!G16","v":"algerien-93600"},null,0,0,null,null,8,0,0,0,0,null,8,"algerien-93600",null,null,8,18,15,2]
[null,9,{"$f":"IF(ISBLANK(Scores!F18),\"\",Scores!F18)","v":1},{"$f":"IF(ISBLANK(Scores!E18),\"\",Scores!E18)","v":2},"[Poule B] Equipe 2 vs. Equipe 4",{"$f":"Scores!G15","v":"hamza31"},{"$f":"Scores!G16","v":"algerien-93600"},null,0,0,null,null,9,1,1,0,0,null,9,"OMarseille13Mad",null,null,9,36,218,230]
[null,10,{"$f":"IF(ISBLANK(Scores!E17),\"\",Scores!E17)","v":1},{"$f":"IF(ISBLANK(Scores!F17),\"\",Scores!F17)","v":2},"[Poule B] Equipe 1 vs. Equipe 3",{"$f":"Scores!D15","v":"sucrebladi"},{"$f":"Scores!D16","v":"Dz-malek"},null,0,0,null,null,10,1,1,0,0,null,10,"Versace12",null,null,10,22,67,39]
[null,11,{"$f":"IF(ISBLANK(Scores!E19),\"\",Scores!E19)","v":3},{"$f":"IF(ISBLANK(Scores!F19),\"\",Scores!F19)","v":0},"[Poule B] Equipe 4 vs. Equipe 1",{"$f":"Scores!G16","v":"algerien-93600"},{"$f":"Scores!D15","v":"sucrebladi"},null,0,0,null,null,11,0,2,0,0,null,11,"Youssef-DZ",null,null,11,36,98,81]
[null,12,{"$f":"IF(ISBLANK(Scores!E20),\"\",Scores!E20)","v":1},{"$f":"IF(ISBLANK(Scores!F20),\"\",Scores!F20)","v":3},"[Poule B] Equipe 2 vs. Equipe 3",{"$f":"Scores!D20","v":"hamza31"},{"$f":"Scores!G20","v":"Dz-malek"},null,0,0,null,null,12,0,1,0,0,null,12,"mehdii-3",null,null,12,17,117,322]
[null,13,{"$f":"IF(ISBLANK(Scores!E23),\"\",Scores!E23)","v":""},{"$f":"IF(ISBLANK(Scores!F23),\"\",Scores!F23)","v":""},"[Poule C] Equipe 1 vs. Equipe 2",{"$f":"Scores!D23","v":"OMarseille13Mad"},{"$f":"Scores!G23","v":"Versace12"},null,0,0,null,null,13,1,1,0,0,null,13,"FREEKY07",null,null,13,51,24,1]
[null,14,{"$f":"IF(ISBLANK(Scores!E24),\"\",Scores!E24)","v":1},{"$f":"IF(ISBLANK(Scores!F24),\"\",Scores!F24)","v":0},"[Poule C] Equipe 3 vs. Equipe 4",{"$f":"Scores!D24","v":"Youssef-DZ"},{"$f":"Scores!G24","v":"mehdii-3"},null,0,0,null,null,14,1,1,0,0,null,14,"Amininho15",null,null,14,93,212,117]
[null,15,{"$f":"IF(ISBLANK(Scores!F26),\"\",Scores!F26)","v":2},{"$f":"IF(ISBLANK(Scores!E26),\"\",Scores!E26)","v":3},"[Poule C] Equipe 2 vs. Equipe 4",{"$f":"Scores!G23","v":"Versace12"},{"$f":"Scores!G24","v":"mehdii-3"},null,0,0,null,null,15,0,1,0,0,null,15,"elhaj08",null,null,15,62,47,11]
[null,16,{"$f":"IF(ISBLANK(Scores!E25),\"\",Scores!E25)","v":0},{"$f":"IF(ISBLANK(Scores!F25),\"\",Scores!F25)","v":3},"[Poule C] Equipe 1 vs. Equipe 3",{"$f":"Scores!D23","v":"OMarseille13Mad"},{"$f":"Scores!D24","v":"Youssef-DZ"},null,0,0,null,null,16,1,1,0,0,null,16,"Il_fenomeno60",null,null,16,4,3,0]
[null,17,{"$f":"IF(ISBLANK(Scores!E27),\"\",Scores!E27)","v":""},{"$f":"IF(ISBLANK(Scores!F27),\"\",Scores!F27)","v":""},"[Poule C] Equipe 4 vs. Equipe 1",{"$f":"Scores!D27","v":"mehdii-3"},{"$f":"Scores!G27","v":"OMarseille13Mad"},null,0,0,null,null,17,0,1,0,0,null,null,null,null,null,17,22,134,239]
[null,18,{"$f":"IF(ISBLANK(Scores!E28),\"\",Scores!E28)","v":1},{"$f":"IF(ISBLANK(Scores!F28),\"\",Scores!F28)","v":2},"[Poule C] Equipe 2 vs. Equipe 3",{"$f":"Scores!D28","v":"Versace12"},{"$f":"Scores!G28","v":"Youssef-DZ"},null,0,0,null,null,18,1,1,0,0,null,null,null,null,null,18,48,26,1]
[null,19,{"$f":"IF(ISBLANK(Scores!E31),\"\",Scores!E31)","v":0},{"$f":"IF(ISBLANK(Scores!F31),\"\",Scores!F31)","v":3},"[Poule D] Equipe 3 vs. Equipe 4",{"$f":"Scores!D31","v":"elhaj08"},{"$f":"Scores!G31","v":"Il_fenomeno60"},null,0,0,null,null,19,3,0,0,0,null,null,null,null,null,19,40,28,16]
[null,20,{"$f":"IF(ISBLANK(Scores!E32),\"\",Scores!E32)","v":0},{"$f":"IF(ISBLANK(Scores!F32),\"\",Scores!F32)","v":2},"[Poule D] Equipe 1 vs. Equipe 2",{"$f":"Scores!D32","v":"FREEKY07"},{"$f":"Scores!G32","v":"Amininho15"},null,0,0,null,null,20,1,1,0,0,null,"Success",6,null,null,20,67,152,104]
[null,21,{"$f":"IF(ISBLANK(Scores!F33),\"\",Scores!F33)","v":""},{"$f":"IF(ISBLANK(Scores!E33),\"\",Scores!E33)","v":""},"[Poule D] Equipe 1 vs. Equipe 3",{"$f":"Scores!G33","v":"FREEKY07"},{"$f":"Scores!D33","v":"elhaj08"},null,0,0,null,null,21,0,1,0,0,null,"Rank",367,null,null,21,31,231,271]
[null,22,{"$f":"IF(ISBLANK(Scores!E34),\"\",Scores!E34)","v":1},{"$f":"IF(ISBLANK(Scores!F34),\"\",Scores!F34)","v":5},"[Poule D] Equipe 2 vs. Equipe 4",{"$f":"Scores!D34","v":"Amininho15"},{"$f":"Scores!G34","v":"Il_fenomeno60"},null,0,0,null,null,22,1,1,0,0,null,"Total",2757,null,null,22,40,168,138]
[null,23,{"$f":"IF(ISBLANK(Scores!E35),\"\",Scores!E35)","v":2},{"$f":"IF(ISBLANK(Scores!F35),\"\",Scores!F35)","v":1},"[Poule D] Equipe 2 vs. Equipe 3",{"$f":"Scores!D35","v":"Amininho15"},{"$f":"Scores!G35","v":"elhaj08"},null,0,0,null,null,23,1,1,0,0,null,null,null,null,null,23,40,176,118]
[null,24,{"$f":"IF(ISBLANK(Scores!E36),\"\",Scores!E36)","v":3},{"$f":"IF(ISBLANK(Scores!F36),\"\",Scores!F36)","v":1},"[Poule D] Equipe 4 vs. Equipe 1",{"$f":"Scores!D36","v":"Il_fenomeno60"},{"$f":"Scores!G36","v":"FREEKY07"},null,0,0,null,null,24,1,1,0,0,null,null,null,null,null,24,33,24,11]
[null,25,{"$f":"IF(ISBLANK(Scores!V7),\"\",Scores!V7)","v":4},{"$f":"IF(ISBLANK(Scores!V8),\"\",Scores!V8)","v":6},"[1/4] 1er Poule A vs. 2eme Poule B",{"$f":"Scores!U7","v":"Panam750"},{"$f":"Scores!U8","v":"algerien-93600"},null,{"$f":"IF(ISBLANK(Scores!W7),0,Scores!W7)","v":0},{"$f":"IF(ISBLANK(Scores!W8),0,Scores!W8)","v":0},null,null,25,1,2,0,0,null,"Translation",null,null,null,25,6,77,164]
[null,26,{"$f":"IF(ISBLANK(Scores!V9),\"\",Scores!V9)","v":6},{"$f":"IF(ISBLANK(Scores!V10),\"\",Scores!V10)","v":1},"[1/4] 1er Poule C vs. 2eme Poule D",{"$f":"Scores!U9","v":"Dz-malek"},{"$f":"Scores!U10","v":"Yahiko_aka"},null,{"$f":"IF(ISBLANK(Scores!W9),0,Scores!W9)","v":0},{"$f":"IF(ISBLANK(Scores!W10),0,Scores!W10)","v":0},null,null,26,2,0,0,0,null,1,"TIRAGE AU SORT",null,null,26,2,4,0]
[null,27,{"$f":"IF(ISBLANK(Scores!V11),\"\",Scores!V11)","v":4},{"$f":"IF(ISBLANK(Scores!V12),\"\",Scores!V12)","v":8},"[1/4] 1er Poule B vs. 2eme Poule A",{"$f":"Scores!U11","v":"Youssef-DZ"},{"$f":"Scores!U12","v":"Amininho15"},null,{"$f":"IF(ISBLANK(Scores!W11),0,Scores!W11)","v":0},{"$f":"IF(ISBLANK(Scores!W12),0,Scores!W12)","v":0},null,null,27,2,0,0,0,null,2,"Get Rank",null,null,27,19,17,2]
[null,28,{"$f":"IF(ISBLANK(Scores!V13),\"\",Scores!V13)","v":6},{"$f":"IF(ISBLANK(Scores!V14),\"\",Scores!V14)","v":2},"[1/4] 1er Poule D vs. 2eme Poule C",{"$f":"Scores!U13","v":"Il_fenomeno60"},{"$f":"Scores!U14","v":"mehdii-3"},null,{"$f":"IF(ISBLANK(Scores!W13),0,Scores!W13)","v":0},{"$f":"IF(ISBLANK(Scores!W14),0,Scores!W14)","v":0},null,null,28,2,1,0,0,null,3,"Groupe A",null,null,28,32,38,14]
[null,29,{"$f":"IF(ISBLANK(Scores!V17),\"\",Scores!V17)","v":10},{"$f":"IF(ISBLANK(Scores!V18),\"\",Scores!V18)","v":7},"[1/2] 1er Quarts 1 vs. 1er Quarts 2",{"$f":"Scores!U17","v":"algerien-93600"},{"$f":"Scores!U18","v":"Amininho15"},null,{"$f":"IF(ISBLANK(Scores!W17),0,Scores!W17)","v":0},{"$f":"IF(ISBLANK(Scores!W18),0,Scores!W18)","v":0},null,null,29,2,1,0,0,null,4,"Groupe B",null,null,29,15,89,59]
[null,30,{"$f":"IF(ISBLANK(Scores!V19),\"\",Scores!V19)","v":3},{"$f":"IF(ISBLANK(Scores!V20),\"\",Scores!V20)","v":1},"[1/2] 1er Quarts 3 vs. 1er Quarts 4",{"$f":"Scores!U19","v":"Dz-malek"},{"$f":"Scores!U20","v":"Il_fenomeno60"},null,{"$f":"IF(ISBLANK(Scores!W19),0,Scores!W19)","v":0},{"$f":"IF(ISBLANK(Scores!W20),0,Scores!W20)","v":0},null,null,30,2,1,0,0,null,5,"Groupe C",null,null,30,16,79,17]
[null,31,{"$f":"IF(ISBLANK(Scores!AB24),\"\",Scores!AB24)","v":""},{"$f":"IF(ISBLANK(Scores!AB25),\"\",Scores!AB25)","v":""},"Petite Finale",null,null,null,null,null,null,null,32,1,2,0,0,null,6,"Groupe D",null,null,31,0,0,0]
[null,32,{"$f":"IF(ISBLANK(Scores!V24),\"\",Scores!V24)","v":1},{"$f":"IF(ISBLANK(Scores!V25),\"\",Scores!V25)","v":4},"Finale",{"$f":"Scores!U24","v":"algerien-93600"},{"$f":"Scores!U25","v":"Dz-malek"},null,{"$f":"IF(ISBLANK(Scores!W24),0,Scores!W24)","v":0},{"$f":"IF(ISBLANK(Scores!W25),0,Scores!W25)","v":0},null,null,null,null,null,null,null,null,7,"Quarts de finale",null,null,32,13,81,50]
[null,null,null,null,null,null,null,null,null,null,null,null,null,null,null,null,null,null,8,"Demi-finales"]
[null,null,null,null,null,null,null,null,null,null,null,null,null,null,null,null,null,null,9,"Finale"]
[null,null,null,null,null,null,null,null,null,null,null,null,null,null,null,null,null,null,10,"Vainqueur"]
[null,null,null,null,null,null,null,null,null,null,null,null,null,null,null,null,null,null,11,"Finaliste"]
[null,null,null,null,null,null,null,null,null,null,null,null,null,null,null,null,null,null,12,"Pts"]
[null,null,null,null,null,null,null,null,null,null,null,null,null,null,null,null,null,null,13,"BP"]
[null,null,null,null,null,null,null,null,null,null,null,null,null,null,null,null,null,null,14,"BC"]
[null,null,null,null,null,null,null,null,null,null,null,null,null,null,null,null,null,null,15,"Statistiques"]
[null,null,null,null,null,null,null,null,null,null,null,null,null,null,null,null,null,null,16,"Succès"]
[null,null,null,null,null,null,null,null,null,null,null,null,null,null,null,null,null,null,17,"Position"]
[null,null,null,null,null,null,null,null,null,null,null,null,null,null,null,null,null,null,18,"Total"]
[null,null,null,null,null,null,null,null,null,null,null,null,null,null,null,null,null,null,19,"WHO'S NEXT "]
[null,null,null,null,null,null,null,null,null,null,null,null,null,null,null,null,null,null,20,"Inscrivez vos résultats des matchs dans les tableaux ci-dessous."]
[null,null,null,null,null,null,null,null,null,null,null,null,null,null,null,null,null,null,21,"Les calculs se feront automatiquement."]
[null,null,null,null,null,null,null,null,null,null,null,null,null,null,null,null,null,null,22,"Et les équipes se positionneront dans le tableau final."]
[null,null,null,null,null,null,null,null,null,null,null,null,null,null,null,null,null,null,23]
[null,null,null,null,null,null,null,null,null,null,null,null,null,null,null,null,null,null,24]
[null,null,null,null,null,null,null,null,null,null,null,null,null,null,null,null,null,null,25,"Ne pas toucher cette partie des calculs, sinon :"]
[null,null,null,null,null,null,null,null,null,null,null,null,null,null,null,null,null,null,26,"à","(2 à 0)"]
[null,null,null,null,null,null,null,null,null,null,null,null,null,null,null,null,null,null,27]

{"sheet":"Debug","index":3,"n_rows":2,"n_cols":2,"rows_kept":2,"cut":false,"hidden":true,"merged":[]}
["Publish Url","http://apipronosticseuro2012.cloudapp.net/publish/publish?id=9A99BCB6-BD58-4412-9424-C26C4ADA32D7"]
[null,"scores=%5B%7B%22GameId%22%3A1%2C%22ScoreTeam1%22%3A1%2C%22ScoreTeam2%22%3A0%2C%22PenaltyTeam1%22%3A0%2C%22PenaltyTeam2%22%3A0%7D%2C%7B%22GameId%22%3A2%2C%22ScoreTeam1%22%3A1%2C%22ScoreTeam2%22%3A1%2C%22PenaltyTeam1%22%3A0%2C%22PenaltyTeam2%22%3A0%7D%2C%7B%22GameId%22%3A3%2C%22ScoreTeam1%22%3A0%2C%22ScoreTeam2%22%3A2%2C%22PenaltyTeam1%22%3A0%2C%22PenaltyTeam2%22%3A0%7D%2C%7B%22GameId%22%3A4%2C%22ScoreTeam1%22%3A1%2C%22ScoreTeam2%22%3A2%2C%22PenaltyTeam1%22%3A0%2C%22PenaltyTeam2%22%3A0%7D%2C%7B%22GameId%22%3A5%2C%22ScoreTeam1%22%3A0%2C%22ScoreTeam2%22%3A2%2C%22PenaltyTeam1%22%3A0%2C%22PenaltyTeam2%22%3A0%7D%2C%7B%22GameId%22%3A6%2C%22ScoreTeam1%22%3A1%2C%22ScoreTeam2%22%3A1%2C%22PenaltyTeam1%22%3A0%2C%22PenaltyTeam2%22%3A0%7D%2C%7B%22GameId%22%3A7%2C%22ScoreTeam1%22%3A0%2C%22ScoreTeam2%22%3A2%2C%22PenaltyTeam1%22%3A0%2C%22PenaltyTeam2%22%3A0%7D%2C%7B%22GameId%22%3A8%2C%22ScoreTeam1%22%3A1%2C%22ScoreTeam2%22%3A1%2C%22PenaltyTeam1%22%3A0%2C%22PenaltyTeam2%22%3A0%7D%2C%7B%22GameId%22%3A9%2C%22ScoreTeam1%22%3A1%2C%22ScoreTeam2%22%3A1%2C%22PenaltyTeam1%22%3A0%2C%22PenaltyTeam2%22%3A0%7D%2C%7B%22GameId%22%3A10%2C%22ScoreTeam1%22%3A1%2C%22ScoreTeam2%22%3A1%2C%22PenaltyTeam1%22%3A0%2C%22PenaltyTeam2%22%3A0%7D%2C%7B%22GameId%22%3A11%2C%22ScoreTeam1%22%3A0%2C%22ScoreTeam2%22%3A2%2C%22PenaltyTeam1%22%3A0%2C%22PenaltyTeam2%22%3A0%7D%2C%7B%22GameId%22%3A12%2C%22ScoreTeam1%22%3A0%2C%22ScoreTeam2%22%3A1%2C%22PenaltyTeam1%22%3A0%2C%22PenaltyTeam2%22%3A0%7D%2C%7B%22GameId%22%3A13%2C%22ScoreTeam1%22%3A1%2C%22ScoreTeam2%22%3A1%2C%22PenaltyTeam1%22%3A0%2C%22PenaltyTeam2%22%3A0%7D%2C%7B%22GameId%22%3A14%2C%22ScoreTeam1%22%3A1%2C%22ScoreTeam2%22%3A1%2C%22PenaltyTeam1%22%3A0%2C%22PenaltyTeam2%22%3A0%7D%2C%7B%22GameId%22%3A15%2C%22ScoreTeam1%22%3A0%2C%22ScoreTeam2%22%3A1%2C%22PenaltyTeam1%22%3A0%2C%22PenaltyTeam2%22%3A0%7D%2C%7B%22GameId%22%3A16%2C%22ScoreTeam1%22%3A1%2C%22ScoreTeam2%22%3A1%2C%22PenaltyTeam1%22%3A0%2C%22PenaltyTeam2%22%3A0%7D%2C%7B%22GameId%22%3A17%2C%22ScoreTeam1%22%3A0%2C%22ScoreTeam2%22%3A1%2C%22PenaltyTeam1%22%3A0%2C%22PenaltyTeam2%22%3A0%7D%2C%7B%22GameId%22%3A18%2C%22ScoreTeam1%22%3A1%2C%22ScoreTeam2%22%3A1%2C%22PenaltyTeam1%22%3A0%2C%22PenaltyTeam2%22%3A0%7D%2C%7B%22GameId%22%3A19%2C%22ScoreTeam1%22%3A3%2C%22ScoreTeam2%22%3A0%2C%22PenaltyTeam1%22%3A0%2C%22PenaltyTeam2%22%3A0%7D%2C%7B%22GameId%22%3A20%2C%22ScoreTeam1%22%3A1%2C%22ScoreTeam2%22%3A1%2C%22PenaltyTeam1%22%3A0%2C%22PenaltyTeam2%22%3A0%7D%2C%7B%22GameId%22%3A21%2C%22ScoreTeam1%22%3A0%2C%22ScoreTeam2%22%3A1%2C%22PenaltyTeam1%22%3A0%2C%22PenaltyTeam2%22%3A0%7D%2C%7B%22GameId%22%3A22%2C%22ScoreTeam1%22%3A1%2C%22ScoreTeam2%22%3A1%2C%22PenaltyTeam1%22%3A0%2C%22PenaltyTeam2%22%3A0%7D%2C%7B%22GameId%22%3A23%2C%22ScoreTeam1%22%3A1%2C%22ScoreTeam2%22%3A1%2C%22PenaltyTeam1%22%3A0%2C%22PenaltyTeam2%22%3A0%7D%2C%7B%22GameId%22%3A24%2C%22ScoreTeam1%22%3A1%2C%22ScoreTeam2%22%3A1%2C%22PenaltyTeam1%22%3A0%2C%22PenaltyTeam2%22%3A0%7D%5D"]

{"sheet":"Temp","index":4,"n_rows":3,"n_cols":16,"rows_kept":3,"cut":false,"hidden":true,"merged":[]}
["PublishResult",null,null,null,"[{\"GameId\":1,\"ScoreTeam1\":1,\"ScoreTeam2\":0,\"PenaltyTeam1\":0,\"PenaltyTeam2\":0},{\"GameId\":2,\"ScoreTeam1\":1,\"ScoreTeam2\":1,\"PenaltyTeam1\":0,\"PenaltyTeam2\":0},{\"GameId\":3,\"ScoreTeam1\":0,\"ScoreTeam2\":2,\"PenaltyTeam1\":0,\"PenaltyTeam2\":0},{\"GameId\":4,\"ScoreTeam1\":1,\"ScoreTeam2\":2,\"PenaltyTeam1\":0,\"PenaltyTeam2\":0},{\"GameId\":5,\"ScoreTeam1\":0,\"ScoreTeam2\":2,\"PenaltyTeam1\":0,\"PenaltyTeam2\":0},{\"GameId\":6,\"ScoreTeam1\":1,\"ScoreTeam2\":1,\"PenaltyTeam1\":0,\"PenaltyTeam2\":0},{\"GameId\":7,\"ScoreTeam1\":2,\"ScoreTeam2\":0,\"PenaltyTeam1\":0,\"PenaltyTeam2\":0},{\"GameId\":8,\"ScoreTeam1\":0,\"ScoreTeam2\":0,\"PenaltyTeam1\":0,\"PenaltyTeam2\":0},{\"GameId\":9,\"ScoreTeam1\":1,\"ScoreTeam2\":1,\"PenaltyTeam1\":0,\"PenaltyTeam2\":0},{\"GameId\":10,\"ScoreTeam1\":1,\"ScoreTeam2\":1,\"PenaltyTeam1\":0,\"PenaltyTeam2\":0},{\"GameId\":11,\"ScoreTeam1\":0,\"ScoreTeam2\":2,\"PenaltyTeam1\":0,\"PenaltyTeam2\":0},{\"GameId\":12,\"ScoreTeam1\":0,\"ScoreTeam2\":1,\"PenaltyTeam1\":0,\"PenaltyTeam2\":0},{\"GameId\":13,\"ScoreTeam1\":1,\"ScoreTeam2\":1,\"PenaltyTeam1\":0,\"PenaltyTeam2\":0},{\"GameId\":14,\"ScoreTeam1\":1,\"ScoreTeam2\":1,\"PenaltyTeam1\":0,\"PenaltyTeam2\":0},{\"GameId\":15,\"ScoreTeam1\":0,\"ScoreTeam2\":1,\"PenaltyTeam1\":0,\"PenaltyTeam2\":0},{\"GameId\":16,\"ScoreTeam1\":1,\"ScoreTeam2\":1,\"PenaltyTeam1\":0,\"PenaltyTeam2\":0},{\"GameId\":17,\"ScoreTeam1\":0,\"ScoreTeam2\":1,\"PenaltyTeam1\":0,\"PenaltyTeam2\":0},{\"GameId\":18,\"ScoreTeam1\":1,\"ScoreTeam2\":1,\"PenaltyTeam1\":0,\"PenaltyTeam2\":0},{\"GameId\":19,\"ScoreTeam1\":3,\"ScoreTeam2\":0,\"PenaltyTeam1\":0,\"PenaltyTeam2\":0},{\"GameId\":20,\"ScoreTeam1\":1,\"ScoreTeam2\":1,\"PenaltyTeam1\":0,\"PenaltyTeam2\":0},{\"GameId\":21,\"ScoreTeam1\":0,\"ScoreTeam2\":1,\"PenaltyTeam1\":0,\"PenaltyTeam2\":0},{\"GameId\":22,\"ScoreTeam1\":1,\"ScoreTeam2\":1,\"PenaltyTeam1\":0,\"PenaltyTeam2\":0},{\"GameId\":23,\"ScoreTeam1\":1,\"ScoreTeam2\":1,\"PenaltyTeam1\":0,\"PenaltyTeam2\":0},{\"GameId\":24,\"ScoreTeam1\":1,\"ScoreTeam2\":1,\"PenaltyTeam1\":0,\"PenaltyTeam2\":0},{\"GameId\":25,\"ScoreTeam1\":1,\"ScoreTeam2\":2,\"PenaltyTeam1\":0,\"PenaltyTeam2\":0},{\"GameId\":26,\"ScoreTeam1\":2,\"ScoreTeam2\":0,\"PenaltyTeam1\":0,\"PenaltyTeam2\":0},{\"GameId\":27,\"ScoreTeam1\":2,\"ScoreTeam2\":0,\"PenaltyTeam1\":0,\"PenaltyTeam2\":0},{\"GameId\":28,\"ScoreTeam1\":2,\"ScoreTeam2\":1,\"PenaltyTeam1\":0,\"PenaltyTeam2\":0},{\"GameId\":29,\"ScoreTeam1\":2,\"ScoreTeam2\":1,\"PenaltyTeam1\":0,\"PenaltyTeam2\":0},{\"GameId\":30,\"ScoreTeam1\":2,\"ScoreTeam2\":1,\"PenaltyTeam1\":0,\"PenaltyTeam2\":0},{\"GameId\":32,\"ScoreTeam1\":1,\"ScoreTeam2\":2,\"PenaltyTeam1\":0,\"PenaltyTeam2\":0}] ",null,null,null,"[{\"GameId\":1,\"ScoreTeam1\":1,\"ScoreTeam2\":0,\"PenaltyTeam1\":0,\"PenaltyTeam2\":0},{\"GameId\":2,\"ScoreTeam1\":1,\"ScoreTeam2\":1,\"PenaltyTeam1\":0,\"PenaltyTeam2\":0},{\"GameId\":3,\"ScoreTeam1\":0,\"ScoreTeam2\":2,\"PenaltyTeam1\":0,\"PenaltyTeam2\":0},{\"GameId\":4,\"ScoreTeam1\":1,\"ScoreTeam2\":2,\"PenaltyTeam1\":0,\"PenaltyTeam2\":0},{\"GameId\":5,\"ScoreTeam1\":0,\"ScoreTeam2\":2,\"PenaltyTeam1\":0,\"PenaltyTeam2\":0},{\"GameId\":6,\"ScoreTeam1\":1,\"ScoreTeam2\":1,\"PenaltyTeam1\":0,\"PenaltyTeam2\":0},{\"GameId\":7,\"ScoreTeam1\":0,\"ScoreTeam2\":2,\"PenaltyTeam1\":0,\"PenaltyTeam2\":0},{\"GameId\":8,\"ScoreTeam1\":1,\"ScoreTeam2\":1,\"PenaltyTeam1\":0,\"PenaltyTeam2\":0},{\"GameId\":9,\"ScoreTeam1\":1,\"ScoreTeam2\":0,\"PenaltyTeam1\":0,\"PenaltyTeam2\":0},{\"GameId\":10,\"ScoreTeam1\":2,\"ScoreTeam2\":3,\"PenaltyTeam1\":0,\"PenaltyTeam2\":0},{\"GameId\":11,\"ScoreTeam1\":0,\"ScoreTeam2\":2,\"PenaltyTeam1\":0,\"PenaltyTeam2\":0},{\"GameId\":12,\"ScoreTeam1\":0,\"ScoreTeam2\":1,\"PenaltyTeam1\":0,\"PenaltyTeam2\":0},{\"GameId\":13,\"ScoreTeam1\":1,\"ScoreTeam2\":1,\"PenaltyTeam1\":0,\"PenaltyTeam2\":0},{\"GameId\":14,\"ScoreTeam1\":1,\"ScoreTeam2\":1,\"PenaltyTeam1\":0,\"PenaltyTeam2\":0},{\"GameId\":15,\"ScoreTeam1\":1,\"ScoreTeam2\":0,\"PenaltyTeam1\":0,\"PenaltyTeam2\":0},{\"GameId\":16,\"ScoreTeam1\":3,\"ScoreTeam2\":0,\"PenaltyTeam1\":0,\"PenaltyTeam2\":0},{\"GameId\":17,\"ScoreTeam1\":0,\"ScoreTeam2\":2,\"PenaltyTeam1\":0,\"PenaltyTeam2\":0},{\"GameId\":18,\"ScoreTeam1\":1,\"ScoreTeam2\":1,\"PenaltyTeam1\":0,\"PenaltyTeam2\":0},{\"GameId\":19,\"ScoreTeam1\":3,\"ScoreTeam2\":0,\"PenaltyTeam1\":0,\"PenaltyTeam2\":0},{\"GameId\":20,\"ScoreTeam1\":1,\"ScoreTeam2\":1,\"PenaltyTeam1\":0,\"PenaltyTeam2\":0},{\"GameId\":21,\"ScoreTeam1\":0,\"ScoreTeam2\":1,\"PenaltyTeam1\":0,\"PenaltyTeam2\":0},{\"GameId\":22,\"ScoreTeam1\":0,\"ScoreTeam2\":1,\"PenaltyTeam1\":0,\"PenaltyTeam2\":0},{\"GameId\":23,\"ScoreTeam1\":1,\"ScoreTeam2\":1,\"PenaltyTeam1\":0,\"PenaltyTeam2\":0},{\"GameId\":24,\"ScoreTeam1\":1,\"ScoreTeam2\":1,\"PenaltyTeam1\":0,\"PenaltyTeam2\":0},{\"GameId\":25,\"ScoreTeam1\":2,\"ScoreTeam2\":0,\"PenaltyTeam1\":0,\"PenaltyTeam2\":0},{\"GameId\":26,\"ScoreTeam1\":4,\"ScoreTeam2\":0,\"PenaltyTeam1\":0,\"PenaltyTeam2\":0},{\"GameId\":27,\"ScoreTeam1\":2,\"ScoreTeam2\":1,\"PenaltyTeam1\":0,\"PenaltyTeam2\":0},{\"GameId\":28,\"ScoreTeam1\":1,\"ScoreTeam2\":1,\"PenaltyTeam1\":5,\"PenaltyTeam2\":3},{\"GameId\":29,\"ScoreTeam1\":1,\"ScoreTeam2\":3,\"PenaltyTeam1\":0,\"PenaltyTeam2\":0},{\"GameId\":30,\"ScoreTeam1\":1,\"ScoreTeam2\":0,\"PenaltyTeam1\":0,\"PenaltyTeam2\":0},{\"GameId\":32,\"ScoreTeam1\":2,\"ScoreTeam2\":0,\"PenaltyTeam1\":0,\"PenaltyTeam2\":0}] ",null,"[{\"GameId\":1,\"ScoreTeam1\":1,\"ScoreTeam2\":0,\"PenaltyTeam1\":0,\"PenaltyTeam2\":0},{\"GameId\":2,\"ScoreTeam1\":1,\"ScoreTeam2\":1,\"PenaltyTeam1\":0,\"PenaltyTeam2\":0},{\"GameId\":3,\"ScoreTeam1\":0,\"ScoreTeam2\":2,\"PenaltyTeam1\":0,\"PenaltyTeam2\":0},{\"GameId\":4,\"ScoreTeam1\":1,\"ScoreTeam2\":2,\"PenaltyTeam1\":0,\"PenaltyTeam2\":0},{\"GameId\":5,\"ScoreTeam1\":0,\"ScoreTeam2\":2,\"PenaltyTeam1\":0,\"PenaltyTeam2\":0},{\"GameId\":6,\"ScoreTeam1\":1,\"ScoreTeam2\":1,\"PenaltyTeam1\":0,\"PenaltyTeam2\":0},{\"GameId\":7,\"ScoreTeam1\":1,\"ScoreTeam2\":1,\"PenaltyTeam1\":0,\"PenaltyTeam2\":0},{\"GameId\":8,\"ScoreTeam1\":1,\"ScoreTeam2\":1,\"PenaltyTeam1\":0,\"PenaltyTeam2\":0},{\"GameId\":9,\"ScoreTeam1\":1,\"ScoreTeam2\":0,\"PenaltyTeam1\":0,\"PenaltyTeam2\":0},{\"GameId\":10,\"ScoreTeam1\":2,\"ScoreTeam2\":3,\"PenaltyTeam1\":0,\"PenaltyTeam2\":0},{\"GameId\":11,\"ScoreTeam1\":0,\"ScoreTeam2\":2,\"PenaltyTeam1\":0,\"PenaltyTeam2\":0},{\"GameId\":12,\"ScoreTeam1\":0,\"ScoreTeam2\":1,\"PenaltyTeam1\":0,\"PenaltyTeam2\":0},{\"GameId\":13,\"ScoreTeam1\":1,\"ScoreTeam2\":1,\"PenaltyTeam1\":0,\"PenaltyTeam2\":0},{\"GameId\":14,\"ScoreTeam1\":1,\"ScoreTeam2\":1,\"PenaltyTeam1\":0,\"PenaltyTeam2\":0},{\"GameId\":15,\"ScoreTeam1\":1,\"ScoreTeam2\":0,\"PenaltyTeam1\":0,\"PenaltyTeam2\":0},{\"GameId\":16,\"ScoreTeam1\":3,\"ScoreTeam2\":0,\"PenaltyTeam1\":0,\"PenaltyTeam2\":0},{\"GameId\":17,\"ScoreTeam1\":0,\"ScoreTeam2\":2,\"PenaltyTeam1\":0,\"PenaltyTeam2\":0},{\"GameId\":18,\"ScoreTeam1\":1,\"ScoreTeam2\":1,\"PenaltyTeam1\":0,\"PenaltyTeam2\":0},{\"GameId\":19,\"ScoreTeam1\":3,\"ScoreTeam2\":0,\"PenaltyTeam1\":0,\"PenaltyTeam2\":0},{\"GameId\":20,\"ScoreTeam1\":1,\"ScoreTeam2\":1,\"PenaltyTeam1\":0,\"PenaltyTeam2\":0},{\"GameId\":21,\"ScoreTeam1\":0,\"ScoreTeam2\":1,\"PenaltyTeam1\":0,\"PenaltyTeam2\":0},{\"GameId\":22,\"ScoreTeam1\":0,\"ScoreTeam2\":1,\"PenaltyTeam1\":0,\"PenaltyTeam2\":0},{\"GameId\":23,\"ScoreTeam1\":1,\"ScoreTeam2\":1,\"PenaltyTeam1\":0,\"PenaltyTeam2\":0},{\"GameId\":24,\"ScoreTeam1\":1,\"ScoreTeam2\":1,\"PenaltyTeam1\":0,\"PenaltyTeam2\":0},{\"GameId\":25,\"ScoreTeam1\":2,\"ScoreTeam2\":0,\"PenaltyTeam1\":0,\"PenaltyTeam2\":0},{\"GameId\":26,\"ScoreTeam1\":4,\"ScoreTeam2\":0,\"PenaltyTeam1\":0,\"PenaltyTeam2\":0},{\"GameId\":27,\"ScoreTeam1\":2,\"ScoreTeam2\":1,\"PenaltyTeam1\":0,\"PenaltyTeam2\":0},{\"GameId\":28,\"ScoreTeam1\":1,\"ScoreTeam2\":1,\"PenaltyTeam1\":5,\"PenaltyTeam2\":3},{\"GameId\":29,\"ScoreTeam1\":1,\"ScoreTeam2\":3,\"PenaltyTeam1\":0,\"PenaltyTeam2\":0},{\"GameId\":30,\"ScoreTeam1\":1,\"ScoreTeam2\":0,\"PenaltyTeam1\":0,\"PenaltyTeam2\":0},{\"GameId\":32,\"ScoreTeam1\":2,\"ScoreTeam2\":0,\"PenaltyTeam1\":0,\"PenaltyTeam2\":0}] ",null,null,null,null,"[{\"GameId\":1,\"ScoreTeam1\":1,\"ScoreTeam2\":1,\"PenaltyTeam1\":0,\"PenaltyTeam2\":0},{\"GameId\":2,\"ScoreTeam1\":1,\"ScoreTeam2\":1,\"PenaltyTeam1\":0,\"PenaltyTeam2\":0},{\"GameId\":3,\"ScoreTeam1\":1,\"ScoreTeam2\":1,\"PenaltyTeam1\":0,\"PenaltyTeam2\":0},{\"GameId\":4,\"ScoreTeam1\":1,\"ScoreTeam2\":1,\"PenaltyTeam1\":0,\"PenaltyTeam2\":0},{\"GameId\":5,\"ScoreTeam1\":1,\"ScoreTeam2\":0,\"PenaltyTeam1\":0,\"PenaltyTeam2\":0},{\"GameId\":6,\"ScoreTeam1\":1,\"ScoreTeam2\":2,\"PenaltyTeam1\":0,\"PenaltyTeam2\":0},{\"GameId\":7,\"ScoreTeam1\":1,\"ScoreTeam2\":1,\"PenaltyTeam1\":0,\"PenaltyTeam2\":0},{\"GameId\":8,\"ScoreTeam1\":2,\"ScoreTeam2\":1,\"PenaltyTeam1\":0,\"PenaltyTeam2\":0},{\"GameId\":9,\"ScoreTeam1\":2,\"ScoreTeam2\":0,\"PenaltyTeam1\":0,\"PenaltyTeam2\":0},{\"GameId\":10,\"ScoreTeam1\":1,\"ScoreTeam2\":1,\"PenaltyTeam1\":0,\"PenaltyTeam2\":0},{\"GameId\":11,\"ScoreTeam1\":1,\"ScoreTeam2\":1,\"PenaltyTeam1\":0,\"PenaltyTeam2\":0},{\"GameId\":12,\"ScoreTeam1\":1,\"ScoreTeam2\":1,\"PenaltyTeam1\":0,\"PenaltyTeam2\":0},{\"GameId\":13,\"ScoreTeam1\":1,\"ScoreTeam2\":1,\"PenaltyTeam1\":0,\"PenaltyTeam2\":0},{\"GameId\":14,\"ScoreTeam1\":1,\"ScoreTeam2\":0,\"PenaltyTeam1\":0,\"PenaltyTeam2\":0},{\"GameId\":15,\"ScoreTeam1\":0,\"ScoreTeam2\":1,\"PenaltyTeam1\":0,\"PenaltyTeam2\":0},{\"GameId\":16,\"ScoreTeam1\":2,\"ScoreTeam2\":0,\"PenaltyTeam1\":0,\"PenaltyTeam2\":0},{\"GameId\":17,\"ScoreTeam1\":1,\"ScoreTeam2\":1,\"PenaltyTeam1\":0,\"PenaltyTeam2\":0},{\"GameId\":18,\"ScoreTeam1\":1,\"ScoreTeam2\":1,\"PenaltyTeam1\":0,\"PenaltyTeam2\":0},{\"GameId\":19,\"ScoreTeam1\":1,\"ScoreTeam2\":0,\"PenaltyTeam1\":0,\"PenaltyTeam2\":0},{\"GameId\":20,\"ScoreTeam1\":1,\"ScoreTeam2\":1,\"PenaltyTeam1\":0,\"PenaltyTeam2\":0},{\"GameId\":21,\"ScoreTeam1\":0,\"ScoreTeam2\":1,\"PenaltyTeam1\":0,\"PenaltyTeam2\":0},{\"GameId\":22,\"ScoreTeam1\":1,\"ScoreTeam2\":1,\"PenaltyTeam1\":0,\"PenaltyTeam2\":0},{\"GameId\":23,\"ScoreTeam1\":1,\"ScoreTeam2\":1,\"PenaltyTeam1\":0,\"PenaltyTeam2\":0},{\"GameId\":24,\"ScoreTeam1\":1,\"ScoreTeam2\":1,\"PenaltyTeam1\":0,\"PenaltyTeam2\":0}] "]
["Consolidate","[{\"GameId\":1,\"Score\":[47,50,19,1,0,0,331,156,52,3,0,2,140,172,13,3,0,1,11,11,4,1,1,1,1,3,2,0,0,0,3,0,0,0,0,0]},{\"GameId\":2,\"Score\":[22,55,53,4,0,0,130,190,98,9,0,0,96,205,49,8,0,0,10,40,15,3,1,0,0,8,0,0,0,0,1,0,0,0,1,2]},{\"GameId\":3,\"Score\":[90,220,214,30,5,1,74,140,136,55,1,0,22,41,41,6,1,0,6,8,5,0,1,1,2,1,0,1,0,1,0,1,0,0,0,0]},{\"GameId\":4,\"Score\":[93,139,127,18,1,0,85,282,164,50,1,0,19,59,49,11,0,0,2,9,4,0,0,0,0,1,1,0,1,0,0,0,0,0,0,1]},{\"GameId\":5,\"Score\":[71,160,233,88,8,2,68,136,159,83,8,0,24,33,29,13,0,1,3,6,2,0,0,0,3,1,1,1,0,0,1,3,0,0,1,2]},{\"GameId\":6,\"Score\":[95,104,54,2,0,0,134,272,117,22,1,1,63,131,77,10,0,0,18,24,6,1,0,0,1,0,3,0,0,0,0,0,1,0,0,2]},{\"GameId\":7,\"Score\":[10,7,3,1,0,1,61,32,7,0,0,0,308,146,17,4,0,0,126,193,15,1,1,0,19,19,3,0,1,0,3,1,1,0,0,0]},{\"GameId\":8,\"Score\":[18,15,2,0,0,0,83,107,32,7,0,0,107,310,94,9,0,0,17,109,58,7,1,0,3,5,4,0,0,1,0,0,0,0,0,0]},{\"GameId\":9,\"Score\":[36,218,230,52,3,4,43,117,226,66,8,1,6,36,38,12,4,0,0,3,1,0,0,0,1,0,0,0,1,1,0,1,0,0,0,0]},{\"GameId\":10,\"Score\":[22,67,39,3,2,0,30,235,208,34,1,0,16,76,263,60,5,0,0,11,27,7,1,0,0,0,1,1,1,1,0,1,1,0,0,0]},{\"GameId\":11,\"Score\":[36,98,81,14,1,0,46,210,248,91,4,1,21,83,104,42,8,1,1,9,8,5,2,0,1,1,3,0,0,0,0,0,0,0,1,0]},{\"GameId\":12,\"Score\":[17,117,322,176,43,3,8,69,135,138,35,3,6,10,10,13,6,0,0,3,2,0,1,0,0,0,0,1,0,0,0,1,0,0,0,1]},{\"GameId\":13,\"Score\":[51,24,1,0,0,0,123,121,23,2,0,0,174,260,42,4,0,0,23,94,33,0,2,0,2,7,2,1,0,1,0,0,0,0,0,0]},{\"GameId\":14,\"Score\":[93,212,117,12,1,1,90,186,133,32,1,0,21,45,30,5,0,0,2,1,3,1,0,0,1,0,1,0,0,0,0,0,0,1,0,0]},{\"GameId\":15,\"Score\":[62,47,11,0,0,0,212,262,53,5,0,1,86,235,59,4,2,1,18,31,10,0,0,0,0,3,0,0,0,1,0,0,0,0,0,0]},{\"GameId\":16,\"Score\":[4,3,0,0,0,0,91,17,7,1,0,0,345,80,3,2,0,0,291,126,3,0,0,0,76,45,2,1,0,1,9,1,0,0,0,0]},{\"GameId\":17,\"Score\":[22,134,239,76,20,2,8,89,286,134,17,1,2,8,28,22,2,0,0,1,2,0,0,0,0,0,0,0,0,0,0,0,0,2,0,0]},{\"GameId\":18,\"Score\":[48,26,1,1,0,0,279,135,18,1,0,0,271,178,35,3,0,0,45,37,13,0,0,0,1,1,0,1,0,0,0,1,1,0,0,0]},{\"GameId\":19,\"Score\":[40,28,16,1,0,0,150,187,52,3,2,0,154,315,48,2,2,0,6,37,11,3,1,0,0,2,3,0,0,0,1,0,0,0,0,1]},{\"GameId\":20,\"Score\":[67,152,104,13,1,0,109,284,146,34,2,0,38,74,28,7,0,0,2,5,4,0,0,0,0,1,0,0,0,0,0,0,1,0,0,1]},{\"GameId\":21,\"Score\":[31,231,271,60,1,0,9,131,216,104,4,0,5,13,20,14,0,0,1,1,0,0,0,0,0,0,0,0,0,0,0,1,1,1,0,0]},{\"GameId\":22,\"Score\":[40,168,138,19,0,0,51,216,225,51,1,0,19,73,80,18,4,0,2,2,4,2,0,0,0,1,1,0,0,0,0,0,0,0,1,0]},{\"GameId\":23,\"Score\":[40,176,118,18,1,1,27,262,254,87,3,0,7,20,53,24,3,0,0,3,1,2,0,0,1,1,0,0,0,0,0,0,0,0,0,0]},{\"GameId\":24,\"Score\":[33,24,11,1,0,0,234,121,41,6,0,0,243,183,41,4,0,0,60,76,10,0,0,0,2,5,1,2,0,0,0,2,0,0,0,0]},{\"GameId\":25,\"Score\":[6,77,164,28,1,0,19,33,266,124,9,2,14,41,33,31,5,0,0,3,7,0,0,0,0,1,0,0,0,0,0,0,0,0,0,0]},{\"GameId\":26,\"Score\":[2,4,0,1,0,0,54,12,7,1,0,0,269,120,9,0,0,0,131,178,24,1,0,0,22,18,4,0,0,0,4,1,0,0,0,0]},{\"GameId\":27,\"Score\":[19,17,2,1,1,0,85,57,32,3,0,0,145,218,24,11,0,0,39,146,32,1,0,1,6,10,7,0,1,0,0,0,3,0,1,0]},{\"GameId\":28,\"Score\":[32,38,14,0,1,0,174,118,51,7,0,0,93,229,30,3,0,0,7,39,16,1,0,0,1,2,1,2,1,0,2,0,1,0,0,0]},{\"GameId\":29,\"Score\":[15,89,59,4,4,0,36,70,207,42,0,0,22,104,74,80,4,0,2,8,17,2,3,1,0,0,1,1,0,0,0,0,0,0,1,0]},{\"GameId\":30,\"Score\":[16,79,17,1,2,0,92,66,110,22,0,0,81,179,44,41,0,0,16,43,26,4,2,0,0,2,1,1,0,0,0,0,0,0,0,0]},{\"GameId\":31,\"Score\":[0,0,0,0,0,0,0,0,0,0,0,0,0,0,0,0,0,0,0,0,0,0,0,0,0,0,0,0,0,0,0,0,0,0,0,0]},{\"GameId\":32,\"Score\":[13,81,50,13,1,0,96,44,185,29,2,0,48,146,18,26,2,1,7,26,24,3,0,0,0,1,1,1,1,2,1,0,0,0,0,0]}] ",null,null,null,"[{\"GameId\":1,\"Score\":[47,50,19,1,0,0,331,156,52,3,0,2,140,172,13,3,0,1,11,11,4,1,1,1,1,3,2,0,0,0,3,0,0,0,0,0]},{\"GameId\":2,\"Score\":[22,55,53,4,0,0,130,190,98,9,0,0,96,205,49,8,0,0,10,40,15,3,1,0,0,8,0,0,0,0,1,0,0,0,1,2]},{\"GameId\":3,\"Score\":[79,191,191,27,4,1,60,118,117,52,1,0,16,33,33,5,1,0,5,6,3,0,1,1,1,1,0,1,0,1,0,1,0,0,0,0]},{\"GameId\":4,\"Score\":[82,115,101,14,0,0,79,255,127,39,0,0,17,55,43,8,0,0,1,9,2,0,0,0,0,1,1,0,1,0,0,0,0,0,0,1]},{\"GameId\":5,\"Score\":[60,137,196,72,6,2,60,125,125,60,7,0,22,28,24,9,0,1,1,5,1,0,0,0,1,1,1,1,0,0,1,3,0,0,1,1]},{\"GameId\":6,\"Score\":[82,82,45,2,0,0,113,241,88,21,1,1,49,107,66,6,0,0,15,22,3,0,0,0,1,0,3,0,0,0,0,0,1,0,0,2]},{\"GameId\":7,\"Score\":[10,6,3,1,0,1,61,32,7,0,0,0,308,147,17,4,0,0,126,192,15,1,1,0,19,19,3,0,1,0,3,1,1,0,0,0]},{\"GameId\":8,\"Score\":[16,15,2,0,0,0,76,107,32,7,0,0,106,312,94,9,0,0,15,109,58,7,1,0,3,5,4,0,0,1,0,0,0,0,0,0]},{\"GameId\":9,\"Score\":[30,187,194,41,2,4,36,100,188,60,7,1,6,29,28,8,4,0,0,3,1,0,0,0,0,0,0,0,1,1,0,1,0,0,0,0]},{\"GameId\":10,\"Score\":[13,56,25,1,2,0,26,208,167,28,1,0,11,62,228,55,5,0,0,10,21,7,1,0,0,0,1,1,1,1,0,1,1,0,0,0]},{\"GameId\":11,\"Score\":[28,79,76,13,1,0,34,179,208,79,4,1,11,61,84,38,8,1,0,9,8,4,2,0,1,1,2,0,0,0,0,0,0,0,1,0]},{\"GameId\":12,\"Score\":[9,90,266,160,36,3,5,60,112,114,34,2,5,8,7,10,4,0,0,3,2,0,1,0,0,0,0,1,0,0,0,1,0,0,0,1]},{\"GameId\":13,\"Score\":[49,24,1,0,0,0,121,112,22,2,0,0,169,257,39,4,0,0,23,93,31,0,2,0,2,7,2,1,0,1,0,0,0,0,0,0]},{\"GameId\":14,\"Score\":[93,204,114,12,1,0,87,182,128,25,1,0,20,44,30,5,0,0,2,1,3,1,0,0,1,0,1,0,0,0,0,0,0,1,0,0]},{\"GameId\":15,\"Score\":[55,44,8,0,0,0,182,228,40,4,0,1,68,186,43,6,1,1,13,29,7,0,0,0,0,2,0,0,0,1,0,0,0,0,0,0]},{\"GameId\":16,\"Score\":[1,3,0,0,0,0,80,15,5,1,0,0,288,67,4,2,0,0,239,108,2,0,0,0,57,31,1,1,0,1,9,1,0,0,0,0]},{\"GameId\":17,\"Score\":[16,107,196,69,18,2,7,78,231,120,14,1,1,5,23,19,2,0,0,1,2,0,0,0,0,0,0,0,0,0,0,0,0,2,0,0]},{\"GameId\":18,\"Score\":[42,24,1,0,0,0,236,114,18,1,0,0,213,146,32,2,0,0,37,31,11,0,0,0,2,2,0,1,0,0,0,1,1,0,0,0]},{\"GameId\":19,\"Score\":[38,24,11,0,0,0,141,160,46,3,2,0,139,280,45,3,2,0,4,36,11,2,1,0,0,2,3,0,0,0,1,0,0,0,0,1]},{\"GameId\":20,\"Score\":[61,133,93,12,1,0,91,258,131,30,2,0,33,61,26,7,0,0,2,5,4,0,0,0,0,1,0,0,0,0,0,0,1,0,0,1]},{\"GameId\":21,\"Score\":[24,204,226,50,1,0,8,109,166,85,4,0,5,10,15,11,0,0,1,1,0,0,0,0,0,0,0,0,0,0,0,0,1,1,0,0]},{\"GameId\":22,\"Score\":[26,148,115,16,0,0,36,179,183,48,1,0,14,58,68,15,4,0,2,2,2,1,0,0,0,1,1,0,0,0,0,0,0,0,1,0]},{\"GameId\":23,\"Score\":[34,150,91,13,1,1,23,230,210,74,3,0,4,13,46,21,3,0,0,2,1,2,0,0,0,1,0,0,0,0,0,0,0,0,0,0]},{\"GameId\":24,\"Score\":[25,16,10,1,0,0,198,101,31,4,0,0,210,148,39,3,0,0,51,61,10,0,0,0,2,5,1,2,0,0,0,2,0,0,0,0]},{\"GameId\":25,\"Score\":[5,62,144,26,1,0,9,29,217,114,9,2,6,23,25,28,4,0,0,1,5,0,0,0,0,1,0,0,0,0,0,0,0,0,0,0]},{\"GameId\":26,\"Score\":[2,4,0,0,0,0,41,9,6,1,0,0,235,94,6,0,0,0,99,151,18,1,0,0,16,18,3,0,0,0,4,1,0,0,0,0]},{\"GameId\":27,\"Score\":[15,14,1,1,1,0,67,50,25,2,0,0,119,173,23,10,0,0,36,119,29,1,0,1,4,9,6,0,1,0,0,0,2,0,1,0]},{\"GameId\":28,\"Score\":[31,25,9,0,0,0,138,102,39,5,0,0,82,191,28,1,0,0,5,31,15,1,0,0,0,2,1,2,1,0,1,0,1,0,0,0]},{\"GameId\":29,\"Score\":[12,73,44,4,2,0,30,61,166,32,0,0,23,87,64,68,3,0,2,5,17,2,1,1,0,0,0,0,0,0,0,0,0,0,1,0]},{\"GameId\":30,\"Score\":[12,68,13,1,2,0,69,56,91,15,0,0,65,152,38,35,0,0,14,36,20,5,1,0,0,2,1,1,0,0,0,0,0,0,0,0]},{\"GameId\":31,\"Score\":[0,0,0,0,0,0,0,0,0,0,0,0,0,0,0,0,0,0,0,0,0,0,0,0,0,0,0,0,0,0,0,0,0,0,0,0]},{\"GameId\":32,\"Score\":[11,65,39,12,0,0,80,36,150,19,2,0,35,124,17,24,2,1,5,24,21,3,0,0,0,1,1,1,1,2,0,0,0,0,0,0]}] ",null,null,null,"[{\"GameId\":1,\"Score\":[47,50,19,1,0,0,331,156,52,3,0,2,140,172,13,3,0,1,11,11,4,1,1,1,1,3,2,0,0,0,3,0,0,0,0,0]},{\"GameId\":2,\"Score\":[22,55,53,4,0,0,130,190,98,9,0,0,96,205,49,8,0,0,10,40,15,3,1,0,0,8,0,0,0,0,1,0,0,0,1,2]},{\"GameId\":3,\"Score\":[76,187,187,27,4,1,57,118,110,52,1,0,16,32,29,5,1,0,5,7,3,0,1,1,1,1,0,1,0,1,0,1,0,0,0,0]},{\"GameId\":4,\"Score\":[81,112,100,14,0,0,78,250,122,35,0,0,17,51,41,8,0,0,1,9,2,0,0,0,0,1,2,0,1,0,0,0,0,0,0,1]},{\"GameId\":5,\"Score\":[59,132,189,67,6,2,60,122,121,61,7,0,22,28,23,8,0,1,1,5,2,0,0,0,1,1,1,1,0,0,1,3,0,0,1,1]},{\"GameId\":6,\"Score\":[78,77,42,2,0,0,111,236,88,20,1,1,49,104,65,6,0,0,15,21,3,0,0,0,1,0,3,0,0,0,0,0,1,0,0,2]},{\"GameId\":7,\"Score\":[9,4,3,1,0,1,60,31,8,0,0,0,299,142,17,4,0,0,120,187,15,1,1,0,19,19,2,0,1,0,3,1,1,0,0,0]},{\"GameId\":8,\"Score\":[15,15,2,0,0,0,72,106,31,7,0,0,106,299,91,9,0,0,14,106,55,7,1,0,3,5,4,0,0,1,0,0,0,0,0,0]},{\"GameId\":9,\"Score\":[29,183,187,41,2,4,36,98,181,56,7,1,6,28,28,8,4,0,0,3,1,0,0,0,0,0,0,0,0,1,0,1,0,0,0,0]},{\"GameId\":10,\"Score\":[13,52,25,1,2,0,25,198,166,28,1,0,11,60,221,54,5,0,0,10,21,6,1,0,0,0,1,1,1,1,0,1,1,0,0,0]},{\"GameId\":11,\"Score\":[27,76,76,13,0,0,32,172,204,78,4,1,11,56,82,37,8,1,0,9,9,4,2,0,1,1,2,0,0,0,0,0,0,0,0,0]},{\"GameId\":12,\"Score\":[8,90,260,153,35,3,5,57,109,111,32,2,5,7,7,10,4,0,0,3,2,0,1,0,0,0,0,1,0,0,0,1,0,0,0,1]},{\"GameId\":13,\"Score\":[47,24,1,0,0,0,119,108,23,2,0,0,160,252,37,4,0,0,23,89,30,0,2,0,2,7,2,1,0,1,0,0,0,0,0,0]},{\"GameId\":14,\"Score\":[93,199,111,12,1,0,83,180,122,23,1,0,18,42,29,5,0,0,2,1,3,1,0,0,1,0,1,0,0,0,0,0,0,1,0,0]},{\"GameId\":15,\"Score\":[54,42,8,0,0,0,178,220,40,4,0,1,65,182,42,6,0,1,13,27,7,0,0,0,0,2,0,0,0,1,0,0,0,0,0,0]},{\"GameId\":16,\"Score\":[0,3,0,0,0,0,77,14,5,1,0,0,282,63,4,2,0,0,233,105,2,0,0,0,56,32,1,0,0,1,8,1,0,0,0,0]},{\"GameId\":17,\"Score\":[16,105,191,65,17,2,7,77,224,117,14,1,1,5,22,19,1,0,0,0,2,0,0,0,0,0,0,0,0,0,0,0,0,2,0,0]},{\"GameId\":18,\"Score\":[40,24,1,0,0,0,232,111,17,1,0,0,204,143,30,1,0,0,37,30,11,0,0,0,2,2,0,1,0,0,0,1,1,0,0,0]},{\"GameId\":19,\"Score\":[38,24,11,0,0,0,136,156,46,3,2,0,135,269,45,3,2,0,5,34,10,2,1,0,0,2,2,0,0,0,1,0,0,0,0,1]},{\"GameId\":20,\"Score\":[59,132,89,12,1,0,89,251,123,28,2,0,32,62,26,7,0,0,2,4,4,0,0,0,0,1,0,0,0,0,0,0,1,0,0,1]},{\"GameId\":21,\"Score\":[24,202,219,48,1,0,8,104,159,82,4,0,5,10,15,11,0,0,1,1,0,0,0,0,0,0,0,0,0,0,0,0,1,1,0,0]},{\"GameId\":22,\"Score\":[26,146,111,15,0,0,35,172,179,48,1,0,14,56,64,14,4,0,2,2,2,1,0,0,0,1,1,0,0,0,0,0,0,0,1,0]},{\"GameId\":23,\"Score\":[33,148,90,13,1,1,23,222,204,68,3,0,4,14,46,20,2,0,0,1,1,2,0,0,0,1,0,0,0,0,0,0,0,0,0,0]},{\"GameId\":24,\"Score\":[25,15,9,1,0,0,191,103,30,4,0,0,201,143,39,2,0,0,50,60,9,0,0,0,2,5,1,2,0,0,0,2,0,0,0,0]},{\"GameId\":25,\"Score\":[5,59,144,26,1,0,8,29,205,114,9,2,6,21,24,27,4,0,0,1,5,0,0,0,0,1,0,0,0,0,0,0,0,0,0,0]},{\"GameId\":26,\"Score\":[2,4,0,0,0,0,40,9,6,1,0,0,225,92,6,0,0,0,96,147,17,1,0,0,17,18,3,0,0,0,4,1,0,0,0,0]},{\"GameId\":27,\"Score\":[15,13,1,1,1,0,66,50,24,2,0,0,115,168,21,10,0,0,36,114,29,1,0,1,4,9,6,0,0,0,0,0,2,0,1,0]},{\"GameId\":28,\"Score\":[28,24,9,0,0,0,136,100,39,5,0,0,76,188,28,1,0,0,5,30,14,1,0,0,0,2,1,2,1,0,1,0,0,0,0,0]},{\"GameId\":29,\"Score\":[11,74,41,4,2,0,28,61,163,31,0,0,22,83,61,65,3,0,2,5,17,2,1,1,0,0,0,0,0,0,0,0,0,0,1,0]},{\"GameId\":30,\"Score\":[12,65,13,1,2,0,64,54,89,15,0,0,65,149,38,32,0,0,14,36,18,5,1,0,0,2,1,1,0,0,0,0,0,0,0,0]},{\"GameId\":31,\"Score\":[0,0,0,0,0,0,0,0,0,0,0,0,0,0,0,0,0,0,0,0,0,0,0,0,0,0,0,0,0,0,0,0,0,0,0,0]},{\"GameId\":32,\"Score\":[10,64,39,11,0,0,78,36,143,20,2,0,35,120,16,23,2,1,5,24,19,3,0,0,0,1,1,1,1,2,0,0,0,0,0,0]}] ",null,"[{\"GameId\":1,\"Score\":[47,50,19,1,0,0,329,145,52,3,0,2,140,172,13,3,0,1,11,11,4,1,1,1,1,3,2,0,0,0,3,0,0,0,0,0]},{\"GameId\":2,\"Score\":[22,53,50,4,0,0,124,186,95,8,0,0,93,195,49,8,0,0,10,37,15,3,1,0,0,0,0,0,0,0,1,0,0,0,1,2]},{\"GameId\":3,\"Score\":[72,179,182,27,4,1,55,111,106,51,1,0,15,31,29,4,0,0,5,7,3,0,1,1,1,1,0,1,0,1,0,1,0,0,0,0]},{\"GameId\":4,\"Score\":[81,109,94,14,0,0,76,246,114,33,0,0,15,45,40,7,0,0,1,9,2,0,0,0,0,1,2,0,1,0,0,0,0,0,0,1]},{\"GameId\":5,\"Score\":[58,127,179,65,5,2,60,116,115,59,7,0,22,28,22,8,0,1,1,4,2,0,0,0,1,1,1,1,0,0,1,3,0,0,1,1]},{\"GameId\":6,\"Score\":[77,73,36,2,0,0,107,229,81,18,1,1,47,103,64,6,0,0,15,21,3,0,0,0,1,0,3,0,0,0,0,0,1,0,0,2]},{\"GameId\":7,\"Score\":[9,4,3,1,0,1,58,30,7,0,0,0,286,138,16,4,0,0,119,175,15,1,1,0,18,19,2,0,1,0,3,1,1,0,0,0]},{\"GameId\":8,\"Score\":[15,14,2,0,0,0,71,103,27,7,0,0,103,288,89,9,0,0,13,101,52,7,1,0,2,5,4,0,0,1,0,0,0,0,0,0]},{\"GameId\":9,\"Score\":[28,180,179,40,2,4,35,93,175,55,7,1,5,27,26,8,3,0,0,2,1,0,0,0,0,0,0,0,0,1,0,1,0,0,0,0]},{\"GameId\":10,\"Score\":[13,50,24,1,2,0,25,191,160,27,1,0,10,56,216,51,5,0,0,10,19,6,1,0,0,0,1,1,1,1,0,1,1,0,0,0]},{\"GameId\":11,\"Score\":[28,74,73,13,0,0,31,164,197,73,4,1,11,55,80,36,8,1,0,8,8,4,1,0,1,1,2,0,0,0,0,0,0,0,0,0]},{\"GameId\":12,\"Score\":[8,89,250,150,34,3,5,56,105,103,30,2,4,7,6,10,4,0,0,3,2,0,1,0,0,0,0,1,0,0,0,1,0,0,0,1]},{\"GameId\":13,\"Score\":[46,22,1,0,0,0,117,102,23,2,0,0,150,245,37,4,0,0,22,84,30,0,2,0,2,7,2,1,0,1,0,0,0,0,0,0]},{\"GameId\":14,\"Score\":[89,194,105,12,1,0,77,179,115,22,1,0,17,40,28,5,0,0,2,1,3,1,0,0,1,0,1,0,0,0,0,0,0,1,0,0]},{\"GameId\":15,\"Score\":[52,40,8,0,0,0,170,211,38,3,0,1,64,178,41,6,0,1,13,26,6,0,0,0,0,2,0,0,0,1,0,0,0,0,0,0]},{\"GameId\":16,\"Score\":[0,3,0,0,0,0,75,13,5,1,0,0,276,55,4,2,0,0,228,100,2,0,0,0,54,30,1,0,0,1,7,1,0,0,0,0]},{\"GameId\":17,\"Score\":[16,102,181,63,17,2,7,75,215,114,14,1,1,5,20,18,1,0,0,0,2,0,0,0,0,0,0,0,0,0,0,0,0,2,0,0]},{\"GameId\":18,\"Score\":[37,24,1,0,0,0,229,102,17,1,0,0,196,139,28,1,0,0,36,29,11,0,0,0,2,1,0,1,0,0,0,1,1,0,0,0]},{\"GameId\":19,\"Score\":[38,22,10,0,0,0,132,151,44,3,2,0,134,257,45,1,2,0,5,30,9,2,1,0,0,2,2,0,0,0,1,0,0,0,0,1]},{\"GameId\":20,\"Score\":[58,128,83,11,0,0,88,241,120,24,2,0,31,61,26,7,0,0,2,4,3,0,0,0,0,1,0,0,0,0,0,0,1,0,0,1]},{\"GameId\":21,\"Score\":[24,196,205,47,1,0,8,101,154,79,4,0,5,10,15,11,0,0,1,1,0,0,0,0,0,0,0,0,0,0,0,0,1,1,0,0]},{\"GameId\":22,\"Score\":[25,141,109,15,0,0,34,167,172,47,1,0,14,54,57,13,4,0,2,2,2,1,0,0,0,1,1,0,0,0,0,0,0,0,1,0]},{\"GameId\":23,\"Score\":[33,145,88,13,1,1,20,215,196,64,3,0,4,13,44,20,2,0,0,1,1,0,0,0,0,1,0,0,0,0,0,0,0,0,0,0]},{\"GameId\":24,\"Score\":[25,15,9,1,0,0,181,100,29,3,0,0,193,140,37,2,0,0,50,56,9,0,0,0,2,5,1,2,0,0,0,2,0,0,0,0]},{\"GameId\":25,\"Score\":[5,57,143,26,0,0,7,28,191,113,9,2,5,21,24,25,2,0,0,1,5,0,0,0,0,1,0,0,0,0,0,0,0,0,0,0]},{\"GameId\":26,\"Score\":[2,4,0,0,0,0,34,9,5,1,0,0,218,91,6,0,0,0,93,143,17,1,0,0,15,18,2,0,0,0,4,0,0,0,0,0]},{\"GameId\":27,\"Score\":[15,13,0,1,1,0,65,50,24,2,0,0,112,155,21,10,0,0,35,109,28,1,0,1,4,8,6,0,0,0,0,0,2,0,1,0]},{\"GameId\":28,\"Score\":[27,24,9,0,0,0,133,95,39,5,0,0,72,179,27,1,0,0,4,28,14,1,0,0,0,2,1,1,1,0,1,0,0,0,0,0]},{\"GameId\":29,\"Score\":[11,70,40,4,2,0,25,59,157,30,0,0,22,80,57,65,3,0,2,5,16,2,1,1,0,0,0,0,0,0,0,0,0,0,1,0]},{\"GameId\":30,\"Score\":[12,62,13,1,2,0,59,53,86,14,0,0,62,145,38,27,0,0,14,36,18,5,1,0,0,2,1,1,0,0,0,0,0,0,0,0]},{\"GameId\":31,\"Score\":[0,0,0,0,0,0,0,0,0,0,0,0,0,0,0,0,0,0,0,0,0,0,0,0,0,0,0,0,0,0,0,0,0,0,0,0]},{\"GameId\":32,\"Score\":[10,64,39,11,0,0,75,31,135,19,2,0,33,118,16,22,1,1,5,22,19,3,0,0,0,1,1,1,1,2,0,0,0,0,0,0]}] ","[{\"GameId\":1,\"Score\":[47,51,19,1,0,0,328,142,52,3,0,2,141,171,13,3,0,1,11,10,4,1,1,1,1,3,2,0,0,0,3,0,0,0,0,0]},{\"GameId\":2,\"Score\":[22,53,50,4,0,0,124,187,95,8,0,0,92,195,48,8,0,0,10,37,15,3,1,0,0,0,0,0,0,0,1,0,0,0,1,2]},{\"GameId\":3,\"Score\":[71,179,182,28,4,1,55,110,106,51,1,0,15,31,29,4,0,0,5,7,3,0,1,1,1,1,0,1,0,1,0,1,0,0,0,0]},{\"GameId\":4,\"Score\":[81,109,93,14,0,0,77,245,114,33,0,0,15,45,40,7,0,0,1,9,2,0,0,0,0,1,2,0,1,0,0,0,0,0,0,1]},{\"GameId\":5,\"Score\":[58,127,179,64,5,2,60,116,115,59,7,0,22,28,22,8,0,1,1,4,2,0,0,0,1,1,1,1,0,0,1,3,0,0,1,1]},{\"GameId\":6,\"Score\":[78,73,36,2,0,0,106,229,80,18,1,1,47,103,64,6,0,0,15,21,3,0,0,0,1,0,3,0,0,0,0,0,1,0,0,2]},{\"GameId\":7,\"Score\":[9,4,3,1,0,1,58,29,7,0,0,0,287,139,16,4,0,0,119,174,14,1,1,0,18,19,2,0,1,0,3,1,1,0,0,0]},{\"GameId\":8,\"Score\":[15,14,2,0,0,0,71,102,26,7,0,0,103,288,89,9,0,0,13,102,52,7,1,0,2,5,4,0,0,1,0,0,0,0,0,0]},{\"GameId\":9,\"Score\":[29,180,178,40,2,4,35,93,175,55,7,1,5,26,26,8,3,0,0,2,1,0,0,0,0,0,0,0,0,1,0,1,0,0,0,0]},{\"GameId\":10,\"Score\":[13,50,24,1,2,0,25,191,160,27,1,0,10,56,217,51,4,0,0,10,18,6,1,0,0,0,1,1,1,1,0,1,1,0,0,0]},{\"GameId\":11,\"Score\":[28,74,72,13,0,0,31,164,197,73,4,1,11,55,81,35,8,1,0,8,8,4,1,0,1,1,2,0,0,0,0,0,0,0,0,0]},{\"GameId\":12,\"Score\":[8,88,250,151,34,3,5,56,104,103,30,2,4,7,6,10,4,0,0,3,2,0,1,0,0,0,0,1,0,0,0,1,0,0,0,1]},{\"GameId\":13,\"Score\":[46,22,1,0,0,0,118,100,23,2,0,0,150,245,37,4,0,0,22,84,30,0,2,0,2,7,2,1,0,1,0,0,0,0,0,0]},{\"GameId\":14,\"Score\":[89,193,105,13,1,0,78,178,115,22,1,0,17,39,28,5,0,0,2,1,3,1,0,0,1,0,1,0,0,0,0,0,0,1,0,0]},{\"GameId\":15,\"Score\":[52,40,8,0,0,0,170,210,37,3,0,1,64,179,41,6,0,1,13,26,6,0,0,0,0,2,0,0,0,1,0,0,0,0,0,0]},{\"GameId\":16,\"Score\":[0,3,0,0,0,0,75,13,5,1,0,0,276,55,4,2,0,0,227,100,2,0,0,0,54,30,1,0,0,1,7,1,0,0,0,0]},{\"GameId\":17,\"Score\":[16,102,181,63,17,2,7,75,215,114,14,1,1,5,19,18,1,0,0,0,2,0,0,0,0,0,0,0,0,0,0,0,0,2,0,0]},{\"GameId\":18,\"Score\":[37,24,1,0,0,0,230,101,17,1,0,0,195,139,28,1,0,0,36,29,11,0,0,0,2,1,0,1,0,0,0,1,1,0,0,0]},{\"GameId\":19,\"Score\":[38,22,11,0,0,0,132,151,43,3,2,0,134,258,45,1,2,0,4,30,8,2,1,0,0,2,2,0,0,0,1,0,0,0,0,1]},{\"GameId\":20,\"Score\":[58,128,82,11,0,0,89,239,120,24,2,0,31,61,27,7,0,0,2,4,3,0,0,0,0,1,0,0,0,0,0,0,1,0,0,1]},{\"GameId\":21,\"Score\":[24,197,204,47,1,0,8,101,153,79,4,0,5,10,15,11,0,0,1,1,0,0,0,0,0,0,0,0,0,0,0,0,1,1,0,0]},{\"GameId\":22,\"Score\":[25,141,110,15,0,0,34,167,172,47,1,0,14,53,56,13,4,0,2,2,2,1,0,0,0,1,1,0,0,0,0,0,0,0,1,0]},{\"GameId\":23,\"Score\":[33,145,89,13,1,1,20,215,194,64,3,0,4,13,44,20,2,0,0,1,1,0,0,0,0,1,0,0,0,0,0,0,0,0,0,0]},{\"GameId\":24,\"Score\":[25,15,9,1,0,0,181,99,29,3,0,0,193,140,37,2,0,0,51,56,9,0,0,0,2,4,1,2,0,0,0,2,0,0,0,0]},{\"GameId\":25,\"Score\":[5,57,143,26,0,0,7,28,191,112,9,2,5,21,24,25,2,0,0,1,5,0,0,0,0,1,0,0,0,0,0,0,0,0,0,0]},{\"GameId\":26,\"Score\":[2,4,0,0,0,0,34,9,5,1,0,0,218,91,6,0,0,0,93,142,17,1,0,0,15,18,2,0,0,0,4,0,0,0,0,0]},{\"GameId\":27,\"Score\":[15,13,0,1,1,0,65,49,24,2,0,0,112,155,21,10,0,0,35,109,28,1,0,1,4,8,6,0,0,0,0,0,2,0,1,0]},{\"GameId\":28,\"Score\":[27,24,9,0,0,0,133,95,39,5,0,0,72,179,27,1,0,0,4,27,14,1,0,0,0,2,1,1,1,0,1,0,0,0,0,0]},{\"GameId\":29,\"Score\":[11,70,40,4,2,0,25,59,156,30,0,0,22,80,57,65,3,0,2,5,16,2,1,1,0,0,0,0,0,0,0,0,0,0,1,0]},{\"GameId\":30,\"Score\":[12,62,13,1,2,0,59,53,86,14,0,0,62,145,38,27,0,0,14,36,18,5,0,0,0,2,1,1,0,0,0,0,0,0,0,0]},{\"GameId\":31,\"Score\":[0,0,0,0,0,0,0,0,0,0,0,0,0,0,0,0,0,0,0,0,0,0,0,0,0,0,0,0,0,0,0,0,0,0,0,0]},{\"GameId\":32,\"Score\":[10,64,39,11,0,0,75,31,135,19,2,0,33,118,16,21,1,1,5,22,19,3,0,0,0,1,1,1,1,2,0,0,0,0,0,0]}] ","[{\"GameId\":1,\"Score\":[1,2,0,0,0,0,4,1,1,1,0,0,1,1,0,0,0,0,0,0,0,0,0,0,0,1,0,0,0,0,0,0,0,0,0,0]},{\"GameId\":2,\"Score\":[2,0,2,0,0,0,1,2,0,0,0,0,1,2,1,0,0,0,0,0,0,0,0,0,0,0,0,0,0,0,0,0,0,0,0,0]},{\"GameId\":3,\"Score\":[2,2,2,0,0,0,0,2,0,0,0,0,0,0,1,0,0,0,0,0,0,0,0,0,0,0,0,0,0,0,0,0,0,0,0,0]},{\"GameId\":4,\"Score\":[0,1,0,0,0,0,0,5,1,1,0,0,0,0,0,1,0,0,0,0,0,0,0,0,0,0,0,0,0,0,0,0,0,0,0,0]},{\"GameId\":5,\"Score\":[1,1,2,0,0,0,2,2,0,1,0,0,0,0,0,0,0,0,0,0,0,0,0,0,0,0,0,0,0,0,0,0,0,0,0,0]},{\"GameId\":6,\"Score\":[1,2,0,0,0,0,1,1,1,0,0,0,1,0,2,0,0,0,0,0,0,0,0,0,0,0,0,0,0,0,0,0,0,0,0,0]},{\"GameId\":7,\"Score\":[1,0,0,0,0,0,0,1,0,0,0,0,2,5,0,0,0,0,0,2,0,0,0,0,0,0,0,0,0,0,0,0,0,0,0,0]},{\"GameId\":8,\"Score\":[1,0,0,0,0,0,0,1,1,0,0,0,1,2,3,0,0,0,0,2,0,0,0,0,0,0,0,0,0,0,0,0,0,0,0,0]},{\"GameId\":9,\"Score\":[1,2,2,1,0,0,0,0,1,1,0,0,1,0,0,0,0,0,0,0,0,0,0,0,0,0,0,0,0,0,0,0,0,0,0,0]},{\"GameId\":10,\"Score\":[2,0,1,0,0,0,0,1,4,0,0,0,0,0,1,0,0,0,0,0,0,0,0,0,0,0,0,0,0,0,0,0,0,0,0,0]},{\"GameId\":11,\"Score\":[1,0,0,0,0,0,0,4,0,0,0,0,1,0,3,0,0,0,0,0,0,0,0,0,0,0,0,0,0,0,0,0,0,0,0,0]},{\"GameId\":12,\"Score\":[1,0,2,1,0,0,0,1,1,2,0,0,0,0,0,1,0,0,0,0,0,0,0,0,0,0,0,0,0,0,0,0,0,0,0,0]},{\"GameId\":13,\"Score\":[1,0,0,0,0,0,2,2,0,0,0,0,0,6,0,0,0,0,0,1,1,0,0,0,0,0,0,0,0,0,0,0,0,0,0,0]},{\"GameId\":14,\"Score\":[4,2,0,0,0,0,2,2,1,0,0,0,0,0,0,0,0,0,0,0,0,0,0,0,0,0,0,0,0,0,0,0,0,0,0,0]},{\"GameId\":15,\"Score\":[0,1,0,0,0,0,1,1,0,0,0,0,1,2,2,0,0,0,0,0,0,0,0,0,0,1,0,0,0,0,0,0,0,0,0,0]},{\"GameId\":16,\"Score\":[0,0,0,0,0,0,1,0,0,0,0,0,4,0,0,0,0,0,2,0,0,0,0,0,1,0,0,0,0,0,0,0,0,0,0,0]},{\"GameId\":17,\"Score\":[0,2,2,0,0,0,0,2,0,2,0,0,0,0,0,0,0,0,0,0,0,0,0,0,0,0,0,0,0,0,0,0,0,0,0,0]},{\"GameId\":18,\"Score\":[0,0,0,0,0,0,5,1,0,0,0,0,1,1,0,0,0,0,0,0,0,0,0,0,0,0,0,0,0,0,0,0,0,0,0,0]},{\"GameId\":19,\"Score\":[2,0,0,0,0,0,3,1,1,0,0,0,1,0,2,0,0,0,0,0,0,0,0,0,0,0,0,0,0,0,0,0,0,0,0,0]},{\"GameId\":20,\"Score\":[1,2,1,0,0,0,1,1,1,1,0,0,2,0,0,0,0,0,0,0,0,0,0,0,0,0,0,0,0,0,0,0,0,0,0,0]},{\"GameId\":21,\"Score\":[0,3,2,1,0,0,0,3,0,0,0,0,0,0,0,0,0,0,0,0,0,0,0,0,0,0,0,0,0,0,0,0,0,0,0,0]},{\"GameId\":22,\"Score\":[0,2,0,0,0,0,0,2,2,0,0,0,0,1,1,0,0,0,0,0,0,0,0,0,0,0,0,0,0,0,0,0,0,0,0,0]},{\"GameId\":23,\"Score\":[0,1,0,0,1,0,0,4,2,1,0,0,0,0,0,0,0,0,0,0,0,0,0,0,0,0,0,0,0,0,0,0,0,0,0,0]},{\"GameId\":24,\"Score\":[0,0,0,0,0,0,4,1,0,0,0,0,1,2,0,0,0,0,0,0,0,0,0,0,0,0,0,0,0,0,0,0,0,0,0,0]},{\"GameId\":25,\"Score\":[0,3,0,0,0,0,0,0,2,1,1,0,0,0,0,0,0,0,0,0,0,0,0,0,0,0,0,0,0,0,0,0,0,0,0,0]},{\"GameId\":26,\"Score\":[0,0,0,0,0,0,0,0,0,0,0,0,2,1,0,0,0,0,2,2,0,0,0,0,0,0,0,0,0,0,0,0,0,0,0,0]},{\"GameId\":27,\"Score\":[0,0,0,0,0,0,0,0,0,0,0,0,3,1,0,0,0,0,0,3,0,0,0,0,0,0,0,0,0,0,0,0,0,0,0,0]},{\"GameId\":28,\"Score\":[0,0,0,0,0,0,0,3,1,1,0,0,0,2,0,0,0,0,0,0,0,0,0,0,0,0,0,0,0,0,0,0,0,0,0,0]},{\"GameId\":29,\"Score\":[0,0,0,0,0,0,1,1,1,1,0,0,0,0,1,2,0,0,0,0,0,0,0,0,0,0,0,0,0,0,0,0,0,0,0,0]},{\"GameId\":30,\"Score\":[0,0,0,0,0,0,2,0,0,0,0,0,2,2,0,0,0,0,0,0,0,0,0,0,0,0,0,1,0,0,0,0,0,0,0,0]},{\"GameId\":31,\"Score\":[0,0,0,0,0,0,0,0,0,0,0,0,0,0,0,0,0,0,0,0,0,0,0,0,0,0,0,0,0,0,0,0,0,0,0,0]},{\"GameId\":32,\"Score\":[1,0,0,0,0,0,0,0,2,1,0,0,1,1,0,0,0,0,0,1,0,0,0,0,0,0,0,0,0,0,0,0,0,0,0,0]}] ","[{\"GameId\":1,\"Score\":[1,1,0,0,0,0,1,2,0,0,0,0,1,0,0,0,0,0,0,0,0,0,0,0,0,0,0,0,0,0,0,0,0,0,0,0]},{\"GameId\":2,\"Score\":[0,0,1,0,0,0,1,1,0,0,0,0,1,2,0,0,0,0,0,0,0,0,0,0,0,0,0,0,0,0,0,0,0,0,0,0]},{\"GameId\":3,\"Score\":[0,2,1,0,0,0,0,2,0,0,0,0,0,0,0,0,0,0,0,0,0,0,0,0,0,0,0,0,0,0,0,0,0,0,0,0]},{\"GameId\":4,\"Score\":[0,1,0,0,0,0,0,3,0,0,0,0,0,0,0,1,0,0,0,0,0,0,0,0,0,0,0,0,0,0,0,0,0,0,0,0]},{\"GameId\":5,\"Score\":[0,0,2,0,0,0,2,1,0,0,0,0,0,0,0,0,0,0,0,0,0,0,0,0,0,0,0,0,0,0,0,0,0,0,0,0]},{\"GameId\":6,\"Score\":[0,1,0,0,0,0,1,0,1,0,0,0,0,0,2,0,0,0,0,0,0,0,0,0,0,0,0,0,0,0,0,0,0,0,0,0]},{\"GameId\":7,\"Score\":[1,0,0,0,0,0,0,1,0,0,0,0,2,2,0,0,0,0,0,0,0,0,0,0,0,0,0,0,0,0,0,0,0,0,0,0]},{\"GameId\":8,\"Score\":[1,0,0,0,0,0,0,0,1,0,0,0,0,1,1,0,0,0,0,2,0,0,0,0,0,0,0,0,0,0,0,0,0,0,0,0]},{\"GameId\":9,\"Score\":[1,1,2,0,0,0,0,0,0,0,0,0,1,0,0,0,0,0,0,0,0,0,0,0,0,0,0,0,0,0,0,0,0,0,0,0]},{\"GameId\":10,\"Score\":[1,0,0,0,0,0,0,1,3,0,0,0,0,0,0,0,0,0,0,0,0,0,0,0,0,0,0,0,0,0,0,0,0,0,0,0]},{\"GameId\":11,\"Score\":[1,0,0,0,0,0,0,3,0,0,0,0,0,0,1,0,0,0,0,0,0,0,0,0,0,0,0,0,0,0,0,0,0,0,0,0]},{\"GameId\":12,\"Score\":[1,0,1,1,0,0,0,1,1,0,0,0,0,0,0,0,0,0,0,0,0,0,0,0,0,0,0,0,0,0,0,0,0,0,0,0]},{\"GameId\":13,\"Score\":[1,0,0,0,0,0,1,1,0,0,0,0,0,4,0,0,0,0,0,1,0,0,0,0,0,0,0,0,0,0,0,0,0,0,0,0]},{\"GameId\":14,\"Score\":[2,2,0,0,0,0,1,1,0,0,0,0,0,0,0,0,0,0,0,0,0,0,0,0,0,0,0,0,0,0,0,0,0,0,0,0]},{\"GameId\":15,\"Score\":[0,1,0,0,0,0,1,0,0,0,0,0,0,2,0,0,0,0,0,0,0,0,0,0,0,1,0,0,0,0,0,0,0,0,0,0]},{\"GameId\":16,\"Score\":[0,0,0,0,0,0,0,0,0,0,0,0,3,0,0,0,0,0,1,0,0,0,0,0,0,0,0,0,0,0,0,0,0,0,0,0]},{\"GameId\":17,\"Score\":[0,1,1,0,0,0,0,1,0,1,0,0,0,0,0,0,0,0,0,0,0,0,0,0,0,0,0,0,0,0,0,0,0,0,0,0]},{\"GameId\":18,\"Score\":[0,0,0,0,0,0,2,1,0,0,0,0,1,0,0,0,0,0,0,0,0,0,0,0,0,0,0,0,0,0,0,0,0,0,0,0]},{\"GameId\":19,\"Score\":[1,0,0,0,0,0,2,1,1,0,0,0,0,0,0,0,0,0,0,0,0,0,0,0,0,0,0,0,0,0,0,0,0,0,0,0]},{\"GameId\":20,\"Score\":[0,1,1,0,0,0,1,1,0,0,0,0,1,0,0,0,0,0,0,0,0,0,0,0,0,0,0,0,0,0,0,0,0,0,0,0]},{\"GameId\":21,\"Score\":[0,2,1,1,0,0,0,1,0,0,0,0,0,0,0,0,0,0,0,0,0,0,0,0,0,0,0,0,0,0,0,0,0,0,0,0]},{\"GameId\":22,\"Score\":[0,1,0,0,0,0,0,1,2,0,0,0,0,0,0,0,0,0,0,0,0,0,0,0,0,0,0,0,0,0,0,0,0,0,0,0]},{\"GameId\":23,\"Score\":[0,0,0,0,1,0,0,3,1,0,0,0,0,0,0,0,0,0,0,0,0,0,0,0,0,0,0,0,0,0,0,0,0,0,0,0]},{\"GameId\":24,\"Score\":[0,0,0,0,0,0,2,1,0,0,0,0,1,1,0,0,0,0,0,0,0,0,0,0,0,0,0,0,0,0,0,0,0,0,0,0]},{\"GameId\":25,\"Score\":[0,1,0,0,0,0,0,0,1,1,0,0,0,0,0,0,0,0,0,0,0,0,0,0,0,0,0,0,0,0,0,0,0,0,0,0]},{\"GameId\":26,\"Score\":[0,0,0,0,0,0,0,0,0,0,0,0,0,1,0,0,0,0,1,1,0,0,0,0,0,0,0,0,0,0,0,0,0,0,0,0]},{\"GameId\":27,\"Score\":[0,0,0,0,0,0,0,0,0,0,0,0,2,0,0,0,0,0,0,1,0,0,0,0,0,0,0,0,0,0,0,0,0,0,0,0]},{\"GameId\":28,\"Score\":[0,0,0,0,0,0,0,1,1,0,0,0,0,1,0,0,0,0,0,0,0,0,0,0,0,0,0,0,0,0,0,0,0,0,0,0]},{\"GameId\":29,\"Score\":[0,0,0,0,0,0,1,0,1,0,0,0,0,0,0,1,0,0,0,0,0,0,0,0,0,0,0,0,0,0,0,0,0,0,0,0]},{\"GameId\":30,\"Score\":[0,0,0,0,0,0,1,0,0,0,0,0,1,1,0,0,0,0,0,0,0,0,0,0,0,0,0,0,0,0,0,0,0,0,0,0]},{\"GameId\":31,\"Score\":[0,0,0,0,0,0,0,0,0,0,0,0,0,0,0,0,0,0,0,0,0,0,0,0,0,0,0,0,0,0,0,0,0,0,0,0]},{\"GameId\":32,\"Score\":[1,0,0,0,0,0,0,0,2,1,0,0,0,0,0,0,0,0,0,0,0,0,0,0,0,0,0,0,0,0,0,0,0,0,0,0]}] "]
[null,"{\"success\":6,\"rank\":367,\"total\":2757} ","{\"success\":6,\"rank\":253,\"total\":2685} ","{\"success\":0,\"rank\":2338,\"total\":2338} ","{\"success\":0,\"rank\":2058,\"total\":2058} ","{\"success\":0,\"rank\":2018,\"total\":2018} ","{\"success\":0,\"rank\":2006,\"total\":2006} ","{\"success\":0,\"rank\":1966,\"total\":1966} ","{\"success\":0,\"rank\":1935,\"total\":1935} ",null,"{\"success\":0,\"rank\":1932,\"total\":1932} ","{\"success\":0,\"rank\":1932,\"total\":1932} ",null,null,null,"{\"success\":0,\"rank\":3,\"total\":3} "]